{"text_format":"1","workbook":"xlsx","n_sheets":3,"sheets":["Data","Landing_Page","Main"],"not_rendered":{"charts":3,"images":36,"macros":1,"external_links":0,"defined_names":5,"comments":0,"pivot_tables":0},"unopened":[],"bounds":{"document_bytes":16777216,"sheet_cells":100000,"rows_first":2000,"rows_last":500,"rows_between":2000,"halvings":0,"cell_chars":16384,"cell_head_chars":4096},"cells_cut":0,"cells_raw":0,"read":"whole","date_system":"1900"}

{"sheet":"Data","index":0,"n_rows":922,"n_cols":64,"rows_kept":922,"cut":false,"hidden":true,"merged":[]}
["domain","slice","rank","label","start angle","most deprived","name","Not selected","rank of most deprived in not selected","Domain info","Area selection","LGD_name","PC_name","LGD_code","PC_code","map1","map2","map3","Area dropdown source","map",null,"rank in this domain","Top10",null,null,null,"0-15yrs","16-39yrs","40-64yrs","65+","Total","share of top 100",null,null,0,{"$f":"COUNTA(OFFSET(AJ3,0,0,890,1))","v":72},{"$f":"COUNTA(OFFSET(AK3,0,0,890,1))","v":86},87,65,72,84,174,67,59,75,49,46,58,58,50,45,50,41,54,48,43,50,52,46,49,52,52,54,42]
["Income",45,0.25,{"$f":"A2&\"\n \"&TEXT(C2,\"0%\")","v":"Income\n 25%"},{"$f":"E3+45","v":337.5},{"$f":"INDEX($A$33:$A$922,MATCH(1,OFFSET($D$33,0,MATCH($A2,$E$32:$L$32,0),890,1),0))","v":"95VV08W1"},{"$f":"INDEX($B$33:$B$922,MATCH(1,OFFSET($D$33,0,MATCH($A2,$E$32:$L$32,0),890,1),0))","v":"Creggan"},{"$f":"IF($B$12<=ROW()-1,A3,A2)","v":"Income"},{"$f":"OFFSET(OFFSET($A$15,0,$B$12),MATCH(H2,$A$16:$A$23,0),0)","v":4},"The purpose of the Income Deprivation Domain is to identify the proportion of the population on low income at the small area level.\n\nThe Income Domain consists of one indicator, namely the proportion of the population living in households whose equivalised income is below 60 per cent of the NI median.","Northern Ireland","Antrim and Newtownabbey","Belfast East","N09000001","N06000001",2058,29,19,{"$f":"IF($K$5=1,$K$2,IF($K$5=2,L2,M2))","v":"Northern Ireland"},{"$f":"OFFSET($O2,0,$K$5)","v":2058},null,1,{"$f":"OFFSET($B$32,MATCH(V2,OFFSET($D$33,0,$B$12,890,1),0),0)","v":"East"},null,null,"Northern Ireland",{"$f":"SUM(AA3:AA13)","v":388001},{"$f":"SUM(AB3:AB13)","v":582157},594224,297755,1862137,{"$f":"COUNTIFS($Z$33:$Z$922,Z2,OFFSET($D$33,0,$B$12,890,1),\"<=100\")","v":100},null,null,"Northern Ireland","Antrim and Newtownabbey","Ards and North Down","Armagh City, Banbridge and Craigavon","Mid and East Antrim","Causeway Coast and Glens","Newry, Mourne and Down","Belfast","Lisburn and Castlereagh","Mid Ulster","Derry City and Strabane","Fermanagh and Omagh","Belfast East","Belfast North","Belfast South","Belfast West","East Antrim","East Londonderry","Fermanagh & South Tyrone","Foyle","Lagan Valley","Mid Ulster","Newry & Armagh","North Antrim","North Down","South Antrim","South Down","Strangford","Upper Bann","West Tyrone"]
["Employment",45,0.25,{"$f":"A3&\"\n \"&TEXT(C3,\"0%\")","v":"Employment\n 25%"},292.5,{"$f":"INDEX($A$33:$A$922,MATCH(1,OFFSET($D$33,0,MATCH($A3,$E$32:$L$32,0),890,1),0))","v":"95GG35S2"},{"$f":"INDEX($B$33:$B$922,MATCH(1,OFFSET($D$33,0,MATCH($A3,$E$32:$L$32,0),890,1),0))","v":"New Lodge_2"},"Employment",{"$f":"OFFSET(OFFSET($A$15,0,$B$12),MATCH(H3,$A$16:$A$23,0),0)","v":3},"The purpose of the Employment Deprivation Domain is to identify the proportion of the working age population excluded from work at the small area level.\n\nThe Employment Deprivation Domain consists of one indicator, namely, the proportion of the working age population (i.e. those aged 18-64 for both males and females) in receipt of at least one of some selected benefits. A measure of hidden unemployment (i.e. those who are not in receipt of any of the above selected benefits and have not received income from employment) has also been incorporated into this indicator.\n","Local Government Districts","Ards and North Down","Belfast North","N09000011","N06000002",null,30,20,"Northern Ireland",{"$f":"OFFSET($O3,0,$K$5)","v":0},null,2,{"$f":"OFFSET($B$32,MATCH(V3,OFFSET($D$33,0,$B$12,890,1),0),0)","v":"Water Works_2"},null,null,"Antrim and Newtownabbey",29648,42882,45701,22801,141032,{"$f":"COUNTIFS($D$33:$D$922,Z3,OFFSET($D$33,0,$B$12,890,1),\"<=100\")","v":1},null,null,"Abbey Park","Abbey_1","Ballycrochan_1","Abbey Park","Academy","Aghanloo_1","Annalong_1","Andersonstown_1","Ballinderry_1","Altmore","Altnagelvin_1","Ballinamallard","Ballyhackamore_1","Abbey_1","Ballynafeigh_1","Andersonstown_1","Antiville","Aghanloo_1","Augher","Altnagelvin_1","Ballinderry_1","Altmore","Abbey Park","Academy","Ballycrochan_1","Aldergrove_1","Annalong_1","Ballygowan_1","Aghagallon_1","Artigarvan"]
["Health and Disability",45,0.15,"Health and Disability\n 15%",247.5,"95GG48S2","Whiterock_2","Health and Disability",54,"The purpose of the Health Deprivation and Disability Domain is to identify rates of premature deaths, and proportions of the population’s quality of life impaired by poor health or disability at the small area level.\n\nThe Health Deprivation and Disability Domain consists of nine indicators, including one combined mental health indicator.","Parliamentary Constituencies","Armagh City, Banbridge and Craigavon","Belfast South","N09000002","N06000003",null,2047,21,"Northern Ireland",0,null,3,"Crevagh_2",null,null,"Ards and North Down",29983,43067,54092,32451,159593,{"$f":"COUNTIFS($D$33:$D$922,Z4,OFFSET($D$33,0,$B$12,890,1),\"<=100\")","v":3},null,null,"Abbey_1","Abbey_2","Ballycrochan_2","Aghagallon_1","Ahoghill_1","Aghanloo_2","Annalong_2","Andersonstown_2","Ballinderry_2","Ardboe","Altnagelvin_2","Belcoo and Garrison","Ballyhackamore_2","Abbey_2","Ballynafeigh_2","Andersonstown_2","Ballycarry","Aghanloo_2","Aughnacloy","Altnagelvin_2","Ballinderry_2","Ardboe","Ballybot","Ahoghill_1","Ballycrochan_2","Aldergrove_2","Annalong_2","Ballygowan_2","Aghagallon_2","Ballycolman"]
["Education, Skills & Training",45,0.15,"Education, Skills & Training\n 15%",202.5,"95GG35S3","New Lodge_3","Education, Skills & Training",14,"The purpose of the Education, Skills and Training Deprivation Domain is to identify the prevalence of poor educational outcomes for children and low levels of qualifications for working age adults at the small area level.\n\nThe Education, Skills and Training Deprivation Domain consists of eight indicators.",1,"Belfast","Belfast West","N09000008","N06000004",null,2050,22,"Northern Ireland",0,null,4,"Ardoyne_2",null,null,"Armagh City, Banbridge and Craigavon",46804,65612,66161,31683,210260,8,null,null,"Abbey_2","Aldergrove_1","Ballycrochan_3","Aghagallon_2","Ahoghill_2","Agivey","Ardglass_1","Andersonstown_3","Ballyhanwood_1","Augher","Altnagelvin_3","Belleek and Boa","Ballyhackamore_3","Ardoyne_1","Ballynafeigh_3","Andersonstown_3","Ballyloran","Agivey","Ballinamallard","Altnagelvin_3","Ballymacash_1","Ballymaguigan","Ballymartrim","Ahoghill_2","Ballycrochan_3","Aldergrove_3","Ardglass_1","Ballymaglave_1","Annagh_1","Beragh"]
["Access to Services",45,0.1,"Access to Services\n 10%",157.5,"95ZZ11W1","Plumbridge","Access to Services",559,"The purpose of the Access to Services Domain – formerly known as the Proximity to Services Domain – is to measure the extent to which people have poor physical and online access to key services at the small area level.\n\nThe Access to Services Domain consists of three indicators. The services to be included in the public and private transport travel time indicators includes one addition to the original proposals, i.e. day nursery and crèche.",null,"Causeway Coast and Glens","East Antrim","N09000004","N06000005",null,2051,14,"Northern Ireland",0,null,5,"Strand_1_Derry",null,null,"Mid and East Antrim",26361,39453,46660,25347,137821,3,null,null,"Academy","Aldergrove_2","Ballygowan_1","Annagh_1","Antiville","Armoy_&_Moss-side and Moyarget","Ardglass_2","Ardoyne_1","Ballyhanwood_2","Aughnacloy","Artigarvan","Beragh","Ballyhanwood_1","Ardoyne_2","Beechill_1","Beechmount_1","Blackcave","Atlantic","Ballygawley","Ballynashallog_1","Ballymacash_2","Bellaghy","Bessbrook","Ardeevin","Ballyholme","Balloo","Ardglass_2","Ballymaglave_2","Annagh_2","Camowen"]
["Living Environment",45,0.05,"Living Environment\n 5%",112.5,"95GG12S2","Botanic_2","Living Environment",127,"The purpose of the Living Environment Domain is to identify, at the small area level, the prevalence of shortcomings in the quality of housing, access to suitable housing, and the outdoor physical environment.\n\nThe Living Environment Domain consists of nine indicators, grouped into three sub domains:\n- Housing quality\n- Housing access\n- Outdoor physical environment",null,"Derry City and Strabane","East Londonderry","N09000010","N06000006",null,2052,26,"Northern Ireland",0,null,6,"The Diamond",null,null,"Causeway Coast and Glens",28555,42271,47695,25004,143525,3,null,null,"Aghagallon_1","Aldergrove_3","Ballygowan_2","Annagh_2","Ardeevin","Atlantic","Audley's Acre","Ardoyne_2","Ballymacash_1","Ballygawley","Ballycolman","Boho Cleenish and Letterbreen","Ballyhanwood_2","Ardoyne_3","Beechill_2","Beechmount_2","Blackhead","Ballykelly","Ballysaggart","Ballynashallog_2","Ballymacbrennan_1","Castledawson_1","Callan Bridge","Armoy_&_Moss-side and Moyarget","Ballymaconnell_1","Ballyclare North_1","Audley's Acre","Ballynahinch East","Ballybay","Castlederg"]
["Crime & Disorder",45,0.05,"Crime & Disorder\n 5%",{"$f":"E9+45","v":67.5},"95MM28W1","The Diamond","Crime & Disorder",76,"The purpose of the Crime and Disorder Domain is to identify the rate of crime and disorder at the small area level. \n\nThe Crime and Disorder Domain will consist of six indicators, grouped into two sub domains:\n- Crime\n- Disorder",null,"Fermanagh and Omagh","Fermanagh & South Tyrone","N09000003","N06000007",null,2053,23,"Northern Ireland",0,null,7,"New Lodge_2",null,null,"Newry, Mourne and Down",40187,54738,56313,26578,177816,8,null,null,"Aghagallon_2","Balloo","Ballyholme","Ballybay","Ballee","Ballyhoe and Corkey","Ballybot","Ardoyne_3","Ballymacash_2","Ballymaguigan","Ballynashallog_1","Brookeborough","Ballymacarrett_1","Ballyhenry_1","Beechill_3","Beechmount_3","Bluefield_1","Ballysally_1","Belcoo and Garrison","Beechwood","Ballymacbrennan_2","Castledawson_2","Camlough","Ballee","Ballymaconnell_2","Ballyclare North_2","Ballymote","Ballyrainey","Ballydown_1","Clanabogan"]
["Multiple (MDM)",45,null,{"$f":"A9","v":"Multiple (MDM)"},22.5,"95ZZ06W1","East",null,null,"The indicators from the 7 domains were combined and weighted to provide an overall multiple deprivation measure ranking (MDM) of the 890 SOAs. The weights associated with each of the domains are highlighted below:\n\nIncome (25%)\nEmployment (25%)\nHealth & Disability (15%)\nEducation, Skills & Training (15%)\nAccess to Services (10%)\nLiving Environment (5%)\nCrime & Disorder (5%)",null,"Lisburn and Castlereagh","Foyle","N09000007","N06000008",null,2054,24,"Northern Ireland",0,null,8,"Woodvale_1",null,null,"Belfast",66953,122780,100339,49507,339579,50,null,null,"Aghanloo_1","Ballyclare North_1","Ballymaconnell_1","Ballydown_1","Ballycarry","Ballykelly","Ballymaglave_1","Ballyhackamore_1","Ballymacbrennan_1","Ballysaggart","Ballynashallog_2","Camowen","Ballymacarrett_2","Ballyhenry_2","Blackstaff_1","Clonard_1","Bluefield_2","Ballysally_2","Belleek and Boa","Brandywell","Ballymacoss_1","Coagh","Carrigatuke","Ballyhoe and Corkey","Ballymagee_1","Ballyclare South_1","Ballyward","Ballywalter_1","Ballydown_2","Clare"]
[" ",null,null,null,null,null,null,null,null,null,null,"Mid and East Antrim","Lagan Valley","N09000009","N06000009",null,2055,25,"Northern Ireland",0,null,9,"Ardoyne_3",null,null,"Lisburn and Castlereagh",28181,41796,47095,24109,141181,0,null,null,"Aghanloo_2","Ballyclare North_2","Ballymaconnell_2","Ballydown_2","Ballykeel","Ballylough_&_Bushmills","Ballymaglave_2","Ballyhackamore_2","Ballymacbrennan_2","Bellaghy","Banagher","Castlecoole_1","Ballymacarrett_3","Ballysillan_1","Blackstaff_2","Clonard_2","Boneybefore","Banagher","Benburb","Carn Hill_1","Ballymacoss_2","Coalisland North","Charlemont","Ballykeel","Ballymagee_2","Ballyclare South_2","Bannside","Ballywalter_2","Ballyoran","Coolnagard"]
["domain selection",null,null,"Angle for wheel",null,null,null,null,null,null,null,"Mid Ulster","Mid Ulster","N09000005","N06000010",null,2056,27,"Northern Ireland",0,null,10,"Creggan Central_1",null,null,"Mid Ulster",33531,47550,44161,20147,145389,1,null,null,"Agivey","Ballyclare South_1","Ballymagee_1","Ballymartrim","Ballyloran","Ballysally_1","Ballymote","Ballyhackamore_3","Ballymacoss_1","Benburb","Beechwood","Castlecoole_2","Belmont_1","Ballysillan_2","Botanic_1","Collin Glen_1","Burleigh Hill_1","Castlerock_1","Boho Cleenish and Letterbreen","Carn Hill_2","Ballymacoss_3","Coalisland South","Creggan","Ballylough_&_Bushmills","Bangor Castle","Ballycraigy","Binnian","Bradshaw's Brae_1","Banbridge West","Dergmoney"]
["angle",8,null,{"$f":"OFFSET($E$1,$B$12,0)","v":22.5},null,null,null,null,null,null,null,"Newry, Mourne and Down","Newry & Armagh","N09000006","N06000011",null,2057,28,"Northern Ireland",0,null,null,null,null,null,"Derry City and Strabane",32806,47493,48338,21505,150142,20,null,null,"Ahoghill_1","Ballyclare South_2","Ballymagee_2","Ballyoran","Ballyloughan","Ballysally_2","Ballynahinch East","Ballymacarrett_1","Ballymacoss_2","Caledon","Brandywell","Clanabogan","Belmont_2","Ballysillan_3","Botanic_2","Collin Glen_2","Burleigh Hill_2","Castlerock_2","Brookeborough","Caw","Blaris_1","Coalisland West and Newmills","Crossmaglen","Ballyloughan","Bloomfield_1_NorthDown","Ballyduff_1","Burren and Kilbroney_1","Bradshaw's Brae_2","Bleary_1","Dromore"]
["existing",8,null,null,null,null,null,null,null,null,null,null,"North Antrim",null,"N06000012",null,null,17,"Northern Ireland",0,null,"other domains","how selected SOA ranks",null,null,"Fermanagh and Omagh",24992,34515,37669,18623,115799,3,null,null,"Ahoghill_2","Ballycraigy","Ballyrainey","Banbridge West","Blackcave","Benvardin","Ballyward","Ballymacarrett_2","Ballymacoss_3","Castlecaulfield","Carn Hill_1","Coolnagard","Belmont_3","Bellevue_1","Botanic_3","Collin Glen_3","Carncastle","Central_Coleraine","Caledon","Clondermot_1","Blaris_2","Donaghmore","Daisy Hill_1","Benvardin","Bloomfield_2_NorthDown","Ballyduff_2","Burren and Kilbroney_2","Carrowdore_1","Bleary_2","Drumnakilly"]
[null,null,null,null,null,null,null,null,null,null,null,null,"North Down",null,"N06000013",null,null,2060,"Northern Ireland",0,null,{"$f":"H2","v":"Income"},{"$f":"OFFSET(OFFSET($D$32,0,MATCH(V14,$E$32:$L$32,0)),MATCH($F$27,$B$33:$B$922,0),0)","v":4},null,null,"Belfast East",17889,30252,30582,16182,94905,{"$f":"COUNTIFS($R$33:$R$922,Z14,OFFSET($D$33,0,$B$12,890,1),\"<=100\")","v":5},null,null,"Aldergrove_1","Ballyduff_1","Ballywalter_1","Bannside","Blackhead","Bonamargy and Rathlin_&_Glenshesk","Bessbrook","Ballymacarrett_3","Beechill_1","Castledawson_1","Carn Hill_2","Dergmoney","Bloomfield_1_Belfast","Bellevue_2","Botanic_4","Derryaghy_1","Carnlough","Churchland","Castlecaulfield","Clondermot_2","Derryaghy_3","Draperstown","Daisy Hill_2","Bonamargy and Rathlin_&_Glenshesk","Broadway_1","Ballynure_1","Castlewellan_1","Carrowdore_2","Brownstown_1","Drumquin"]
["ranks for most deprived soa in each domain",{"$f":"A2","v":"Income"},{"$f":"A3","v":"Employment"},{"$f":"A4","v":"Health and Disability"},{"$f":"A5","v":"Education, Skills & Training"},{"$f":"A6","v":"Access to Services"},{"$f":"A7","v":"Living Environment"},{"$f":"A8","v":"Crime & Disorder"},{"$f":"A9","v":"Multiple (MDM)"},"selected rank",null,null,"South Antrim",null,"N06000014",null,null,18,"Northern Ireland",0,null,{"$f":"H3","v":"Employment"},{"$f":"OFFSET(OFFSET($D$32,0,MATCH(V15,$E$32:$L$32,0)),MATCH($F$27,$B$33:$B$922,0),0)","v":3},null,null,"Belfast North",21899,33218,32065,16652,103834,{"$f":"COUNTIFS($R$33:$R$922,Z15,OFFSET($D$33,0,$B$12,890,1),\"<=100\")","v":19},null,null,"Aldergrove_2","Ballyduff_2","Ballywalter_2","Bleary_1","Bluefield_1","Carnany","Binnian","Ballynafeigh_1","Beechill_2","Castledawson_2","Castlederg","Derrygonnelly","Bloomfield_2_Belfast","Bellevue_3","Botanic_5","Derryaghy_2","Central_Larne","Claudy_1","Castlecoole_1","Creggan Central_1","Dromara_1","Dunnamore","Demesne_1","Broughshane_1","Broadway_2","Ballynure_2","Castlewellan_2","Central_Ards","Brownstown_2","Drumragh"]
[{"$f":"A2","v":"Income"},{"$f":"OFFSET(OFFSET($D$32,0,MATCH($A16,$E$32:$L$32,0)),MATCH($F$2,$A$33:$A$922,0),0)","v":1},{"$f":"OFFSET(OFFSET($D$32,0,MATCH($A16,$E$32:$L$32,0)),MATCH($F$3,$A$33:$A$922,0),0)","v":63},{"$f":"OFFSET(OFFSET($D$32,0,MATCH($A16,$E$32:$L$32,0)),MATCH($F$4,$A$33:$A$922,0),0)","v":306},{"$f":"OFFSET(OFFSET($D$32,0,MATCH($A16,$E$32:$L$32,0)),MATCH($F$5,$A$33:$A$922,0),0)","v":162},{"$f":"OFFSET(OFFSET($D$32,0,MATCH($A16,$E$32:$L$32,0)),MATCH($F$6,$A$33:$A$922,0),0)","v":368},{"$f":"OFFSET(OFFSET($D$32,0,MATCH($A16,$E$32:$L$32,0)),MATCH($F$7,$A$33:$A$922,0),0)","v":505},{"$f":"OFFSET(OFFSET($D$32,0,MATCH($A16,$E$32:$L$32,0)),MATCH($F$8,$A$33:$A$922,0),0)","v":11},{"$f":"OFFSET(OFFSET($D$32,0,MATCH($A16,$E$32:$L$32,0)),MATCH($F$9,$A$33:$A$922,0),0)","v":4},{"$f":"OFFSET(OFFSET($D$32,0,MATCH($A16,$E$32:$L$32,0)),MATCH($F$30,$B$33:$B$922,0),0)","v":451},null,null,"South Down",null,"N06000015",null,null,2063,"Northern Ireland",0,null,"Health and Disability",54,null,null,"Belfast South",18670,47733,31960,15703,114066,4,null,null,"Aldergrove_3","Ballyhenry_1","Bangor Castle","Bleary_2","Bluefield_2","Carnmoon_&_Dunseverick","Burren and Kilbroney_1","Ballynafeigh_2","Blaris_1","Clogher","Caw","Derrylin","Bloomfield_3_Belfast","Castleview_1","Cairnshill_1","Dunmurry_1","Clipperstown","Claudy_2","Castlecoole_2","Creggan Central_2","Dromara_2","Glebe_1_Magherafelt","Demesne_2","Broughshane_2","Bryansburn_1","Ballyrobert_1","Cathedral_1","Comber East_1","Church","Dunnamanagh"]
[{"$f":"A3","v":"Employment"},221,1,8,37,393,883,6,3,{"$f":"OFFSET(OFFSET($D$32,0,MATCH($A17,$E$32:$L$32,0)),MATCH($F$30,$B$33:$B$922,0),0)","v":353},null,null,"Strangford",null,"N06000016",null,null,2064,"Northern Ireland",0,null,"Education, Skills & Training",14,null,null,"Belfast West",21702,31913,28060,12770,94445,23,null,null,"Altmore","Ballyhenry_2","Bloomfield_1_NorthDown","Brownstown_1","Boneybefore","Castlerock_1","Burren and Kilbroney_2","Ballynafeigh_3","Blaris_2","Coagh","Clare","Devenish","Carrowreagh_1","Castleview_2","Cairnshill_2","Dunmurry_2","Craigy Hill","Coolessan","Clogher","Creggan South","Dromore North","Glebe_2_Magherafelt","Derrymore_1","Carnany","Bryansburn_2","Ballyrobert_2","Cathedral_2","Comber East_2","Corcrain_1","East"]
["Health and Disability",415,3,1,18,461,811,44,54,315,null,null,"Upper Bann",null,"N06000017",null,null,2065,"Northern Ireland",0,null,"Access to Services",559,null,null,"East Antrim",16749,25697,31264,16306,90016,1,null,null,"Altnagelvin_1","Ballynure_1","Bloomfield_2_NorthDown","Brownstown_2","Broughshane_1","Castlerock_2","Camlough","Ballysillan_1","Cairnshill_1","Coalisland North","Claudy_1","Donagh","Carrowreagh_2","Castleview_3","Carryduff East_1","Falls Park_1","Eden_1","Cross Glebe","Coolhill","Crevagh_1","Dromore South_1","Gortalowry","Derrymore_2","Carnmoon_&_Dunseverick","Churchill_1","Burnthill_1","Clonallan_1","Comber North_1","Corcrain_2","Fairy Water"]
["Education, Skills & Training",391,49,5,1,589,241,152,14,362,null,null,"West Tyrone",null,"N06000018",null,null,2066,"Northern Ireland",0,null,"Living Environment",127,null,null,"East Londonderry",20154,29994,33561,17493,101202,3,null,null,"Altnagelvin_2","Ballynure_2","Bradshaw's Brae_1","Callan Bridge","Broughshane_2","Central_Coleraine","Castlewellan_1","Ballysillan_2","Cairnshill_2","Coalisland South","Claudy_2","Dromore","Cherryvalley_1","Cavehill_1","Carryduff East_2","Falls Park_2","Eden_2","Dundooan_1","Derrygonnelly","Crevagh_2","Dromore South_2","Gulladuff","Derrynoose","Castle Demesne","Churchill_2","Burnthill_2","Clonallan_2","Comber North_2","Court_1","Finn"]
["Access to Services",61,889,731,881,1,687,845,559,442,null,null,null,null,null,null,null,null,null,null,null,"Crime & Disorder",76,null,null,"Fermanagh & South Tyrone",23656,32995,33907,16706,107264,1,null,null,"Altnagelvin_3","Ballyrobert_1","Bradshaw's Brae_2","Carrigatuke","Burleigh Hill_1","Churchland","Castlewellan_2","Ballysillan_3","Carrowreagh_1","Coalisland West and Newmills","Clondermot_1","Drumnakilly","Cherryvalley_2","Cavehill_2","Carryduff West_1","Falls Park_3","Gardenmore","Dundooan_2","Derrylin","Crevagh_3","Drumbo_1","Killycolpy","Downs","Clogh Mills","Clandeboye_1","Carnmoney_1","Crossgar_1","Comber West_1","Court_2","Fintona"]
["Living Environment",159,192,130,107,286,1,42,127,425,"chart for analysis",{"$f":"CHOOSE($J$26,\"1\",\"1\",\"Urban\")","v":"1"},{"$f":"IF(ISNA(L21),NA(),N21/O21)","v":0.2},{"$f":"COUNTIFS(CHOOSE($K$5,$Z$33:$Z$922,$D$33:$D$922,$R$33:$R$922),$B$27,CHOOSE($J$26,$S$33:$S$922,$T$33:$T$922,$M$33:$M$922),L21)","v":178},{"$f":"$B$30","v":890},{"$f":"IF(ISNA(L21),NA(),CHOOSE($J$26,0.2,0.1,0.33))","v":0.2},null,null,null,null,null,null,null,null,null,"Foyle",22613,33177,32919,14057,102766,17,null,null,"Andersonstown_1","Ballyrobert_2","Broadway_1","Charlemont","Burleigh Hill_2","Clogh Mills","Cathedral_1","Beechill_3","Carrowreagh_2","Coolhill","Clondermot_2","Drumquin","Cherryvalley_3","Cavehill_3","Carryduff West_2","Falls_1","Glenaan_&_Glendun","Dungiven","Devenish","Culmore_1","Drumbo_2","Killymoon","Drumalane_1","Craigywarren","Clandeboye_2","Carnmoney_2","Crossgar_2","Comber West_2","Derrytrasna_1","Glenderg"]
["Crime & Disorder",721,51,227,65,834,11,1,76,391,null,{"$f":"CHOOSE($J$26,\"2\",\"2\",\"Rural\")","v":"2"},0.2,178,{"$f":"$B$30","v":890},{"$f":"IF(ISNA(L22),NA(),CHOOSE($J$26,0.2,0.1,0.33))","v":0.2},null,null,null,null,null,null,null,null,null,"Lagan Valley",21729,31408,35121,18453,106711,0,null,null,"Andersonstown_2","Burnthill_1","Broadway_2","Church","Carncastle","Coolessan","Cathedral_2","Beechmount_1","Carryduff East_1","Donaghmore","Creggan Central_1","Drumragh","Cregagh","Chichester Park_1","Finaghy_1","Falls_2","Glenariff","Dunluce","Donagh","Culmore_2","Gransha","Knockcloghrim","Drumalane_2","Cullybackey","Clandeboye_3","Clady","Derryleckagh_1","Derryboy_1","Derrytrasna_2","Gortin"]
["Multiple (MDM)",72,7,23,32,304,457,6,1,424,null,{"$f":"CHOOSE($J$26,\"3\",\"3\",\"Mixed urban/rural\")","v":"3"},0.2,178,890,0.2,null,null,null,null,null,null,null,null,null,"Mid Ulster",23752,33378,31468,14411,103009,1,null,null,"Andersonstown_3","Burnthill_2","Bryansburn_1","Corcrain_1","Carnlough","Cross Glebe","Clonallan_1","Beechmount_2","Carryduff East_2","Draperstown","Creggan Central_2","Erne","Downshire","Chichester Park_2","Finaghy_2","Falls_3","Glenarm","Enagh_1_Limavady","Drumglass","Culmore_3","Harmony Hill","Lecumpher","Drumgullion_1","Dalriada","Conlig_1","Cranfield","Derryleckagh_2","Derryboy_2","Donaghcloney_1","Gortrush_1"]
[null,null,null,null,null,null,null,null,null,null,null,{"$f":"CHOOSE($J$26,\"4\",\"4\",NA())","v":"4"},0.2,178,890,0.2,null,null,null,null,null,null,null,null,null,"Newry & Armagh",27528,37070,36390,17033,118021,8,null,null,"Annagh_1","Carnmoney_1","Bryansburn_2","Corcrain_2","Castle Demesne","Dalriada","Clonallan_2","Beechmount_3","Carryduff West_1","Drumglass","Creggan South","Fairy Water","Dundonald_1","Chichester Park_3","Finaghy_3","Glen Road_1","Glynn","Enagh_2_Limavady","Erne","Culmore_4","Hilden_1","Lissan","Drumgullion_2","Dervock","Conlig_2","Crumlin_1_Antrim","Donaghmore_1","Glen_1","Donaghcloney_2","Gortrush_2"]
["selected area",null,null,null,"SOA selected from top 10",null,null,"Analysis type",null,null,null,{"$f":"CHOOSE($J$26,\"5\",\"5\",NA())","v":"5"},0.2,178,890,0.2,null,null,null,null,null,null,null,null,null,"North Antrim",22441,32751,36718,19633,111543,2,null,null,"Annagh_2","Carnmoney_2","Carrowdore_1","Court_1","Central_Larne","Dervock","Creggan","Bellevue_1","Carryduff West_2","Dunnamore","Crevagh_1","Fintona","Dundonald_2","Cliftonville_1","Galwally","Glen Road_2","Gortalee","Feeny","Fivemiletown","Culmore_5","Hilden_2","Lower Glenshane_1","Fathom","Dunclug","Conlig_3","Crumlin_2_Antrim","Donaghmore_2","Glen_2","Drumgask_1","Killyclogher_1"]
["area",1,null,null,"SOA",1,null,"Analysis DD","Selected",1,null,{"$f":"CHOOSE($J$26,NA(),\"6\",NA())","v":{"$error":"#N/A"}},{"$error":"#N/A"},0,890,{"$error":"#N/A"},null,null,null,null,null,null,null,null,null,"North Down",16990,24313,30587,19186,91076,0,null,null,"Annalong_1","Clady","Carrowdore_2","Court_2","Clipperstown","Dundooan_1","Crossgar_1","Bellevue_2","Derryaghy_3","Fivemiletown","Crevagh_2","Florence Court and Kinawley","Enler","Cliftonville_2","Hillfoot","Glen Road_3","Greenisland","Forest","Florence Court and Kinawley","Ebrington_1","Hillhall_1","Lower Glenshane_2","Forkhill_1","Dunloy","Craigavad","Doagh_1","Donard_1","Gregstown_1","Drumgask_2","Killyclogher_2"]
["Selected",{"$f":"OFFSET($S$1,$B$26,0)","v":"Northern Ireland"},null,null,"SOA",{"$f":"OFFSET($W$1,$F$26,0)","v":"East"},null,"Quintiles","Selected",{"$f":"OFFSET($H$26,$J$26,0)","v":"Quintiles"},null,{"$f":"CHOOSE($J$26,NA(),\"7\",NA())","v":{"$error":"#N/A"}},{"$error":"#N/A"},0,890,{"$error":"#N/A"},null,null,null,null,null,null,null,null,null,"South Antrim",22351,30915,33385,15785,102436,0,null,null,"Annalong_2","Cloughfern_1","Central_Ards","Demesne_1","Craigy Hill","Dundooan_2","Crossgar_2","Bellevue_3","Dromara_1","Glebe_1_Magherafelt","Crevagh_3","Gortin","Gilnahirk","Cliftonville_3","Knockbracken_1","Glencairn_1","Harbour","Garvagh","Irvinestown","Ebrington_2","Hillhall_2","Maghera","Forkhill_2","Dunminning","Crawfordsburn","Doagh_2","Donard_2","Gregstown_2","Drumgor_1","Lisanelly_1"]
["code now",{"$f":"OFFSET($L$1,$B$26,$K$5)","v":"Belfast East"},null,null,null,null,null,"Deciles",null,null,null,{"$f":"CHOOSE($J$26,NA(),\"8\",NA())","v":{"$error":"#N/A"}},{"$error":"#N/A"},0,890,{"$error":"#N/A"},null,null,null,null,null,null,null,null,null,"South Down",25157,33736,35907,17188,111988,1,null,null,"Antiville","Cloughfern_2","Churchill_1","Demesne_2","Craigywarren","Dungiven","Crossmaglen","Belmont_1","Dromara_2","Glebe_2_Magherafelt","Culmore_1","Gortrush_1","Graham's Bridge","Cloughfern_1","Knockbracken_2","Glencairn_2","Island Magee","Glack","Kesh Ederney and Lack_1","Eglinton_1","Hillsborough_1","Moneymore","Hamiltonsbawn_1","Fair Green","Cultra","Drumanaway","Drumaness_1","Gregstown_3","Drumgor_2","Lisanelly_2"]
["map",{"$f":"OFFSET($T$1,$B$26,0)","v":2058},"max soa",{"$f":"MAX($AA$33:$AA$922)","v":5832},"selected SOA",1,null,"Urban/Rural",null,null,null,{"$f":"CHOOSE($J$26,NA(),\"9\",NA())","v":{"$error":"#N/A"}},{"$error":"#N/A"},0,890,{"$error":"#N/A"},null,null,null,null,null,null,null,null,null,"Strangford",17178,25085,31290,17482,91035,3,null,null,"Ardboe","Collinbridge_1","Churchill_2","Derrynoose","Cullybackey","Dunloy","Daisy Hill_1","Belmont_2","Drumbo_1","Gortalowry","Culmore_2","Gortrush_2","Island_1","Cloughfern_2","Malone_1","Glencolin_1","Jordanstown_1","Gresteel_1","Kesh Ederney and Lack_2","Eglinton_2","Hillsborough_2","Newbuildings","Hamiltonsbawn_2","Fairhill","Donaghadee North_1","Farranshane","Drumaness_2","Killinchy_1","Drumnamoe_1","Newtownsaville"]
["no of SOAs",{"$f":"CHOOSE($K$5,890,COUNTIF($D$33:$D$922,$B$27),COUNTIF($R$33:$R$922,$B$27))","v":890},"min soa",{"$f":"MIN($AA$33:$AA$922)","v":381},"selected SOA",{"$f":"OFFSET(OFFSET($AH$2,0,MATCH($B$27,$AI$2:$BL$2,0)),$F$29,0)","v":"Abbey Park"},null,null,null,null,null,{"$f":"CHOOSE($J$26,NA(),\"10\",NA())","v":{"$error":"#N/A"}},{"$error":"#N/A"},0,890,{"$error":"#N/A"},null,null,null,null,null,null,null,null,null,"Upper Bann",27563,40212,39082,18395,125252,7,null,null,"Ardeevin","Collinbridge_2","Clandeboye_1","Derrytrasna_1","Dunclug","Dunluce","Daisy Hill_2","Belmont_3","Drumbo_2","Gulladuff","Culmore_3","Irvinestown","Island_2","Collinbridge_1","Malone_2","Glencolin_2","Jordanstown_2","Gresteel_2","Killyman","Enagh_1_Derry","Knockmore_1","Oaklands","Hockley","Galgorm_1","Donaghadee North_2","Fountain Hill","Dundrum","Killinchy_2","Drumnamoe_2","Newtownstewart"]
["top 100",{"$f":"CHOOSE($K$5,COUNTIFS($Z$33:$Z$922,$B$27,OFFSET($D$33,0,$B$12,890,1),\"<=100\"),COUNTIFS($D$33:$D$922,$B$27,OFFSET($D$33,0,$B$12,890,1),\"<=100\"),COUNTIFS($R$33:$R$922,$B$27,OFFSET($D$33,0,$B$12,890,1),\"<=100\"))","v":100},"ave soa",{"$f":"SUM(AA33:AA922)/$B$30","v":2092.2831460674156},null,null,null,null,null,null,null,null,null,null,null,null,null,null,null,null,null,null,null,null,null,"West Tyrone",19980,28310,29958,14320,92568,5,null,null,"Ardglass_1","Coole","Clandeboye_2","Derrytrasna_2","Dunminning","Enagh_1_Limavady","Derryboy_1","Blackstaff_1","Dundonald_1","Killycolpy","Culmore_4","Kesh Ederney and Lack_1","Knock_1","Collinbridge_2","Malone_3","Glencolin_3","Jordanstown_3","Greystone_Limavady","Killymeal","Enagh_2_Derry","Knockmore_2","Oldtown","Keady","Galgorm_2","Donaghadee South_1","Glenavy_1","Dunmore","Killyleagh","Edenderry","North"]
["SOA CODE","SOA NAME","LGD2014","LGD2014NAME",{"$f":"B15","v":"Income"},"Employment","Health and Disability","Education, Skills & Training","Access to Services","Living Environment","Crime & Disorder","Multiple (MDM)","U/R","X","Y","selected Y","PC_code","PC_name","Quintiles","Deciles","0-15yrs","16-39yrs","40-64yrs","65+","Total","Country","Relevant total",null,null,null,null,0,null,null,"Ardglass_2","Cranfield","Clandeboye_3","Donaghcloney_1","Eden_1","Enagh_2_Limavady","Derryboy_2","Blackstaff_2","Dundonald_2","Killyman","Culmore_5","Kesh Ederney and Lack_2","Knock_2","Coole","Minnowburn","Glencolin_4","Killycrot","Hopefield_1","Lisbellaw","Foyle Springs_1","Lagan Valley_1","Pomeroy","Killeen","Glebe","Donaghadee South_2","Glenavy_2","Katesbridge","Kilmore_1","Edenderry_1","Owenkillew"]
["95AA01S1","Aldergrove_1","N09000001","Antrim and Newtownabbey",790,888,890,254,17,75,874,516,"Rural",315465,379396,{"$f":"IF(B33=$F$27,O33,NA())","v":{"$error":"#N/A"}},"N06000014","South Antrim",{"$f":"LOOKUP(OFFSET($D33,0,$B$12),{0,179,357,535,713;1,2,3,4,5})","v":3},{"$f":"LOOKUP(OFFSET($D33,0,$B$12),{0,90,179,268,357,446,535,624,713,802;1,2,3,4,5,6,7,8,9,10})","v":6},259,647,110,6,1022,"Northern Ireland",{"$f":"CHOOSE($K$5,$Y33,IF($D33=$B$27,$Y33,\"\"),IF($R33=$B$27,$Y33,\"\"))","v":1022},null,null,null,null,null,null,null,"Ardoyne_1","Crumlin_1_Antrim","Comber East_1","Donaghcloney_2","Eden_2","Fairhill","Derryleckagh_1","Bloomfield_1_Belfast","Enler","Killymeal","Dunnamanagh","Killyclogher_1","Knock_3","Crumlin_1_Belfast","Musgrave_1","Highfield_1","Kilwaughter_1","Hopefield_2","Lisnarrick","Foyle Springs_2","Lagan Valley_2","Sandholes","Killylea","Glenravel","Dufferin","Greystone_Antrim","Kilkeel Central_1","Kilmore_2","Edenderry_2","Plumbridge"]
["95AA01S2","Aldergrove_2","N09000001","Antrim and Newtownabbey",737,740,719,749,158,761,863,749,"Mixed urban/rural",313443,377976,{"$f":"IF(B34=$F$27,O34,NA())","v":{"$error":"#N/A"}},"N06000014","South Antrim",{"$f":"LOOKUP(OFFSET($D34,0,$B$12),{0,179,357,535,713;1,2,3,4,5})","v":5},{"$f":"LOOKUP(OFFSET($D34,0,$B$12),{0,90,179,268,357,446,535,624,713,802;1,2,3,4,5,6,7,8,9,10})","v":9},550,551,745,279,2125,"Northern Ireland",{"$f":"CHOOSE($K$5,$Y34,IF($D34=$B$27,$Y34,\"\"),IF($R34=$B$27,$Y34,\"\"))","v":2125},null,null,null,null,null,null,null,"Ardoyne_2","Crumlin_2_Antrim","Comber East_2","Downs","Fair Green","Feeny","Derryleckagh_2","Bloomfield_2_Belfast","Galwally","Killymoon","East","Killyclogher_2","Lisnasharragh","Crumlin_2_Belfast","Musgrave_2","Highfield_2","Kilwaughter_2","Kilrea","Lisnaskea","Holly Mount_1","Lambeg_1","Stewartstown","Laurelvale","Glentaisie_&_Kinbane","Groomsport","Hawthorne","Kilkeel Central_2","Kircubbin_1","Fort","Sion Mills"]
["95AA01S3","Aldergrove_3","N09000001","Antrim and Newtownabbey",573,661,718,690,150,419,748,658,"Mixed urban/rural",317361,383518,{"$error":"#N/A"},"N06000014","South Antrim",{"$f":"LOOKUP(OFFSET($D35,0,$B$12),{0,179,357,535,713;1,2,3,4,5})","v":4},{"$f":"LOOKUP(OFFSET($D35,0,$B$12),{0,90,179,268,357,446,535,624,713,802;1,2,3,4,5,6,7,8,9,10})","v":8},347,510,537,218,1611,"Northern Ireland",1611,null,null,null,null,null,null,null,"Ardoyne_3","Doagh_1","Comber North_1","Dromore North","Galgorm_1","Forest","Derrymore_1","Bloomfield_3_Belfast","Glenavy_1","Knockcloghrim","Ebrington_1","Lisanelly_1","Lower Braniel","Dunanney","Musgrave_3","Highfield_3","Knockagh","Knocklynn_1","Maguiresbridge","Holly Mount_2","Lambeg_2","Swatragh_1","Loughgall","Glenwhirry","Harbour_1","Mallusk_1","Kilkeel South_1","Kircubbin_2","Gilford","Sixmilecross"]
["95AA02W1","Balloo","N09000001","Antrim and Newtownabbey",734,337,245,252,519,655,149,439,"Urban",314689,385946,{"$error":"#N/A"},"N06000014","South Antrim",{"$f":"LOOKUP(OFFSET($D36,0,$B$12),{0,179,357,535,713;1,2,3,4,5})","v":3},{"$f":"LOOKUP(OFFSET($D36,0,$B$12),{0,90,179,268,357,446,535,624,713,802;1,2,3,4,5,6,7,8,9,10})","v":5},245,487,618,389,1739,"Northern Ireland",1739,null,null,null,null,null,null,null,"Armoy_&_Moss-side and Moyarget","Doagh_2","Comber North_2","Dromore South_1","Galgorm_2","Garvagh","Derrymore_2","Botanic_1","Glenavy_2","Lecumpher","Ebrington_2","Lisanelly_2","Orangefield_1","Duncairn_1","Newtownbreda","Kilwee_1","Love Lane","Knocklynn_2","Moy","Kilfennan_1","Lisnagarvey","Swatragh_2","Markethill","Grange","Harbour_2","Mallusk_2","Kilkeel South_2","Lisbane_1","Kernan_1","Slievekirk"]
["95AA03W1","Ballycraigy","N09000001","Antrim and Newtownabbey",313,255,166,251,366,728,166,259,"Urban",317108,385822,{"$error":"#N/A"},"N06000014","South Antrim",{"$f":"LOOKUP(OFFSET($D37,0,$B$12),{0,179,357,535,713;1,2,3,4,5})","v":2},{"$f":"LOOKUP(OFFSET($D37,0,$B$12),{0,90,179,268,357,446,535,624,713,802;1,2,3,4,5,6,7,8,9,10})","v":3},381,585,580,314,1860,"Northern Ireland",1860,null,null,null,null,null,null,null,"Artigarvan","Drumanaway","Comber West_1","Dromore South_2","Gardenmore","Glack","Donaghmore_1","Botanic_2","Graham's Bridge","Lissan","Eglinton_1","Lisbellaw","Orangefield_2","Duncairn_2","Ravenhill_1","Kilwee_2","Milebush","Macosquin","Moygashel","Kilfennan_2","Maghaberry_1","The Loop","Milford","Harryville","Holywood Demesne","Mallusk_3","Killough_1","Lisbane_2","Kernan_2","South_1"]
["95AA04W1","Clady","N09000001","Antrim and Newtownabbey",446,734,777,719,82,396,547,594,"Mixed urban/rural",321170,379003,{"$error":"#N/A"},"N06000014","South Antrim",{"$f":"LOOKUP(OFFSET($D38,0,$B$12),{0,179,357,535,713;1,2,3,4,5})","v":4},{"$f":"LOOKUP(OFFSET($D38,0,$B$12),{0,90,179,268,357,446,535,624,713,802;1,2,3,4,5,6,7,8,9,10})","v":7},674,897,1215,449,3235,"Northern Ireland",3235,null,null,null,null,null,null,null,"Atlantic","Dunanney","Comber West_2","Drumgask_1","Glenarm","Glebe","Donaghmore_2","Botanic_3","Harmony Hill","Lower Glenshane_1","Eglinton_2","Lisnarrick","Orangefield_3","Fortwilliam_1","Ravenhill_2","Ladybrook_1","Monkstown_1","Magilligan","Mullaghmore","Lisnagelvin_1","Maghaberry_2","Tobermore","Newtownhamilton","Kells_1","Holywood Priory","Massereene_1","Killough_2","Loughries_1","Killycomain","South_2"]
["95AA05W1","Cranfield","N09000001","Antrim and Newtownabbey",514,571,562,774,144,641,754,613,"Mixed urban/rural",306811,388879,{"$error":"#N/A"},"N06000014","South Antrim",{"$f":"LOOKUP(OFFSET($D39,0,$B$12),{0,179,357,535,713;1,2,3,4,5})","v":4},{"$f":"LOOKUP(OFFSET($D39,0,$B$12),{0,90,179,268,357,446,535,624,713,802;1,2,3,4,5,6,7,8,9,10})","v":7},652,786,867,464,2768,"Northern Ireland",2768,null,null,null,null,null,null,null,"Audley's Acre","Farranshane","Conlig_1","Drumgask_2","Glenravel","Glenaan_&_Glendun","Donard_1","Botanic_4","Hilden_1","Lower Glenshane_2","Enagh_1_Derry","Lisnaskea","Stormont_1","Fortwilliam_2","Ravenhill_3","Ladybrook_2","Monkstown_2","Mount Sandel","Newtownbutler","Lisnagelvin_2","Magheralave_1","Town Parks East_1","Observatory","Kells_2","Loughview_1","Massereene_2","Lisnacree","Loughries_2","Knocknashane_1","Strule"]
["95AA06S1","Crumlin_1_Antrim","N09000001","Antrim and Newtownabbey",736,497,336,476,294,857,269,574,"Mixed urban/rural",314761,375601,{"$error":"#N/A"},"N06000014","South Antrim",{"$f":"LOOKUP(OFFSET($D40,0,$B$12),{0,179,357,535,713;1,2,3,4,5})","v":4},{"$f":"LOOKUP(OFFSET($D40,0,$B$12),{0,90,179,268,357,446,535,624,713,802;1,2,3,4,5,6,7,8,9,10})","v":7},440,571,610,247,1868,"Northern Ireland",1868,null,null,null,null,null,null,null,"Augher","Fountain Hill","Conlig_2","Drumgor_1","Glenwhirry","Glenariff","Donard_2","Botanic_5","Hilden_2","Maghera","Enagh_2_Derry","Maguiresbridge","Stormont_2","Fortwilliam_3","Rosetta_1","Ladybrook_3","Northland","Portstewart","Portora","New Buildings_1","Magheralave_2","Town Parks East_2","Poyntz Pass","Killoquin Lower","Loughview_2","Mossley_1","Mayobridge_1","Moneyreagh_1","Knocknashane_2","Termon"]
["95AA06S2","Crumlin_2_Antrim","N09000001","Antrim and Newtownabbey",645,485,398,390,388,866,275,565,"Urban",315258,376079,{"$error":"#N/A"},"N06000014","South Antrim",{"$f":"LOOKUP(OFFSET($D41,0,$B$12),{0,179,357,535,713;1,2,3,4,5})","v":4},{"$f":"LOOKUP(OFFSET($D41,0,$B$12),{0,90,179,268,357,446,535,624,713,802;1,2,3,4,5,6,7,8,9,10})","v":7},697,875,860,256,2689,"Northern Ireland",2689,null,null,null,null,null,null,null,"Aughnacloy","Glebe_1_Newtownabbey","Conlig_3","Drumgor_2","Glynn","Glentaisie_&_Kinbane","Drumalane_1","Castleview_1","Hillhall_1","Moneymore","Finn","Newtownbutler","Stormont_3","Glebe_1_Newtownabbey","Rosetta_2","Poleglass_1","Rostulla_1","Rathbrady","Rosslea","New Buildings_2","Maze_1","Town Parks West","Rich Hill_1","Killoquin Upper","Millisle_1","Mossley_2","Mayobridge_2","Moneyreagh_2","Lawrencetown","Trillick"]
["95AA07W1","Drumanaway","N09000001","Antrim and Newtownabbey",440,585,574,573,201,494,563,569,"Mixed urban/rural",306809,391788,{"$error":"#N/A"},"N06000014","South Antrim",{"$f":"LOOKUP(OFFSET($D42,0,$B$12),{0,179,357,535,713;1,2,3,4,5})","v":4},{"$f":"LOOKUP(OFFSET($D42,0,$B$12),{0,90,179,268,357,446,535,624,713,802;1,2,3,4,5,6,7,8,9,10})","v":7},424,551,794,387,2156,"Northern Ireland",2156,null,null,null,null,null,null,null,"Ballee","Glebe_2_Newtownabbey","Craigavad","Drumnamoe_1","Gortalee","Gresteel_1","Drumalane_2","Castleview_2","Hillhall_2","Moy","Foyle Springs_1","Newtownsaville","Sydenham_1","Glebe_2_Newtownabbey","Rosetta_3","Poleglass_2","Rostulla_2","Ringsend","Rossorry","Pennyburn_1","Maze_2","Tullagh","Rich Hill_2","Knockaholet","Millisle_2","Parkgate","Murlough","Movilla_1","Loughbrickland","Victoria Bridge"]
["95AA08W1","Farranshane","N09000001","Antrim and Newtownabbey",329,158,148,138,300,760,77,178,"Urban",317229,386883,{"$error":"#N/A"},"N06000014","South Antrim",{"$f":"LOOKUP(OFFSET($D43,0,$B$12),{0,179,357,535,713;1,2,3,4,5})","v":1},{"$f":"LOOKUP(OFFSET($D43,0,$B$12),{0,90,179,268,357,446,535,624,713,802;1,2,3,4,5,6,7,8,9,10})","v":2},338,508,524,259,1628,"Northern Ireland",1628,null,null,null,null,null,null,null,"Ballinamallard","Glengormley_1","Crawfordsburn","Drumnamoe_2","Grange","Gresteel_2","Drumaness_1","Castleview_3","Hillsborough_1","Moygashel","Foyle Springs_2","Owenkillew","Sydenham_2","Glengormley_1","Shaftesbury_1","Shankill_1","Sunnylands","Roeside","Tempo","Pennyburn_2","Moira_1","Upperlands","Silver Bridge_1","Knocklayd","Princetown","Randalstown_1","Quoile_1","Movilla_2","Magheralin_1","West_1"]
["95AA09W1","Fountain Hill","N09000001","Antrim and Newtownabbey",370,259,317,215,513,786,240,330,"Urban",315804,386751,{"$error":"#N/A"},"N06000014","South Antrim",{"$f":"LOOKUP(OFFSET($D44,0,$B$12),{0,179,357,535,713;1,2,3,4,5})","v":2},{"$f":"LOOKUP(OFFSET($D44,0,$B$12),{0,90,179,268,357,446,535,624,713,802;1,2,3,4,5,6,7,8,9,10})","v":4},447,655,682,439,2223,"Northern Ireland",2223,null,null,null,null,null,null,null,"Ballinderry_1","Glengormley_2","Cultra","Edenderry","Greenisland","Greystone_Limavady","Drumaness_2","Cavehill_1","Hillsborough_2","Mullaghmore","Glenderg","Portora","Sydenham_3","Glengormley_2","Shaftesbury_2","Shankill_2","Town Parks","Royal Portrush",null,"Rosemount","Moira_2","Valley","Silver Bridge_2","Moat","Rathgael","Randalstown_2","Quoile_2","Movilla_3","Magheralin_2","West_2"]
["95AA10W1","Greystone_Antrim","N09000001","Antrim and Newtownabbey",473,220,252,243,406,827,32,285,"Urban",316626,386256,{"$error":"#N/A"},"N06000014","South Antrim",{"$f":"LOOKUP(OFFSET($D45,0,$B$12),{0,179,357,535,713;1,2,3,4,5})","v":2},{"$f":"LOOKUP(OFFSET($D45,0,$B$12),{0,90,179,268,357,446,535,624,713,802;1,2,3,4,5,6,7,8,9,10})","v":4},355,549,587,372,1864,"Northern Ireland",1864,null,null,null,null,null,null,null,"Ballinderry_2","Greystone_Antrim","Donaghadee North_1","Edenderry_1","Harbour","Hopefield_1","Drumgullion_1","Cavehill_2","Knockbracken_1","Newbuildings","Holly Mount_1","Rosslea","The Mount_1","Hightown","Shaftesbury_3","Twinbrook_1","Victoria_Carrickfergus","Strand_1_Coleraine",null,"Shantallow East","Old Warren","Washing Bay","St Mary's","Newhill","Silverstream","Shilvodan","Rathfriland","Portaferry_1","Mourneview"]
["95AA11S1","Massereene_1","N09000001","Antrim and Newtownabbey",794,630,418,479,571,801,153,670,"Urban",315302,386348,{"$error":"#N/A"},"N06000014","South Antrim",{"$f":"LOOKUP(OFFSET($D46,0,$B$12),{0,179,357,535,713;1,2,3,4,5})","v":4},{"$f":"LOOKUP(OFFSET($D46,0,$B$12),{0,90,179,268,357,446,535,624,713,802;1,2,3,4,5,6,7,8,9,10})","v":8},539,845,902,492,2778,"Northern Ireland",2778,null,null,null,null,null,null,null,"Balloo","Hawthorne","Donaghadee North_2","Edenderry_2","Harryville","Hopefield_2","Drumgullion_2","Cavehill_3","Knockbracken_2","Oaklands","Holly Mount_2","Rossorry","The Mount_2","Legoniel_1","Stranmillis_1","Twinbrook_2","Whitehead","Strand_2_Coleraine",null,"Shantallow West_1","Quilly",null,"St Patrick's_1","Park","Springhill_1","Springfarm_1","Rostrevor","Portaferry_2","Parklake"]
["95AA11S2","Massereene_2","N09000001","Antrim and Newtownabbey",833,815,668,596,463,797,421,801,"Urban",314361,388310,{"$error":"#N/A"},"N06000014","South Antrim",{"$f":"LOOKUP(OFFSET($D47,0,$B$12),{0,179,357,535,713;1,2,3,4,5})","v":5},{"$f":"LOOKUP(OFFSET($D47,0,$B$12),{0,90,179,268,357,446,535,624,713,802;1,2,3,4,5,6,7,8,9,10})","v":9},669,854,872,261,2656,"Northern Ireland",2656,null,null,null,null,null,null,null,"Ballybay","Hightown","Donaghadee South_1","Fort","Island Magee","Killoquin Lower","Dundrum","Cherryvalley_1","Knockmore_1","Oldtown","Kilfennan_1","Sixmilecross","Tullycarnet","Legoniel_2","Stranmillis_2","Upper Springfield_1","Woodburn","The Cuts_1",null,"Shantallow West_2","Seymour Hill",null,"St Patrick's_2","Portglenone_1","Springhill_2","Springfarm_2","Seaforde","Portavogie_1","Seapatrick"]
["95AA12W1","Parkgate","N09000001","Antrim and Newtownabbey",593,829,856,808,84,719,660,706,"Rural",321485,390859,{"$error":"#N/A"},"N06000014","South Antrim",{"$f":"LOOKUP(OFFSET($D48,0,$B$12),{0,179,357,535,713;1,2,3,4,5})","v":4},{"$f":"LOOKUP(OFFSET($D48,0,$B$12),{0,90,179,268,357,446,535,624,713,802;1,2,3,4,5,6,7,8,9,10})","v":8},525,684,1164,466,2839,"Northern Ireland",2839,null,null,null,null,null,null,null,"Ballybot","Jordanstown_1","Donaghadee South_2","Gilford","Kells_1","Killoquin Upper","Dunmore","Cherryvalley_2","Knockmore_2","Pomeroy","Kilfennan_2","Strule","Upper Braniel","Legoniel_3","Stranmillis_3","Upper Springfield_2",null,"The Cuts_2",null,"Shantallow West_3","Tonagh",null,"Tandragee","Portglenone_2","Whitehill","Steeple","Seaview_1","Portavogie_2","Taghnevan"]
["95AA13S1","Randalstown_1","N09000001","Antrim and Newtownabbey",783,579,522,514,312,370,341,643,"Mixed urban/rural",309415,389831,{"$error":"#N/A"},"N06000014","South Antrim",{"$f":"LOOKUP(OFFSET($D49,0,$B$12),{0,179,357,535,713;1,2,3,4,5})","v":4},{"$f":"LOOKUP(OFFSET($D49,0,$B$12),{0,90,179,268,357,446,535,624,713,802;1,2,3,4,5,6,7,8,9,10})","v":8},402,575,617,256,1851,"Northern Ireland",1851,null,null,null,null,null,null,null,"Ballycarry","Jordanstown_2","Dufferin","Gransha","Kells_2","Kilrea","Fathom","Cherryvalley_3","Lagan Valley_1","Sandholes","Lisnagelvin_1","Tempo",null,"New Lodge_1","Stranmillis_4","Upper Springfield_3",null,"The Highlands",null,"Shantallow West_4","Wallace Park_1",null,"The Mall","Route",null,"Stiles","Seaview_2","Saintfield_1","Tavanagh"]
["95AA13S2","Randalstown_2","N09000001","Antrim and Newtownabbey",755,548,433,524,487,759,442,676,"Urban",308799,390460,{"$error":"#N/A"},"N06000014","South Antrim",{"$f":"LOOKUP(OFFSET($D50,0,$B$12),{0,179,357,535,713;1,2,3,4,5})","v":4},{"$f":"LOOKUP(OFFSET($D50,0,$B$12),{0,90,179,268,357,446,535,624,713,802;1,2,3,4,5,6,7,8,9,10})","v":8},333,458,503,236,1530,"Northern Ireland",1530,null,null,null,null,null,null,null,"Ballyclare North_1","Jordanstown_3","Glen_1","Hamiltonsbawn_1","Killycrot","Knockaholet","Forkhill_1","Chichester Park_1","Lagan Valley_2","Stewartstown","Lisnagelvin_2","Termon",null,"New Lodge_2","Upper Malone_1","Whiterock_1",null,"University",null,"Springtown_1","Wallace Park_2",null,"Tullyhappy","Seacon",null,"Templepatrick","Shimna","Saintfield_2","The Birches_1"]
["95AA14W1","Shilvodan","N09000001","Antrim and Newtownabbey",656,761,754,739,19,407,836,604,"Rural",313052,392755,{"$error":"#N/A"},"N06000014","South Antrim",{"$f":"LOOKUP(OFFSET($D51,0,$B$12),{0,179,357,535,713;1,2,3,4,5})","v":4},{"$f":"LOOKUP(OFFSET($D51,0,$B$12),{0,90,179,268,357,446,535,624,713,802;1,2,3,4,5,6,7,8,9,10})","v":7},539,620,858,428,2445,"Northern Ireland",2445,null,null,null,null,null,null,null,"Ballyclare North_2","Mallusk_1","Glen_2","Hamiltonsbawn_2","Kilwaughter_1","Knocklayd","Forkhill_2","Chichester Park_2","Lambeg_1","Swatragh_1","New Buildings_1","Trillick",null,"New Lodge_3","Upper Malone_2","Whiterock_2",null,"Upper Glenshane",null,"Springtown_2",null,null,"Windsor Hill_1","Slemish",null,"Toome","Spelga","Scrabo_1","The Birches_2"]
["95AA15S1","Springfarm_1","N09000001","Antrim and Newtownabbey",641,652,441,370,436,877,246,623,"Urban",315232,387983,{"$error":"#N/A"},"N06000014","South Antrim",{"$f":"LOOKUP(OFFSET($D52,0,$B$12),{0,179,357,535,713;1,2,3,4,5})","v":4},{"$f":"LOOKUP(OFFSET($D52,0,$B$12),{0,90,179,268,357,446,535,624,713,802;1,2,3,4,5,6,7,8,9,10})","v":7},757,1123,818,302,2999,"Northern Ireland",2999,null,null,null,null,null,null,null,"Ballyclare South_1","Mallusk_2","Gregstown_1","Hockley","Kilwaughter_2","Knocklynn_1","Kilkeel Central_1","Chichester Park_3","Lambeg_2","Swatragh_2","New Buildings_2",null,null,"Valley_1","Upper Malone_3","Whiterock_3",null,"Waterside",null,"Strand_1_Derry",null,null,"Windsor Hill_2","Stranocum",null,null,"Strangford","Scrabo_2","The Cut"]
["95AA15S2","Springfarm_2","N09000001","Antrim and Newtownabbey",390,305,242,89,325,418,231,247,"Urban",314811,388858,{"$error":"#N/A"},"N06000014","South Antrim",{"$f":"LOOKUP(OFFSET($D53,0,$B$12),{0,179,357,535,713;1,2,3,4,5})","v":2},{"$f":"LOOKUP(OFFSET($D53,0,$B$12),{0,90,179,268,357,446,535,624,713,802;1,2,3,4,5,6,7,8,9,10})","v":3},494,653,452,191,1791,"Northern Ireland",1791,null,null,null,null,null,null,null,"Ballyclare South_2","Mallusk_3","Gregstown_2","Katesbridge","Knockagh","Knocklynn_2","Kilkeel Central_2","Cliftonville_1","Lisnagarvey","The Loop","Newtownstewart",null,null,"Valley_2","Windsor_1",null,null,null,null,"Strand_2_Derry",null,null,null,"Summerfield",null,null,"Tollymore_1","Whitespots_1","Waringstown_1"]
["95AA16W1","Steeple","N09000001","Antrim and Newtownabbey",597,287,179,76,682,748,209,308,"Urban",315880,387578,{"$error":"#N/A"},"N06000014","South Antrim",{"$f":"LOOKUP(OFFSET($D54,0,$B$12),{0,179,357,535,713;1,2,3,4,5})","v":2},{"$f":"LOOKUP(OFFSET($D54,0,$B$12),{0,90,179,268,357,446,535,624,713,802;1,2,3,4,5,6,7,8,9,10})","v":4},376,602,518,309,1805,"Northern Ireland",1805,null,null,null,null,null,null,null,"Ballycolman","Massereene_1","Gregstown_3","Keady","Love Lane","Macosquin","Kilkeel South_1","Cliftonville_2","Maghaberry_1","Tobermore","North",null,null,"Water Works_1","Windsor_2",null,null,null,null,"The Diamond",null,null,null,"The Vow",null,null,"Tollymore_2","Whitespots_2","Waringstown_2"]
["95AA17W1","Stiles","N09000001","Antrim and Newtownabbey",630,325,285,211,548,776,189,420,"Urban",316466,386870,{"$error":"#N/A"},"N06000014","South Antrim",{"$f":"LOOKUP(OFFSET($D55,0,$B$12),{0,179,357,535,713;1,2,3,4,5})","v":3},{"$f":"LOOKUP(OFFSET($D55,0,$B$12),{0,90,179,268,357,446,535,624,713,802;1,2,3,4,5,6,7,8,9,10})","v":5},502,634,665,313,2113,"Northern Ireland",2113,null,null,null,null,null,null,null,"Ballycraigy","Massereene_2","Groomsport","Kernan_1","Milebush","Magilligan","Kilkeel South_2","Cliftonville_3","Maghaberry_2","Town Parks East_1","Pennyburn_1",null,null,"Water Works_2","Windsor_3",null,null,null,null,"Victoria_Derry",null,null,null,null,null,null,null,null,"Woodville_1"]
["95AA18W1","Templepatrick","N09000001","Antrim and Newtownabbey",759,700,797,803,263,340,558,758,"Rural",321981,385278,{"$error":"#N/A"},"N06000014","South Antrim",{"$f":"LOOKUP(OFFSET($D56,0,$B$12),{0,179,357,535,713;1,2,3,4,5})","v":5},{"$f":"LOOKUP(OFFSET($D56,0,$B$12),{0,90,179,268,357,446,535,624,713,802;1,2,3,4,5,6,7,8,9,10})","v":9},377,493,812,714,2396,"Northern Ireland",2396,null,null,null,null,null,null,null,"Ballycrochan_1","Monkstown_1","Harbour_1","Kernan_2","Moat","Mount Sandel","Killough_1","Clonard_1","Magheralave_1","Town Parks East_2","Pennyburn_2",null,null,"Water Works_3","Windsor_4",null,null,null,null,"Westland",null,null,null,null,null,null,null,null,"Woodville_2"]
["95AA19W1","Toome","N09000001","Antrim and Newtownabbey",504,386,445,465,131,214,631,437,"Rural",300380,390049,{"$error":"#N/A"},"N06000014","South Antrim",{"$f":"LOOKUP(OFFSET($D57,0,$B$12),{0,179,357,535,713;1,2,3,4,5})","v":3},{"$f":"LOOKUP(OFFSET($D57,0,$B$12),{0,90,179,268,357,446,535,624,713,802;1,2,3,4,5,6,7,8,9,10})","v":5},671,882,856,334,2742,"Northern Ireland",2742,null,null,null,null,null,null,null,"Ballycrochan_2","Monkstown_2","Harbour_2","Killeen","Northland","Newhill","Killough_2","Clonard_2","Magheralave_2","Town Parks West","Plumbridge",null,null,"Whitehouse","Woodstock_1"]
["95BB01S1","Ballygowan_1","N09000011","Ards and North Down",600,776,825,644,230,710,850,744,"Rural",343392,363207,{"$error":"#N/A"},"N06000016","Strangford",{"$f":"LOOKUP(OFFSET($D58,0,$B$12),{0,179,357,535,713;1,2,3,4,5})","v":5},{"$f":"LOOKUP(OFFSET($D58,0,$B$12),{0,90,179,268,357,446,535,624,713,802;1,2,3,4,5,6,7,8,9,10})","v":9},339,534,599,262,1733,"Northern Ireland",1733,null,null,null,null,null,null,null,"Ballycrochan_3","Mossley_1","Holywood Demesne","Killycomain","Park","Portstewart","Killyleagh","Collin Glen_1","Maze_1","Tullagh","Rosemount",null,null,"Woodvale_1","Woodstock_2"]
["95BB01S2","Ballygowan_2","N09000011","Ards and North Down",655,714,608,635,299,444,637,701,"Rural",342963,363884,{"$error":"#N/A"},"N06000016","Strangford",{"$f":"LOOKUP(OFFSET($D59,0,$B$12),{0,179,357,535,713;1,2,3,4,5})","v":4},{"$f":"LOOKUP(OFFSET($D59,0,$B$12),{0,90,179,268,357,446,535,624,713,802;1,2,3,4,5,6,7,8,9,10})","v":8},393,560,783,270,2006,"Northern Ireland",2006,null,null,null,null,null,null,null,"Ballydown_1","Mossley_2","Holywood Priory","Killylea","Portglenone_1","Rathbrady","Kilmore_1","Collin Glen_2","Maze_2","Upperlands","Shantallow East",null,null,"Woodvale_2","Woodstock_3"]
["95BB02W1","Ballyrainey","N09000011","Ards and North Down",287,180,261,210,370,690,271,240,"Mixed urban/rural",347847,373448,{"$error":"#N/A"},"N06000016","Strangford",{"$f":"LOOKUP(OFFSET($D60,0,$B$12),{0,179,357,535,713;1,2,3,4,5})","v":2},{"$f":"LOOKUP(OFFSET($D60,0,$B$12),{0,90,179,268,357,446,535,624,713,802;1,2,3,4,5,6,7,8,9,10})","v":3},424,680,753,576,2433,"Northern Ireland",2433,null,null,null,null,null,null,null,"Ballydown_2","Parkgate","Killinchy_1","Knocknashane_1","Portglenone_2","Ringsend","Kilmore_2","Collin Glen_3","Moira_1","Valley","Shantallow West_1",null,null,"Woodvale_3","Wynchurch"]
["95BB03S1","Ballywalter_1","N09000011","Ards and North Down",193,206,338,218,220,878,411,223,"Rural",362533,369078,{"$error":"#N/A"},"N06000016","Strangford",{"$f":"LOOKUP(OFFSET($D61,0,$B$12),{0,179,357,535,713;1,2,3,4,5})","v":2},{"$f":"LOOKUP(OFFSET($D61,0,$B$12),{0,90,179,268,357,446,535,624,713,802;1,2,3,4,5,6,7,8,9,10})","v":3},429,575,623,431,2057,"Northern Ireland",2057,null,null,null,null,null,null,null,"Ballyduff_1","Randalstown_1","Killinchy_2","Knocknashane_2","Slemish","Roeside","Lisnacree","Cregagh","Moira_2","Washing Bay","Shantallow West_2"]
["95BB03S2","Ballywalter_2","N09000011","Ards and North Down",209,466,587,339,187,580,468,374,"Rural",359714,366716,{"$error":"#N/A"},"N06000016","Strangford",{"$f":"LOOKUP(OFFSET($D62,0,$B$12),{0,179,357,535,713;1,2,3,4,5})","v":3},{"$f":"LOOKUP(OFFSET($D62,0,$B$12),{0,90,179,268,357,446,535,624,713,802;1,2,3,4,5,6,7,8,9,10})","v":5},399,501,823,531,2254,"Northern Ireland",2254,null,null,null,null,null,null,null,"Ballyduff_2","Randalstown_2","Kircubbin_1","Laurelvale","Summerfield","Route","Mayobridge_1","Crumlin_1_Belfast","Moneyreagh_1",null,"Shantallow West_3"]
["95BB04S1","Bradshaw's Brae_1","N09000011","Ards and North Down",602,383,406,321,582,293,115,467,"Urban",348060,374324,{"$error":"#N/A"},"N06000016","Strangford",{"$f":"LOOKUP(OFFSET($D63,0,$B$12),{0,179,357,535,713;1,2,3,4,5})","v":3},{"$f":"LOOKUP(OFFSET($D63,0,$B$12),{0,90,179,268,357,446,535,624,713,802;1,2,3,4,5,6,7,8,9,10})","v":6},173,352,499,399,1422,"Northern Ireland",1422,null,null,null,null,null,null,null,"Ballygawley","Rostulla_1","Kircubbin_2","Lawrencetown","Sunnylands","Royal Portrush","Mayobridge_2","Crumlin_2_Belfast","Moneyreagh_2",null,"Shantallow West_4"]
["95BB04S2","Bradshaw's Brae_2","N09000011","Ards and North Down",631,803,810,845,304,144,716,743,"Mixed urban/rural",347257,374896,{"$error":"#N/A"},"N06000016","Strangford",{"$f":"LOOKUP(OFFSET($D64,0,$B$12),{0,179,357,535,713;1,2,3,4,5})","v":5},{"$f":"LOOKUP(OFFSET($D64,0,$B$12),{0,90,179,268,357,446,535,624,713,802;1,2,3,4,5,6,7,8,9,10})","v":9},286,415,596,502,1799,"Northern Ireland",1799,null,null,null,null,null,null,null,"Ballygowan_1","Rostulla_2","Lisbane_1","Loughbrickland","Town Parks","Seacon","Murlough","Derryaghy_1","Newtownbreda",null,"Sion Mills"]
["95BB05S1","Carrowdore_1","N09000011","Ards and North Down",333,573,688,683,120,198,742,506,"Rural",355847,371444,{"$error":"#N/A"},"N06000016","Strangford",{"$f":"LOOKUP(OFFSET($D65,0,$B$12),{0,179,357,535,713;1,2,3,4,5})","v":3},{"$f":"LOOKUP(OFFSET($D65,0,$B$12),{0,90,179,268,357,446,535,624,713,802;1,2,3,4,5,6,7,8,9,10})","v":6},258,374,587,318,1537,"Northern Ireland",1537,null,null,null,null,null,null,null,"Ballygowan_2","Shilvodan","Lisbane_2","Loughgall","Victoria_Carrickfergus","Strand_1_Coleraine","Newtownhamilton","Derryaghy_2","Old Warren",null,"Slievekirk"]
["95BB05S2","Carrowdore_2","N09000011","Ards and North Down",579,446,565,539,152,625,487,548,"Rural",359413,372680,{"$error":"#N/A"},"N06000016","Strangford",{"$f":"LOOKUP(OFFSET($D66,0,$B$12),{0,179,357,535,713;1,2,3,4,5})","v":4},{"$f":"LOOKUP(OFFSET($D66,0,$B$12),{0,90,179,268,357,446,535,624,713,802;1,2,3,4,5,6,7,8,9,10})","v":7},383,513,633,412,1941,"Northern Ireland",1941,null,null,null,null,null,null,null,"Ballyhackamore_1","Springfarm_1","Loughries_1","Magheralin_1","Whitehead","Strand_2_Coleraine","Quoile_1","Downshire","Seymour Hill",null,"South_1"]
["95BB06W1","Central_Ards","N09000011","Ards and North Down",62,148,159,107,770,387,55,99,"Urban",349025,374091,{"$error":"#N/A"},"N06000016","Strangford",{"$f":"LOOKUP(OFFSET($D67,0,$B$12),{0,179,357,535,713;1,2,3,4,5})","v":1},{"$f":"LOOKUP(OFFSET($D67,0,$B$12),{0,90,179,268,357,446,535,624,713,802;1,2,3,4,5,6,7,8,9,10})","v":2},426,1033,864,610,2933,"Northern Ireland",2933,null,null,null,null,null,null,null,"Ballyhackamore_2","Springfarm_2","Loughries_2","Magheralin_2","Woodburn","Stranocum","Quoile_2","Duncairn_1","Tonagh",null,"South_2"]
["95BB07S1","Comber East_1","N09000011","Ards and North Down",260,330,294,271,698,646,121,325,"Urban",346116,369191,{"$error":"#N/A"},"N06000016","Strangford",{"$f":"LOOKUP(OFFSET($D68,0,$B$12),{0,179,357,535,713;1,2,3,4,5})","v":2},{"$f":"LOOKUP(OFFSET($D68,0,$B$12),{0,90,179,268,357,446,535,624,713,802;1,2,3,4,5,6,7,8,9,10})","v":4},297,517,490,427,1732,"Northern Ireland",1732,null,null,null,null,null,null,null,"Ballyhackamore_3","Steeple","Loughview_1","Markethill",null,"The Cuts_1","Rostrevor","Duncairn_2","Wallace Park_1",null,"Springtown_1"]
["95BB07S2","Comber East_2","N09000011","Ards and North Down",575,660,626,634,382,534,611,696,"Urban",346886,369514,{"$error":"#N/A"},"N06000016","Strangford",{"$f":"LOOKUP(OFFSET($D69,0,$B$12),{0,179,357,535,713;1,2,3,4,5})","v":4},{"$f":"LOOKUP(OFFSET($D69,0,$B$12),{0,90,179,268,357,446,535,624,713,802;1,2,3,4,5,6,7,8,9,10})","v":8},215,338,453,285,1291,"Northern Ireland",1291,null,null,null,null,null,null,null,"Ballyhanwood_1","Stiles","Loughview_2","Milford",null,"The Cuts_2","Saintfield_1","Dunmurry_1","Wallace Park_2",null,"Springtown_2"]
["95BB08S1","Comber North_1","N09000011","Ards and North Down",688,247,220,59,558,852,263,303,"Urban",346341,369717,{"$error":"#N/A"},"N06000016","Strangford",{"$f":"LOOKUP(OFFSET($D70,0,$B$12),{0,179,357,535,713;1,2,3,4,5})","v":2},{"$f":"LOOKUP(OFFSET($D70,0,$B$12),{0,90,179,268,357,446,535,624,713,802;1,2,3,4,5,6,7,8,9,10})","v":4},279,411,417,284,1391,"Northern Ireland",1391,null,null,null,null,null,null,null,"Ballyhanwood_2","Templepatrick","Millisle_1","Mourneview",null,"The Highlands","Saintfield_2","Dunmurry_2",null,null,"Strand_1_Derry"]
["95BB08S2","Comber North_2","N09000011","Ards and North Down",601,799,759,569,291,642,880,741,"Urban",346587,370015,{"$error":"#N/A"},"N06000016","Strangford",{"$f":"LOOKUP(OFFSET($D71,0,$B$12),{0,179,357,535,713;1,2,3,4,5})","v":5},{"$f":"LOOKUP(OFFSET($D71,0,$B$12),{0,90,179,268,357,446,535,624,713,802;1,2,3,4,5,6,7,8,9,10})","v":9},258,350,434,189,1231,"Northern Ireland",1231,null,null,null,null,null,null,null,"Ballyhenry_1","Toome","Millisle_2","Observatory",null,"The Vow","Seaforde","Falls Park_1",null,null,"Strand_2_Derry"]
["95BB09S1","Comber West_1","N09000011","Ards and North Down",407,783,827,804,387,383,603,704,"Mixed urban/rural",345032,369584,{"$error":"#N/A"},"N06000016","Strangford",{"$f":"LOOKUP(OFFSET($D72,0,$B$12),{0,179,357,535,713;1,2,3,4,5})","v":4},{"$f":"LOOKUP(OFFSET($D72,0,$B$12),{0,90,179,268,357,446,535,624,713,802;1,2,3,4,5,6,7,8,9,10})","v":8},201,310,446,403,1359,"Northern Ireland",1359,null,null,null,null,null,null,null,"Ballyhenry_2","Valley_1","Movilla_1","Parklake",null,"University","Seaview_1","Falls Park_2",null,null,"The Diamond"]
["95BB09S2","Comber West_2","N09000011","Ards and North Down",636,807,828,791,433,376,789,795,"Urban",345007,369113,{"$error":"#N/A"},"N06000016","Strangford",{"$f":"LOOKUP(OFFSET($D73,0,$B$12),{0,179,357,535,713;1,2,3,4,5})","v":5},{"$f":"LOOKUP(OFFSET($D73,0,$B$12),{0,90,179,268,357,446,535,624,713,802;1,2,3,4,5,6,7,8,9,10})","v":9},258,463,620,301,1642,"Northern Ireland",1642,null,null,null,null,null,null,null,"Ballyhoe and Corkey","Valley_2","Movilla_2","Poyntz Pass",null,"Upper Glenshane","Seaview_2","Falls Park_3",null,null,"Victoria Bridge"]
["95BB10S1","Donaghadee North_1","N09000011","Ards and North Down",384,373,486,623,790,447,127,508,"Urban",358805,380025,{"$error":"#N/A"},"N06000013","North Down",{"$f":"LOOKUP(OFFSET($D74,0,$B$12),{0,179,357,535,713;1,2,3,4,5})","v":3},{"$f":"LOOKUP(OFFSET($D74,0,$B$12),{0,90,179,268,357,446,535,624,713,802;1,2,3,4,5,6,7,8,9,10})","v":6},219,379,552,521,1671,"Northern Ireland",1671,null,null,null,null,null,null,null,"Ballyholme","Whitehouse","Movilla_3","Quilly",null,"Waterside","Shimna","Falls_1",null,null,"Victoria_Derry"]
["95BB10S2","Donaghadee North_2","N09000011","Ards and North Down",609,791,853,790,243,389,704,750,"Mixed urban/rural",357135,380626,{"$error":"#N/A"},"N06000013","North Down",{"$f":"LOOKUP(OFFSET($D75,0,$B$12),{0,179,357,535,713;1,2,3,4,5})","v":5},{"$f":"LOOKUP(OFFSET($D75,0,$B$12),{0,90,179,268,357,446,535,624,713,802;1,2,3,4,5,6,7,8,9,10})","v":9},230,412,645,465,1751,"Northern Ireland",1751,null,null,null,null,null,null,null,"Ballykeel",null,"Portaferry_1","Rathfriland",null,null,"Silver Bridge_1","Falls_2",null,null,"West_1"]
["95BB11S1","Donaghadee South_1","N09000011","Ards and North Down",203,161,249,163,338,880,478,199,"Urban",358671,379273,{"$error":"#N/A"},"N06000013","North Down",{"$f":"LOOKUP(OFFSET($D76,0,$B$12),{0,179,357,535,713;1,2,3,4,5})","v":2},{"$f":"LOOKUP(OFFSET($D76,0,$B$12),{0,90,179,268,357,446,535,624,713,802;1,2,3,4,5,6,7,8,9,10})","v":3},275,335,484,265,1359,"Northern Ireland",1359,null,null,null,null,null,null,null,"Ballykelly",null,"Portaferry_2","Rich Hill_1",null,null,"Silver Bridge_2","Falls_3",null,null,"West_2"]
["95BB11S2","Donaghadee South_2","N09000011","Ards and North Down",552,465,466,385,639,683,641,597,"Urban",359149,379353,{"$error":"#N/A"},"N06000013","North Down",{"$f":"LOOKUP(OFFSET($D77,0,$B$12),{0,179,357,535,713;1,2,3,4,5})","v":4},{"$f":"LOOKUP(OFFSET($D77,0,$B$12),{0,90,179,268,357,446,535,624,713,802;1,2,3,4,5,6,7,8,9,10})","v":7},210,304,506,533,1553,"Northern Ireland",1553,null,null,null,null,null,null,null,"Ballyloran",null,"Portavogie_1","Rich Hill_2",null,null,"Spelga","Finaghy_1",null,null,"Westland"]
["95BB12S1","Glen_1","N09000011","Ards and North Down",75,167,173,45,712,240,138,97,"Urban",348718,374789,{"$error":"#N/A"},"N06000016","Strangford",{"$f":"LOOKUP(OFFSET($D78,0,$B$12),{0,179,357,535,713;1,2,3,4,5})","v":1},{"$f":"LOOKUP(OFFSET($D78,0,$B$12),{0,90,179,268,357,446,535,624,713,802;1,2,3,4,5,6,7,8,9,10})","v":2},348,510,400,246,1503,"Northern Ireland",1503,null,null,null,null,null,null,null,"Ballylough_&_Bushmills",null,"Portavogie_2","Seapatrick",null,null,"St Mary's","Finaghy_2"]
["95BB12S2","Glen_2","N09000011","Ards and North Down",455,687,808,654,309,720,452,683,"Urban",348653,375427,{"$error":"#N/A"},"N06000016","Strangford",{"$f":"LOOKUP(OFFSET($D79,0,$B$12),{0,179,357,535,713;1,2,3,4,5})","v":4},{"$f":"LOOKUP(OFFSET($D79,0,$B$12),{0,90,179,268,357,446,535,624,713,802;1,2,3,4,5,6,7,8,9,10})","v":8},257,352,498,314,1422,"Northern Ireland",1422,null,null,null,null,null,null,null,"Ballyloughan",null,"Princetown","Taghnevan",null,null,"St Patrick's_1","Finaghy_3"]
["95BB13S1","Gregstown_1","N09000011","Ards and North Down",150,357,490,401,430,889,326,339,"Urban",350582,373455,{"$error":"#N/A"},"N06000016","Strangford",{"$f":"LOOKUP(OFFSET($D80,0,$B$12),{0,179,357,535,713;1,2,3,4,5})","v":2},{"$f":"LOOKUP(OFFSET($D80,0,$B$12),{0,90,179,268,357,446,535,624,713,802;1,2,3,4,5,6,7,8,9,10})","v":4},276,405,533,163,1378,"Northern Ireland",1378,null,null,null,null,null,null,null,"Ballymacarrett_1",null,"Rathgael","Tandragee",null,null,"St Patrick's_2","Fortwilliam_1"]
["95BB13S2","Gregstown_2","N09000011","Ards and North Down",335,285,325,169,748,703,432,345,"Urban",349851,373897,{"$error":"#N/A"},"N06000016","Strangford",{"$f":"LOOKUP(OFFSET($D81,0,$B$12),{0,179,357,535,713;1,2,3,4,5})","v":2},{"$f":"LOOKUP(OFFSET($D81,0,$B$12),{0,90,179,268,357,446,535,624,713,802;1,2,3,4,5,6,7,8,9,10})","v":4},291,377,504,309,1481,"Northern Ireland",1481,null,null,null,null,null,null,null,"Ballymacarrett_2",null,"Scrabo_1","Tavanagh",null,null,"Strangford","Fortwilliam_2"]
["95BB13S3","Gregstown_3","N09000011","Ards and North Down",662,675,660,469,439,839,711,721,"Urban",350420,374046,{"$error":"#N/A"},"N06000016","Strangford",{"$f":"LOOKUP(OFFSET($D82,0,$B$12),{0,179,357,535,713;1,2,3,4,5})","v":5},{"$f":"LOOKUP(OFFSET($D82,0,$B$12),{0,90,179,268,357,446,535,624,713,802;1,2,3,4,5,6,7,8,9,10})","v":9},314,428,561,187,1490,"Northern Ireland",1490,null,null,null,null,null,null,null,"Ballymacarrett_3",null,"Scrabo_2","The Birches_1",null,null,"Tollymore_1","Fortwilliam_3"]
["95BB14S1","Killinchy_1","N09000011","Ards and North Down",487,825,855,831,35,60,887,564,"Rural",348168,362205,{"$error":"#N/A"},"N06000016","Strangford",{"$f":"LOOKUP(OFFSET($D83,0,$B$12),{0,179,357,535,713;1,2,3,4,5})","v":4},{"$f":"LOOKUP(OFFSET($D83,0,$B$12),{0,90,179,268,357,446,535,624,713,802;1,2,3,4,5,6,7,8,9,10})","v":7},272,403,603,314,1592,"Northern Ireland",1592,null,null,null,null,null,null,null,"Ballymacash_1",null,"Silverstream","The Birches_2",null,null,"Tollymore_2","Gilnahirk"]
["95BB14S2","Killinchy_2","N09000011","Ards and North Down",620,838,861,814,109,438,765,719,"Rural",351001,360932,{"$error":"#N/A"},"N06000016","Strangford",{"$f":"LOOKUP(OFFSET($D84,0,$B$12),{0,179,357,535,713;1,2,3,4,5})","v":5},{"$f":"LOOKUP(OFFSET($D84,0,$B$12),{0,90,179,268,357,446,535,624,713,802;1,2,3,4,5,6,7,8,9,10})","v":9},239,368,570,362,1539,"Northern Ireland",1539,null,null,null,null,null,null,null,"Ballymacash_2",null,"Springhill_1","The Cut",null,null,"Tullyhappy","Glen Road_1"]
["95BB15S1","Kircubbin_1","N09000011","Ards and North Down",318,525,597,505,103,292,759,448,"Rural",361693,356914,{"$error":"#N/A"},"N06000016","Strangford",{"$f":"LOOKUP(OFFSET($D85,0,$B$12),{0,179,357,535,713;1,2,3,4,5})","v":3},{"$f":"LOOKUP(OFFSET($D85,0,$B$12),{0,90,179,268,357,446,535,624,713,802;1,2,3,4,5,6,7,8,9,10})","v":6},483,498,727,358,2065,"Northern Ireland",2065,null,null,null,null,null,null,null,"Ballymacbrennan_1",null,"Springhill_2","The Mall",null,null,"Windsor Hill_1","Glen Road_2"]
["95BB15S2","Kircubbin_2","N09000011","Ards and North Down",168,336,357,255,272,723,200,263,"Rural",360281,362609,{"$error":"#N/A"},"N06000016","Strangford",{"$f":"LOOKUP(OFFSET($D86,0,$B$12),{0,179,357,535,713;1,2,3,4,5})","v":2},{"$f":"LOOKUP(OFFSET($D86,0,$B$12),{0,90,179,268,357,446,535,624,713,802;1,2,3,4,5,6,7,8,9,10})","v":3},276,427,480,249,1432,"Northern Ireland",1432,null,null,null,null,null,null,null,"Ballymacbrennan_2",null,"Whitehill","Waringstown_1",null,null,"Windsor Hill_2","Glen Road_3"]
["95BB16S1","Lisbane_1","N09000011","Ards and North Down",758,839,847,838,151,289,830,770,"Mixed urban/rural",344535,366879,{"$error":"#N/A"},"N06000016","Strangford",{"$f":"LOOKUP(OFFSET($D87,0,$B$12),{0,179,357,535,713;1,2,3,4,5})","v":5},{"$f":"LOOKUP(OFFSET($D87,0,$B$12),{0,90,179,268,357,446,535,624,713,802;1,2,3,4,5,6,7,8,9,10})","v":9},228,395,592,356,1570,"Northern Ireland",1570,null,null,null,null,null,null,null,"Ballymaconnell_1",null,"Whitespots_1","Waringstown_2",null,null,null,"Glencairn_1"]
["95BB16S2","Lisbane_2","N09000011","Ards and North Down",483,861,874,872,212,139,824,698,"Mixed urban/rural",347781,366121,{"$error":"#N/A"},"N06000016","Strangford",{"$f":"LOOKUP(OFFSET($D88,0,$B$12),{0,179,357,535,713;1,2,3,4,5})","v":4},{"$f":"LOOKUP(OFFSET($D88,0,$B$12),{0,90,179,268,357,446,535,624,713,802;1,2,3,4,5,6,7,8,9,10})","v":8},325,377,662,352,1715,"Northern Ireland",1715,null,null,null,null,null,null,null,"Ballymaconnell_2",null,"Whitespots_2","Woodville_1",null,null,null,"Glencairn_2"]
["95BB17S1","Loughries_1","N09000011","Ards and North Down",389,500,362,333,496,787,570,501,"Urban",350962,374581,{"$error":"#N/A"},"N06000016","Strangford",{"$f":"LOOKUP(OFFSET($D89,0,$B$12),{0,179,357,535,713;1,2,3,4,5})","v":3},{"$f":"LOOKUP(OFFSET($D89,0,$B$12),{0,90,179,268,357,446,535,624,713,802;1,2,3,4,5,6,7,8,9,10})","v":6},417,532,611,222,1782,"Northern Ireland",1782,null,null,null,null,null,null,null,"Ballymacoss_1",null,null,"Woodville_2",null,null,null,"Glencolin_1"]
["95BB17S2","Loughries_2","N09000011","Ards and North Down",507,512,524,308,270,594,502,524,"Mixed urban/rural",351744,374664,{"$error":"#N/A"},"N06000016","Strangford",{"$f":"LOOKUP(OFFSET($D90,0,$B$12),{0,179,357,535,713;1,2,3,4,5})","v":3},{"$f":"LOOKUP(OFFSET($D90,0,$B$12),{0,90,179,268,357,446,535,624,713,802;1,2,3,4,5,6,7,8,9,10})","v":6},383,527,598,299,1807,"Northern Ireland",1807,null,null,null,null,null,null,null,"Ballymacoss_2",null,null,null,null,null,null,"Glencolin_2"]
["95BB18S1","Millisle_1","N09000011","Ards and North Down",274,341,275,190,349,843,300,306,"Rural",359479,375850,{"$error":"#N/A"},"N06000013","North Down",{"$f":"LOOKUP(OFFSET($D91,0,$B$12),{0,179,357,535,713;1,2,3,4,5})","v":2},{"$f":"LOOKUP(OFFSET($D91,0,$B$12),{0,90,179,268,357,446,535,624,713,802;1,2,3,4,5,6,7,8,9,10})","v":4},412,567,549,326,1854,"Northern Ireland",1854,null,null,null,null,null,null,null,"Ballymacoss_3",null,null,null,null,null,null,"Glencolin_3"]
["95BB18S2","Millisle_2","N09000011","Ards and North Down",343,747,786,541,236,851,794,635,"Mixed urban/rural",358809,377558,{"$error":"#N/A"},"N06000013","North Down",{"$f":"LOOKUP(OFFSET($D92,0,$B$12),{0,179,357,535,713;1,2,3,4,5})","v":4},{"$f":"LOOKUP(OFFSET($D92,0,$B$12),{0,90,179,268,357,446,535,624,713,802;1,2,3,4,5,6,7,8,9,10})","v":8},596,643,964,482,2685,"Northern Ireland",2685,null,null,null,null,null,null,null,"Ballymagee_1",null,null,null,null,null,null,"Glencolin_4"]
["95BB19S1","Movilla_1","N09000011","Ards and North Down",503,457,504,224,670,605,463,528,"Urban",350063,374524,{"$error":"#N/A"},"N06000016","Strangford",{"$f":"LOOKUP(OFFSET($D93,0,$B$12),{0,179,357,535,713;1,2,3,4,5})","v":3},{"$f":"LOOKUP(OFFSET($D93,0,$B$12),{0,90,179,268,357,446,535,624,713,802;1,2,3,4,5,6,7,8,9,10})","v":6},313,493,589,366,1761,"Northern Ireland",1761,null,null,null,null,null,null,null,"Ballymagee_2",null,null,null,null,null,null,"Highfield_1"]
["95BB19S2","Movilla_2","N09000011","Ards and North Down",497,801,769,775,457,547,718,765,"Urban",350520,375244,{"$error":"#N/A"},"N06000016","Strangford",{"$f":"LOOKUP(OFFSET($D94,0,$B$12),{0,179,357,535,713;1,2,3,4,5})","v":5},{"$f":"LOOKUP(OFFSET($D94,0,$B$12),{0,90,179,268,357,446,535,624,713,802;1,2,3,4,5,6,7,8,9,10})","v":9},422,533,700,194,1848,"Northern Ireland",1848,null,null,null,null,null,null,null,"Ballymaglave_1",null,null,null,null,null,null,"Highfield_2"]
["95BB19S3","Movilla_3","N09000011","Ards and North Down",778,837,686,695,573,550,872,850,"Urban",350567,374695,{"$error":"#N/A"},"N06000016","Strangford",{"$f":"LOOKUP(OFFSET($D95,0,$B$12),{0,179,357,535,713;1,2,3,4,5})","v":5},{"$f":"LOOKUP(OFFSET($D95,0,$B$12),{0,90,179,268,357,446,535,624,713,802;1,2,3,4,5,6,7,8,9,10})","v":10},271,369,524,147,1312,"Northern Ireland",1312,null,null,null,null,null,null,null,"Ballymaglave_2",null,null,null,null,null,null,"Highfield_3"]
["95BB20S1","Portaferry_1","N09000011","Ards and North Down",412,350,419,398,133,631,517,402,"Rural",360907,351434,{"$error":"#N/A"},"N06000016","Strangford",{"$f":"LOOKUP(OFFSET($D96,0,$B$12),{0,179,357,535,713;1,2,3,4,5})","v":3},{"$f":"LOOKUP(OFFSET($D96,0,$B$12),{0,90,179,268,357,446,535,624,713,802;1,2,3,4,5,6,7,8,9,10})","v":5},339,514,642,347,1842,"Northern Ireland",1842,null,null,null,null,null,null,null,"Ballymaguigan",null,null,null,null,null,null,"Hillfoot"]
["95BB20S2","Portaferry_2","N09000011","Ards and North Down",564,103,139,246,290,554,389,219,"Rural",359662,350762,{"$error":"#N/A"},"N06000016","Strangford",{"$f":"LOOKUP(OFFSET($D97,0,$B$12),{0,179,357,535,713;1,2,3,4,5})","v":2},{"$f":"LOOKUP(OFFSET($D97,0,$B$12),{0,90,179,268,357,446,535,624,713,802;1,2,3,4,5,6,7,8,9,10})","v":3},284,417,459,301,1462,"Northern Ireland",1462,null,null,null,null,null,null,null,"Ballymartrim",null,null,null,null,null,null,"Island_1"]
["95BB21S1","Portavogie_1","N09000011","Ards and North Down",226,218,276,208,203,763,414,225,"Rural",365714,360036,{"$f":"IF(B98=$F$27,O98,NA())","v":{"$error":"#N/A"}},"N06000016","Strangford",{"$f":"LOOKUP(OFFSET($D98,0,$B$12),{0,179,357,535,713;1,2,3,4,5})","v":2},{"$f":"LOOKUP(OFFSET($D98,0,$B$12),{0,90,179,268,357,446,535,624,713,802;1,2,3,4,5,6,7,8,9,10})","v":3},525,594,787,439,2344,"Northern Ireland",{"$f":"CHOOSE($K$5,$Y98,IF($D98=$B$27,$Y98,\"\"),IF($R98=$B$27,$Y98,\"\"))","v":2344},null,null,null,null,null,null,null,"Ballymote",null,null,null,null,null,null,"Island_2"]
["95BB21S2","Portavogie_2","N09000011","Ards and North Down",457,445,438,419,157,691,545,472,"Rural",364074,360998,{"$error":"#N/A"},"N06000016","Strangford",{"$f":"LOOKUP(OFFSET($D99,0,$B$12),{0,179,357,535,713;1,2,3,4,5})","v":3},{"$f":"LOOKUP(OFFSET($D99,0,$B$12),{0,90,179,268,357,446,535,624,713,802;1,2,3,4,5,6,7,8,9,10})","v":6},500,655,852,411,2418,"Northern Ireland",2418,null,null,null,null,null,null,null,"Ballynafeigh_1",null,null,null,null,null,null,"Kilwee_1"]
["95BB22S1","Scrabo_1","N09000011","Ards and North Down",229,333,287,116,293,330,307,231,"Urban",348561,372238,{"$error":"#N/A"},"N06000016","Strangford",{"$f":"LOOKUP(OFFSET($D100,0,$B$12),{0,179,357,535,713;1,2,3,4,5})","v":2},{"$f":"LOOKUP(OFFSET($D100,0,$B$12),{0,90,179,268,357,446,535,624,713,802;1,2,3,4,5,6,7,8,9,10})","v":3},447,526,529,175,1676,"Northern Ireland",1676,null,null,null,null,null,null,null,"Ballynafeigh_2",null,null,null,null,null,null,"Kilwee_2"]
["95BB22S2","Scrabo_2","N09000011","Ards and North Down",41,83,162,79,424,798,201,71,"Urban",348506,372739,{"$error":"#N/A"},"N06000016","Strangford",{"$f":"LOOKUP(OFFSET($D101,0,$B$12),{0,179,357,535,713;1,2,3,4,5})","v":1},{"$f":"LOOKUP(OFFSET($D101,0,$B$12),{0,90,179,268,357,446,535,624,713,802;1,2,3,4,5,6,7,8,9,10})","v":1},366,466,500,281,1613,"Northern Ireland",1613,null,null,null,null,null,null,null,"Ballynafeigh_3",null,null,null,null,null,null,"Knock_1"]
["95BB23S1","Whitespots_1","N09000011","Ards and North Down",726,779,776,732,699,279,466,803,"Urban",349534,374863,{"$error":"#N/A"},"N06000016","Strangford",{"$f":"LOOKUP(OFFSET($D102,0,$B$12),{0,179,357,535,713;1,2,3,4,5})","v":5},{"$f":"LOOKUP(OFFSET($D102,0,$B$12),{0,90,179,268,357,446,535,624,713,802;1,2,3,4,5,6,7,8,9,10})","v":10},238,378,565,427,1607,"Northern Ireland",1607,null,null,null,null,null,null,null,"Ballynahinch East",null,null,null,null,null,null,"Knock_2"]
["95BB23S2","Whitespots_2","N09000011","Ards and North Down",864,810,730,600,522,421,797,828,"Urban",349943,375596,{"$error":"#N/A"},"N06000016","Strangford",{"$f":"LOOKUP(OFFSET($D103,0,$B$12),{0,179,357,535,713;1,2,3,4,5})","v":5},{"$f":"LOOKUP(OFFSET($D103,0,$B$12),{0,90,179,268,357,446,535,624,713,802;1,2,3,4,5,6,7,8,9,10})","v":10},206,359,537,297,1399,"Northern Ireland",1399,null,null,null,null,null,null,null,"Ballynashallog_1",null,null,null,null,null,null,"Knock_3"]
["95CC01W1","Abbey Park","N09000002","Armagh City, Banbridge and Craigavon",451,353,315,362,442,425,391,424,"Urban",287023,346295,{"$error":"#N/A"},"N06000011","Newry & Armagh",{"$f":"LOOKUP(OFFSET($D104,0,$B$12),{0,179,357,535,713;1,2,3,4,5})","v":3},{"$f":"LOOKUP(OFFSET($D104,0,$B$12),{0,90,179,268,357,446,535,624,713,802;1,2,3,4,5,6,7,8,9,10})","v":5},558,838,822,431,2649,"Northern Ireland",2649,null,null,null,null,null,null,null,"Ballynashallog_2",null,null,null,null,null,null,"Ladybrook_1"]
["95CC02W1","Ballymartrim","N09000002","Armagh City, Banbridge and Craigavon",305,590,651,659,102,369,728,498,"Rural",282637,348613,{"$error":"#N/A"},"N06000011","Newry & Armagh",{"$f":"LOOKUP(OFFSET($D105,0,$B$12),{0,179,357,535,713;1,2,3,4,5})","v":3},{"$f":"LOOKUP(OFFSET($D105,0,$B$12),{0,90,179,268,357,446,535,624,713,802;1,2,3,4,5,6,7,8,9,10})","v":6},596,879,925,465,2866,"Northern Ireland",2866,null,null,null,null,null,null,null,"Ballynure_1",null,null,null,null,null,null,"Ladybrook_2"]
["95CC03W1","Callan Bridge","N09000002","Armagh City, Banbridge and Craigavon",38,98,121,97,716,92,69,61,"Urban",286889,345229,{"$error":"#N/A"},"N06000011","Newry & Armagh",{"$f":"LOOKUP(OFFSET($D106,0,$B$12),{0,179,357,535,713;1,2,3,4,5})","v":1},{"$f":"LOOKUP(OFFSET($D106,0,$B$12),{0,90,179,268,357,446,535,624,713,802;1,2,3,4,5,6,7,8,9,10})","v":1},718,997,789,354,2859,"Northern Ireland",2859,null,null,null,null,null,null,null,"Ballynure_2",null,null,null,null,null,null,"Ladybrook_3"]
["95CC04W1","Carrigatuke","N09000002","Armagh City, Banbridge and Craigavon",93,452,576,686,100,151,670,273,"Rural",287368,333903,{"$error":"#N/A"},"N06000011","Newry & Armagh",{"$f":"LOOKUP(OFFSET($D107,0,$B$12),{0,179,357,535,713;1,2,3,4,5})","v":2},{"$f":"LOOKUP(OFFSET($D107,0,$B$12),{0,90,179,268,357,446,535,624,713,802;1,2,3,4,5,6,7,8,9,10})","v":4},638,838,791,384,2650,"Northern Ireland",2650,null,null,null,null,null,null,null,"Ballyoran",null,null,null,null,null,null,"Legoniel_1"]
["95CC05W1","Charlemont","N09000002","Armagh City, Banbridge and Craigavon",195,559,545,627,135,215,690,403,"Rural",287009,353744,{"$error":"#N/A"},"N06000011","Newry & Armagh",{"$f":"LOOKUP(OFFSET($D108,0,$B$12),{0,179,357,535,713;1,2,3,4,5})","v":3},{"$f":"LOOKUP(OFFSET($D108,0,$B$12),{0,90,179,268,357,446,535,624,713,802;1,2,3,4,5,6,7,8,9,10})","v":5},704,891,848,463,2907,"Northern Ireland",2907,null,null,null,null,null,null,null,"Ballyrainey",null,null,null,null,null,null,"Legoniel_2"]
["95CC06S1","Demesne_1","N09000002","Armagh City, Banbridge and Craigavon",745,678,724,762,333,242,371,718,"Urban",288684,343774,{"$error":"#N/A"},"N06000011","Newry & Armagh",{"$f":"LOOKUP(OFFSET($D109,0,$B$12),{0,179,357,535,713;1,2,3,4,5})","v":5},{"$f":"LOOKUP(OFFSET($D109,0,$B$12),{0,90,179,268,357,446,535,624,713,802;1,2,3,4,5,6,7,8,9,10})","v":9},323,498,493,260,1574,"Northern Ireland",1574,null,null,null,null,null,null,null,"Ballyrobert_1",null,null,null,null,null,null,"Legoniel_3"]
["95CC06S2","Demesne_2","N09000002","Armagh City, Banbridge and Craigavon",485,387,432,502,450,717,311,521,"Urban",288775,344281,{"$error":"#N/A"},"N06000011","Newry & Armagh",{"$f":"LOOKUP(OFFSET($D110,0,$B$12),{0,179,357,535,713;1,2,3,4,5})","v":3},{"$f":"LOOKUP(OFFSET($D110,0,$B$12),{0,90,179,268,357,446,535,624,713,802;1,2,3,4,5,6,7,8,9,10})","v":6},331,417,451,222,1421,"Northern Ireland",1421,null,null,null,null,null,null,null,"Ballyrobert_2",null,null,null,null,null,null,"Lisnasharragh"]
["95CC07W1","Derrynoose","N09000002","Armagh City, Banbridge and Craigavon",46,417,569,664,54,694,522,212,"Rural",282746,333013,{"$error":"#N/A"},"N06000011","Newry & Armagh",{"$f":"LOOKUP(OFFSET($D111,0,$B$12),{0,179,357,535,713;1,2,3,4,5})","v":2},{"$f":"LOOKUP(OFFSET($D111,0,$B$12),{0,90,179,268,357,446,535,624,713,802;1,2,3,4,5,6,7,8,9,10})","v":3},1006,1164,1150,386,3706,"Northern Ireland",3706,null,null,null,null,null,null,null,"Ballysaggart",null,null,null,null,null,null,"Lower Braniel"]
["95CC08W1","Downs","N09000002","Armagh City, Banbridge and Craigavon",197,273,262,368,603,528,239,288,"Urban",286998,344493,{"$error":"#N/A"},"N06000011","Newry & Armagh",{"$f":"LOOKUP(OFFSET($D112,0,$B$12),{0,179,357,535,713;1,2,3,4,5})","v":2},{"$f":"LOOKUP(OFFSET($D112,0,$B$12),{0,90,179,268,357,446,535,624,713,802;1,2,3,4,5,6,7,8,9,10})","v":4},581,837,745,417,2580,"Northern Ireland",2580,null,null,null,null,null,null,null,"Ballysally_1",null,null,null,null,null,null,"Malone_1"]
["95CC09S1","Hamiltonsbawn_1","N09000002","Armagh City, Banbridge and Craigavon",528,757,815,810,125,170,820,657,"Rural",295254,343355,{"$error":"#N/A"},"N06000011","Newry & Armagh",{"$f":"LOOKUP(OFFSET($D113,0,$B$12),{0,179,357,535,713;1,2,3,4,5})","v":4},{"$f":"LOOKUP(OFFSET($D113,0,$B$12),{0,90,179,268,357,446,535,624,713,802;1,2,3,4,5,6,7,8,9,10})","v":8},299,427,544,261,1531,"Northern Ireland",1531,null,null,null,null,null,null,null,"Ballysally_2",null,null,null,null,null,null,"Malone_2"]
["95CC09S2","Hamiltonsbawn_2","N09000002","Armagh City, Banbridge and Craigavon",567,688,728,563,156,460,771,651,"Rural",295882,345299,{"$error":"#N/A"},"N06000011","Newry & Armagh",{"$f":"LOOKUP(OFFSET($D114,0,$B$12),{0,179,357,535,713;1,2,3,4,5})","v":4},{"$f":"LOOKUP(OFFSET($D114,0,$B$12),{0,90,179,268,357,446,535,624,713,802;1,2,3,4,5,6,7,8,9,10})","v":8},486,654,638,265,2043,"Northern Ireland",2043,null,null,null,null,null,null,null,"Ballysillan_1",null,null,null,null,null,null,"Malone_3"]
["95CC10W1","Hockley","N09000002","Armagh City, Banbridge and Craigavon",683,728,748,673,110,382,673,680,"Rural",294723,350196,{"$error":"#N/A"},"N06000011","Newry & Armagh",{"$f":"LOOKUP(OFFSET($D115,0,$B$12),{0,179,357,535,713;1,2,3,4,5})","v":4},{"$f":"LOOKUP(OFFSET($D115,0,$B$12),{0,90,179,268,357,446,535,624,713,802;1,2,3,4,5,6,7,8,9,10})","v":8},467,692,870,610,2638,"Northern Ireland",2638,null,null,null,null,null,null,null,"Ballysillan_2",null,null,null,null,null,null,"Minnowburn"]
["95CC11W1","Keady","N09000002","Armagh City, Banbridge and Craigavon",22,227,320,326,410,278,277,125,"Rural",284506,334269,{"$error":"#N/A"},"N06000011","Newry & Armagh",{"$f":"LOOKUP(OFFSET($D116,0,$B$12),{0,179,357,535,713;1,2,3,4,5})","v":1},{"$f":"LOOKUP(OFFSET($D116,0,$B$12),{0,90,179,268,357,446,535,624,713,802;1,2,3,4,5,6,7,8,9,10})","v":2},397,616,544,369,1927,"Northern Ireland",1927,null,null,null,null,null,null,null,"Ballysillan_3",null,null,null,null,null,null,"Musgrave_1"]
["95CC12W1","Killeen","N09000002","Armagh City, Banbridge and Craigavon",248,549,635,604,113,317,708,443,"Rural",291593,339130,{"$error":"#N/A"},"N06000011","Newry & Armagh",{"$f":"LOOKUP(OFFSET($D117,0,$B$12),{0,179,357,535,713;1,2,3,4,5})","v":3},{"$f":"LOOKUP(OFFSET($D117,0,$B$12),{0,90,179,268,357,446,535,624,713,802;1,2,3,4,5,6,7,8,9,10})","v":5},628,813,889,469,2799,"Northern Ireland",2799,null,null,null,null,null,null,null,"Ballywalter_1",null,null,null,null,null,null,"Musgrave_2"]
["95CC13W1","Killylea","N09000002","Armagh City, Banbridge and Craigavon",266,550,550,647,89,281,752,432,"Rural",277737,340609,{"$error":"#N/A"},"N06000011","Newry & Armagh",{"$f":"LOOKUP(OFFSET($D118,0,$B$12),{0,179,357,535,713;1,2,3,4,5})","v":3},{"$f":"LOOKUP(OFFSET($D118,0,$B$12),{0,90,179,268,357,446,535,624,713,802;1,2,3,4,5,6,7,8,9,10})","v":5},590,790,805,376,2560,"Northern Ireland",2560,null,null,null,null,null,null,null,"Ballywalter_2",null,null,null,null,null,null,"Musgrave_3"]
["95CC14W1","Laurelvale","N09000002","Armagh City, Banbridge and Craigavon",541,613,517,460,260,362,695,588,"Rural",301589,347212,{"$error":"#N/A"},"N06000011","Newry & Armagh",{"$f":"LOOKUP(OFFSET($D119,0,$B$12),{0,179,357,535,713;1,2,3,4,5})","v":4},{"$f":"LOOKUP(OFFSET($D119,0,$B$12),{0,90,179,268,357,446,535,624,713,802;1,2,3,4,5,6,7,8,9,10})","v":7},703,960,1000,467,3131,"Northern Ireland",3131,null,null,null,null,null,null,null,"Ballyward",null,null,null,null,null,null,"New Lodge_1"]
["95CC15W1","Loughgall","N09000002","Armagh City, Banbridge and Craigavon",300,620,537,615,137,431,865,505,"Rural",292831,354469,{"$error":"#N/A"},"N06000011","Newry & Armagh",{"$f":"LOOKUP(OFFSET($D120,0,$B$12),{0,179,357,535,713;1,2,3,4,5})","v":3},{"$f":"LOOKUP(OFFSET($D120,0,$B$12),{0,90,179,268,357,446,535,624,713,802;1,2,3,4,5,6,7,8,9,10})","v":6},693,917,975,430,3014,"Northern Ireland",3014,null,null,null,null,null,null,null,"Banagher",null,null,null,null,null,null,"New Lodge_2"]
["95CC16W1","Markethill","N09000002","Armagh City, Banbridge and Craigavon",139,385,359,425,237,733,484,310,"Rural",296558,338272,{"$error":"#N/A"},"N06000011","Newry & Armagh",{"$f":"LOOKUP(OFFSET($D121,0,$B$12),{0,179,357,535,713;1,2,3,4,5})","v":2},{"$f":"LOOKUP(OFFSET($D121,0,$B$12),{0,90,179,268,357,446,535,624,713,802;1,2,3,4,5,6,7,8,9,10})","v":4},742,893,862,469,2965,"Northern Ireland",2965,null,null,null,null,null,null,null,"Banbridge West",null,null,null,null,null,null,"New Lodge_3"]
["95CC17W1","Milford","N09000002","Armagh City, Banbridge and Craigavon",482,676,689,721,166,163,554,600,"Rural",284921,341762,{"$error":"#N/A"},"N06000011","Newry & Armagh",{"$f":"LOOKUP(OFFSET($D122,0,$B$12),{0,179,357,535,713;1,2,3,4,5})","v":4},{"$f":"LOOKUP(OFFSET($D122,0,$B$12),{0,90,179,268,357,446,535,624,713,802;1,2,3,4,5,6,7,8,9,10})","v":7},725,911,886,406,2929,"Northern Ireland",2929,null,null,null,null,null,null,null,"Bangor Castle",null,null,null,null,null,null,"Orangefield_1"]
["95CC18W1","Observatory","N09000002","Armagh City, Banbridge and Craigavon",217,404,478,609,414,455,490,426,"Urban",288535,346217,{"$error":"#N/A"},"N06000011","Newry & Armagh",{"$f":"LOOKUP(OFFSET($D123,0,$B$12),{0,179,357,535,713;1,2,3,4,5})","v":3},{"$f":"LOOKUP(OFFSET($D123,0,$B$12),{0,90,179,268,357,446,535,624,713,802;1,2,3,4,5,6,7,8,9,10})","v":5},483,649,797,484,2413,"Northern Ireland",2413,null,null,null,null,null,null,null,"Bannside",null,null,null,null,null,null,"Orangefield_2"]
["95CC19W1","Poyntz Pass","N09000002","Armagh City, Banbridge and Craigavon",131,423,568,504,101,267,591,294,"Rural",303453,339509,{"$error":"#N/A"},"N06000011","Newry & Armagh",{"$f":"LOOKUP(OFFSET($D124,0,$B$12),{0,179,357,535,713;1,2,3,4,5})","v":2},{"$f":"LOOKUP(OFFSET($D124,0,$B$12),{0,90,179,268,357,446,535,624,713,802;1,2,3,4,5,6,7,8,9,10})","v":4},667,821,944,425,2858,"Northern Ireland",2858,null,null,null,null,null,null,null,"Beechill_1",null,null,null,null,null,null,"Orangefield_3"]
["95CC20S1","Rich Hill_1","N09000002","Armagh City, Banbridge and Craigavon",798,735,642,706,283,805,854,786,"Rural",294660,347928,{"$error":"#N/A"},"N06000011","Newry & Armagh",{"$f":"LOOKUP(OFFSET($D125,0,$B$12),{0,179,357,535,713;1,2,3,4,5})","v":5},{"$f":"LOOKUP(OFFSET($D125,0,$B$12),{0,90,179,268,357,446,535,624,713,802;1,2,3,4,5,6,7,8,9,10})","v":9},256,362,423,179,1220,"Northern Ireland",1220,null,null,null,null,null,null,null,"Beechill_2",null,null,null,null,null,null,"Poleglass_1"]
["95CC20S2","Rich Hill_2","N09000002","Armagh City, Banbridge and Craigavon",643,496,493,568,372,459,772,637,"Rural",294172,348107,{"$error":"#N/A"},"N06000011","Newry & Armagh",{"$f":"LOOKUP(OFFSET($D126,0,$B$12),{0,179,357,535,713;1,2,3,4,5})","v":4},{"$f":"LOOKUP(OFFSET($D126,0,$B$12),{0,90,179,268,357,446,535,624,713,802;1,2,3,4,5,6,7,8,9,10})","v":8},352,517,574,263,1706,"Northern Ireland",1706,null,null,null,null,null,null,null,"Beechill_3",null,null,null,null,null,null,"Poleglass_2"]
["95CC21W1","Tandragee","N09000002","Armagh City, Banbridge and Craigavon",185,455,448,312,316,713,364,353,"Rural",303424,346476,{"$error":"#N/A"},"N06000011","Newry & Armagh",{"$f":"LOOKUP(OFFSET($D127,0,$B$12),{0,179,357,535,713;1,2,3,4,5})","v":2},{"$f":"LOOKUP(OFFSET($D127,0,$B$12),{0,90,179,268,357,446,535,624,713,802;1,2,3,4,5,6,7,8,9,10})","v":4},651,872,983,488,2995,"Northern Ireland",2995,null,null,null,null,null,null,null,"Beechmount_1",null,null,null,null,null,null,"Ravenhill_1"]
["95CC22W1","The Mall","N09000002","Armagh City, Banbridge and Craigavon",156,320,391,292,714,83,356,269,"Urban",288511,345043,{"$error":"#N/A"},"N06000011","Newry & Armagh",{"$f":"LOOKUP(OFFSET($D128,0,$B$12),{0,179,357,535,713;1,2,3,4,5})","v":2},{"$f":"LOOKUP(OFFSET($D128,0,$B$12),{0,90,179,268,357,446,535,624,713,802;1,2,3,4,5,6,7,8,9,10})","v":4},374,538,587,361,1861,"Northern Ireland",1861,null,null,null,null,null,null,null,"Beechmount_2",null,null,null,null,null,null,"Ravenhill_2"]
["95DD01W1","Academy","N09000008","Mid and East Antrim",447,600,714,777,422,557,565,681,"Urban",309250,403073,{"$error":"#N/A"},"N06000012","North Antrim",{"$f":"LOOKUP(OFFSET($D129,0,$B$12),{0,179,357,535,713;1,2,3,4,5})","v":4},{"$f":"LOOKUP(OFFSET($D129,0,$B$12),{0,90,179,268,357,446,535,624,713,802;1,2,3,4,5,6,7,8,9,10})","v":8},302,466,722,599,2089,"Northern Ireland",2089,null,null,null,null,null,null,null,"Beechmount_3",null,null,null,null,null,null,"Ravenhill_3"]
["95DD02S1","Ahoghill_1","N09000008","Mid and East Antrim",811,461,488,392,281,503,564,598,"Rural",304711,401803,{"$error":"#N/A"},"N06000012","North Antrim",{"$f":"LOOKUP(OFFSET($D130,0,$B$12),{0,179,357,535,713;1,2,3,4,5})","v":4},{"$f":"LOOKUP(OFFSET($D130,0,$B$12),{0,90,179,268,357,446,535,624,713,802;1,2,3,4,5,6,7,8,9,10})","v":7},248,376,489,291,1404,"Northern Ireland",1404,null,null,null,null,null,null,null,"Beechwood",null,null,null,null,null,null,"Rosetta_1"]
["95DD02S2","Ahoghill_2","N09000008","Mid and East Antrim",795,772,691,677,241,621,805,778,"Rural",305261,401634,{"$error":"#N/A"},"N06000012","North Antrim",{"$f":"LOOKUP(OFFSET($D131,0,$B$12),{0,179,357,535,713;1,2,3,4,5})","v":5},{"$f":"LOOKUP(OFFSET($D131,0,$B$12),{0,90,179,268,357,446,535,624,713,802;1,2,3,4,5,6,7,8,9,10})","v":9},577,816,844,320,2558,"Northern Ireland",2558,null,null,null,null,null,null,null,"Belcoo and Garrison",null,null,null,null,null,null,"Rosetta_2"]
["95DD03W1","Ardeevin","N09000008","Mid and East Antrim",797,828,817,650,324,815,553,817,"Urban",309536,401896,{"$error":"#N/A"},"N06000012","North Antrim",{"$f":"LOOKUP(OFFSET($D132,0,$B$12),{0,179,357,535,713;1,2,3,4,5})","v":5},{"$f":"LOOKUP(OFFSET($D132,0,$B$12),{0,90,179,268,357,446,535,624,713,802;1,2,3,4,5,6,7,8,9,10})","v":10},782,1154,1141,666,3742,"Northern Ireland",3742,null,null,null,null,null,null,null,"Bellaghy",null,null,null,null,null,null,"Rosetta_3"]
["95DD04W1","Ballee","N09000008","Mid and East Antrim",146,85,103,41,629,590,106,85,"Urban",311100,401711,{"$error":"#N/A"},"N06000012","North Antrim",{"$f":"LOOKUP(OFFSET($D133,0,$B$12),{0,179,357,535,713;1,2,3,4,5})","v":1},{"$f":"LOOKUP(OFFSET($D133,0,$B$12),{0,90,179,268,357,446,535,624,713,802;1,2,3,4,5,6,7,8,9,10})","v":1},436,590,604,307,1937,"Northern Ireland",1937,null,null,null,null,null,null,null,"Belleek and Boa",null,null,null,null,null,null,"Shaftesbury_1"]
["95DD05W1","Ballykeel","N09000008","Mid and East Antrim",55,144,187,177,421,464,182,110,"Urban",312118,402782,{"$error":"#N/A"},"N06000012","North Antrim",{"$f":"LOOKUP(OFFSET($D134,0,$B$12),{0,179,357,535,713;1,2,3,4,5})","v":1},{"$f":"LOOKUP(OFFSET($D134,0,$B$12),{0,90,179,268,357,446,535,624,713,802;1,2,3,4,5,6,7,8,9,10})","v":2},363,556,544,214,1677,"Northern Ireland",1677,null,null,null,null,null,null,null,"Bellevue_1",null,null,null,null,null,null,"Shaftesbury_2"]
["95DD06W1","Ballyloughan","N09000008","Mid and East Antrim",884,842,821,788,451,608,768,874,"Urban",309663,404397,{"$error":"#N/A"},"N06000012","North Antrim",{"$f":"LOOKUP(OFFSET($D135,0,$B$12),{0,179,357,535,713;1,2,3,4,5})","v":5},{"$f":"LOOKUP(OFFSET($D135,0,$B$12),{0,90,179,268,357,446,535,624,713,802;1,2,3,4,5,6,7,8,9,10})","v":10},348,620,808,812,2587,"Northern Ireland",2587,null,null,null,null,null,null,null,"Bellevue_2",null,null,null,null,null,null,"Shaftesbury_3"]
["95DD07S1","Broughshane_1","N09000008","Mid and East Antrim",572,651,601,592,409,517,700,691,"Rural",314290,406111,{"$error":"#N/A"},"N06000012","North Antrim",{"$f":"LOOKUP(OFFSET($D136,0,$B$12),{0,179,357,535,713;1,2,3,4,5})","v":4},{"$f":"LOOKUP(OFFSET($D136,0,$B$12),{0,90,179,268,357,446,535,624,713,802;1,2,3,4,5,6,7,8,9,10})","v":8},250,349,501,423,1523,"Northern Ireland",1523,null,null,null,null,null,null,null,"Bellevue_3",null,null,null,null,null,null,"Shankill_1"]
["95DD07S2","Broughshane_2","N09000008","Mid and East Antrim",624,642,640,709,319,855,636,717,"Rural",314999,406909,{"$error":"#N/A"},"N06000012","North Antrim",{"$f":"LOOKUP(OFFSET($D137,0,$B$12),{0,179,357,535,713;1,2,3,4,5})","v":5},{"$f":"LOOKUP(OFFSET($D137,0,$B$12),{0,90,179,268,357,446,535,624,713,802;1,2,3,4,5,6,7,8,9,10})","v":9},428,510,629,363,1930,"Northern Ireland",1930,null,null,null,null,null,null,null,"Belmont_1",null,null,null,null,null,null,"Shankill_2"]
["95DD08W1","Castle Demesne","N09000008","Mid and East Antrim",171,314,247,94,751,120,52,183,"Urban",310765,403480,{"$error":"#N/A"},"N06000012","North Antrim",{"$f":"LOOKUP(OFFSET($D138,0,$B$12),{0,179,357,535,713;1,2,3,4,5})","v":2},{"$f":"LOOKUP(OFFSET($D138,0,$B$12),{0,90,179,268,357,446,535,624,713,802;1,2,3,4,5,6,7,8,9,10})","v":3},387,911,782,413,2493,"Northern Ireland",2493,null,null,null,null,null,null,null,"Belmont_2",null,null,null,null,null,null,"Stormont_1"]
["95DD09W1","Craigywarren","N09000008","Mid and East Antrim",403,756,812,827,132,84,764,590,"Rural",308590,408913,{"$error":"#N/A"},"N06000012","North Antrim",{"$f":"LOOKUP(OFFSET($D139,0,$B$12),{0,179,357,535,713;1,2,3,4,5})","v":4},{"$f":"LOOKUP(OFFSET($D139,0,$B$12),{0,90,179,268,357,446,535,624,713,802;1,2,3,4,5,6,7,8,9,10})","v":7},554,611,962,491,2618,"Northern Ireland",2618,null,null,null,null,null,null,null,"Belmont_3",null,null,null,null,null,null,"Stormont_2"]
["95DD10W1","Cullybackey","N09000008","Mid and East Antrim",682,397,423,380,360,560,390,538,"Rural",305955,405732,{"$error":"#N/A"},"N06000012","North Antrim",{"$f":"LOOKUP(OFFSET($D140,0,$B$12),{0,179,357,535,713;1,2,3,4,5})","v":4},{"$f":"LOOKUP(OFFSET($D140,0,$B$12),{0,90,179,268,357,446,535,624,713,802;1,2,3,4,5,6,7,8,9,10})","v":7},476,817,923,577,2793,"Northern Ireland",2793,null,null,null,null,null,null,null,"Benburb",null,null,null,null,null,null,"Stormont_3"]
["95DD11W1","Dunclug","N09000008","Mid and East Antrim",181,186,177,96,556,427,89,154,"Urban",310839,405196,{"$error":"#N/A"},"N06000012","North Antrim",{"$f":"LOOKUP(OFFSET($D141,0,$B$12),{0,179,357,535,713;1,2,3,4,5})","v":1},{"$f":"LOOKUP(OFFSET($D141,0,$B$12),{0,90,179,268,357,446,535,624,713,802;1,2,3,4,5,6,7,8,9,10})","v":2},669,891,661,278,2499,"Northern Ireland",2499,null,null,null,null,null,null,null,"Benvardin",null,null,null,null,null,null,"Stranmillis_1"]
["95DD12W1","Dunminning","N09000008","Mid and East Antrim",472,706,772,701,121,112,867,591,"Rural",302989,408720,{"$error":"#N/A"},"N06000012","North Antrim",{"$f":"LOOKUP(OFFSET($D142,0,$B$12),{0,179,357,535,713;1,2,3,4,5})","v":4},{"$f":"LOOKUP(OFFSET($D142,0,$B$12),{0,90,179,268,357,446,535,624,713,802;1,2,3,4,5,6,7,8,9,10})","v":7},514,780,888,456,2639,"Northern Ireland",2639,null,null,null,null,null,null,null,"Beragh",null,null,null,null,null,null,"Stranmillis_2"]
["95DD13W1","Fair Green","N09000008","Mid and East Antrim",126,222,346,223,777,337,349,222,"Urban",310909,404256,{"$error":"#N/A"},"N06000012","North Antrim",{"$f":"LOOKUP(OFFSET($D143,0,$B$12),{0,179,357,535,713;1,2,3,4,5})","v":2},{"$f":"LOOKUP(OFFSET($D143,0,$B$12),{0,90,179,268,357,446,535,624,713,802;1,2,3,4,5,6,7,8,9,10})","v":3},371,590,525,362,1848,"Northern Ireland",1848,null,null,null,null,null,null,null,"Bessbrook",null,null,null,null,null,null,"Stranmillis_3"]
["95DD14S1","Galgorm_1","N09000008","Mid and East Antrim",820,751,693,750,342,484,779,794,"Mixed urban/rural",307654,402707,{"$error":"#N/A"},"N06000012","North Antrim",{"$f":"LOOKUP(OFFSET($D144,0,$B$12),{0,179,357,535,713;1,2,3,4,5})","v":5},{"$f":"LOOKUP(OFFSET($D144,0,$B$12),{0,90,179,268,357,446,535,624,713,802;1,2,3,4,5,6,7,8,9,10})","v":9},331,440,526,270,1568,"Northern Ireland",1568,null,null,null,null,null,null,null,"Binnian",null,null,null,null,null,null,"Stranmillis_4"]
["95DD14S2","Galgorm_2","N09000008","Mid and East Antrim",782,881,878,873,350,738,809,869,"Mixed urban/rural",308147,402332,{"$error":"#N/A"},"N06000012","North Antrim",{"$f":"LOOKUP(OFFSET($D145,0,$B$12),{0,179,357,535,713;1,2,3,4,5})","v":5},{"$f":"LOOKUP(OFFSET($D145,0,$B$12),{0,90,179,268,357,446,535,624,713,802;1,2,3,4,5,6,7,8,9,10})","v":10},269,399,687,297,1652,"Northern Ireland",1652,null,null,null,null,null,null,null,"Blackcave",null,null,null,null,null,null,"Sydenham_1"]
["95DD15W1","Glenravel","N09000008","Mid and East Antrim",626,670,795,718,92,645,841,679,"Rural",313241,415437,{"$error":"#N/A"},"N06000012","North Antrim",{"$f":"LOOKUP(OFFSET($D146,0,$B$12),{0,179,357,535,713;1,2,3,4,5})","v":4},{"$f":"LOOKUP(OFFSET($D146,0,$B$12),{0,90,179,268,357,446,535,624,713,802;1,2,3,4,5,6,7,8,9,10})","v":8},837,1025,1178,477,3516,"Northern Ireland",3516,null,null,null,null,null,null,null,"Blackhead",null,null,null,null,null,null,"Sydenham_2"]
["95DD16W1","Glenwhirry","N09000008","Mid and East Antrim",555,805,805,776,71,201,838,642,"Rural",318260,399576,{"$error":"#N/A"},"N06000012","North Antrim",{"$f":"LOOKUP(OFFSET($D147,0,$B$12),{0,179,357,535,713;1,2,3,4,5})","v":4},{"$f":"LOOKUP(OFFSET($D147,0,$B$12),{0,90,179,268,357,446,535,624,713,802;1,2,3,4,5,6,7,8,9,10})","v":8},623,841,1104,533,3101,"Northern Ireland",3101,null,null,null,null,null,null,null,"Blackstaff_1",null,null,null,null,null,null,"Sydenham_3"]
["95DD17W1","Grange","N09000008","Mid and East Antrim",591,708,787,784,49,639,845,648,"Rural",303155,396984,{"$error":"#N/A"},"N06000012","North Antrim",{"$f":"LOOKUP(OFFSET($D148,0,$B$12),{0,179,357,535,713;1,2,3,4,5})","v":4},{"$f":"LOOKUP(OFFSET($D148,0,$B$12),{0,90,179,268,357,446,535,624,713,802;1,2,3,4,5,6,7,8,9,10})","v":8},853,1095,1180,538,3666,"Northern Ireland",3666,null,null,null,null,null,null,null,"Blackstaff_2",null,null,null,null,null,null,"The Mount_1"]
["95DD18W1","Harryville","N09000008","Mid and East Antrim",235,311,328,156,630,106,61,228,"Urban",310656,402156,{"$error":"#N/A"},"N06000012","North Antrim",{"$f":"LOOKUP(OFFSET($D149,0,$B$12),{0,179,357,535,713;1,2,3,4,5})","v":2},{"$f":"LOOKUP(OFFSET($D149,0,$B$12),{0,90,179,268,357,446,535,624,713,802;1,2,3,4,5,6,7,8,9,10})","v":3},282,689,624,506,2100,"Northern Ireland",2100,null,null,null,null,null,null,null,"Blaris_1",null,null,null,null,null,null,"The Mount_2"]
["95DD19S1","Kells_1","N09000008","Mid and East Antrim",581,492,371,337,256,858,435,518,"Rural",314739,396785,{"$error":"#N/A"},"N06000012","North Antrim",{"$f":"LOOKUP(OFFSET($D150,0,$B$12),{0,179,357,535,713;1,2,3,4,5})","v":3},{"$f":"LOOKUP(OFFSET($D150,0,$B$12),{0,90,179,268,357,446,535,624,713,802;1,2,3,4,5,6,7,8,9,10})","v":6},425,634,582,285,1925,"Northern Ireland",1925,null,null,null,null,null,null,null,"Blaris_2",null,null,null,null,null,null,"Tullycarnet"]
["95DD19S2","Kells_2","N09000008","Mid and East Antrim",536,739,742,764,197,355,798,692,"Rural",312179,397078,{"$error":"#N/A"},"N06000012","North Antrim",{"$f":"LOOKUP(OFFSET($D151,0,$B$12),{0,179,357,535,713;1,2,3,4,5})","v":4},{"$f":"LOOKUP(OFFSET($D151,0,$B$12),{0,90,179,268,357,446,535,624,713,802;1,2,3,4,5,6,7,8,9,10})","v":8},246,405,541,289,1482,"Northern Ireland",1482,null,null,null,null,null,null,null,"Bleary_1",null,null,null,null,null,null,"Twinbrook_1"]
["95DD20W1","Moat","N09000008","Mid and East Antrim",90,99,127,95,722,491,79,91,"Urban",311306,402485,{"$error":"#N/A"},"N06000012","North Antrim",{"$f":"LOOKUP(OFFSET($D152,0,$B$12),{0,179,357,535,713;1,2,3,4,5})","v":1},{"$f":"LOOKUP(OFFSET($D152,0,$B$12),{0,90,179,268,357,446,535,624,713,802;1,2,3,4,5,6,7,8,9,10})","v":2},309,530,578,310,1727,"Northern Ireland",1727,null,null,null,null,null,null,null,"Bleary_2",null,null,null,null,null,null,"Twinbrook_2"]
["95DD21W1","Park","N09000008","Mid and East Antrim",320,705,656,404,738,71,373,537,"Urban",310206,404201,{"$error":"#N/A"},"N06000012","North Antrim",{"$f":"LOOKUP(OFFSET($D153,0,$B$12),{0,179,357,535,713;1,2,3,4,5})","v":4},{"$f":"LOOKUP(OFFSET($D153,0,$B$12),{0,90,179,268,357,446,535,624,713,802;1,2,3,4,5,6,7,8,9,10})","v":7},473,796,702,386,2358,"Northern Ireland",2358,null,null,null,null,null,null,null,"Bloomfield_1_Belfast",null,null,null,null,null,null,"Upper Braniel"]
["95DD22S1","Portglenone_1","N09000008","Mid and East Antrim",527,608,628,633,149,493,459,596,"Rural",300167,402764,{"$error":"#N/A"},"N06000012","North Antrim",{"$f":"LOOKUP(OFFSET($D154,0,$B$12),{0,179,357,535,713;1,2,3,4,5})","v":4},{"$f":"LOOKUP(OFFSET($D154,0,$B$12),{0,90,179,268,357,446,535,624,713,802;1,2,3,4,5,6,7,8,9,10})","v":7},320,520,559,275,1674,"Northern Ireland",1674,null,null,null,null,null,null,null,"Bloomfield_1_NorthDown",null,null,null,null,null,null,"Upper Malone_1"]
["95DD22S2","Portglenone_2","N09000008","Mid and East Antrim",154,433,422,489,195,674,632,342,"Rural",298139,405639,{"$error":"#N/A"},"N06000012","North Antrim",{"$f":"LOOKUP(OFFSET($D155,0,$B$12),{0,179,357,535,713;1,2,3,4,5})","v":2},{"$f":"LOOKUP(OFFSET($D155,0,$B$12),{0,90,179,268,357,446,535,624,713,802;1,2,3,4,5,6,7,8,9,10})","v":4},384,483,515,257,1639,"Northern Ireland",1639,null,null,null,null,null,null,null,"Bloomfield_2_Belfast",null,null,null,null,null,null,"Upper Malone_2"]
["95DD23W1","Slemish","N09000008","Mid and East Antrim",276,742,794,811,34,221,737,484,"Rural",319135,407342,{"$error":"#N/A"},"N06000012","North Antrim",{"$f":"LOOKUP(OFFSET($D156,0,$B$12),{0,179,357,535,713;1,2,3,4,5})","v":3},{"$f":"LOOKUP(OFFSET($D156,0,$B$12),{0,90,179,268,357,446,535,624,713,802;1,2,3,4,5,6,7,8,9,10})","v":6},520,739,947,464,2670,"Northern Ireland",2670,null,null,null,null,null,null,null,"Bloomfield_2_NorthDown",null,null,null,null,null,null,"Upper Malone_3"]
["95DD24W1","Summerfield","N09000008","Mid and East Antrim",846,581,579,543,452,835,582,734,"Urban",311488,404708,{"$error":"#N/A"},"N06000012","North Antrim",{"$f":"LOOKUP(OFFSET($D157,0,$B$12),{0,179,357,535,713;1,2,3,4,5})","v":5},{"$f":"LOOKUP(OFFSET($D157,0,$B$12),{0,90,179,268,357,446,535,624,713,802;1,2,3,4,5,6,7,8,9,10})","v":9},557,873,876,432,2738,"Northern Ireland",2738,null,null,null,null,null,null,null,"Bloomfield_3_Belfast",null,null,null,null,null,null,"Upper Springfield_1"]
["95EE01W1","Ballyhoe and Corkey","N09000004","Causeway Coast and Glens",358,506,542,525,13,593,757,387,"Rural",308703,424917,{"$error":"#N/A"},"N06000012","North Antrim",{"$f":"LOOKUP(OFFSET($D158,0,$B$12),{0,179,357,535,713;1,2,3,4,5})","v":3},{"$f":"LOOKUP(OFFSET($D158,0,$B$12),{0,90,179,268,357,446,535,624,713,802;1,2,3,4,5,6,7,8,9,10})","v":5},419,637,600,245,1901,"Northern Ireland",1901,null,null,null,null,null,null,null,"Bluefield_1",null,null,null,null,null,null,"Upper Springfield_2"]
["95EE02W1","Benvardin","N09000004","Causeway Coast and Glens",297,378,479,309,219,666,424,382,"Rural",295497,432027,{"$error":"#N/A"},"N06000012","North Antrim",{"$f":"LOOKUP(OFFSET($D159,0,$B$12),{0,179,357,535,713;1,2,3,4,5})","v":3},{"$f":"LOOKUP(OFFSET($D159,0,$B$12),{0,90,179,268,357,446,535,624,713,802;1,2,3,4,5,6,7,8,9,10})","v":5},439,616,742,303,2101,"Northern Ireland",2101,null,null,null,null,null,null,null,"Bluefield_2",null,null,null,null,null,null,"Upper Springfield_3"]
["95EE03W1","Carnany","N09000004","Causeway Coast and Glens",279,174,314,302,535,814,512,302,"Urban",295957,426055,{"$error":"#N/A"},"N06000012","North Antrim",{"$f":"LOOKUP(OFFSET($D160,0,$B$12),{0,179,357,535,713;1,2,3,4,5})","v":2},{"$f":"LOOKUP(OFFSET($D160,0,$B$12),{0,90,179,268,357,446,535,624,713,802;1,2,3,4,5,6,7,8,9,10})","v":4},404,580,703,343,2030,"Northern Ireland",2030,null,null,null,null,null,null,null,"Boho Cleenish and Letterbreen",null,null,null,null,null,null,"Water Works_1"]
["95EE04W1","Clogh Mills","N09000004","Causeway Coast and Glens",337,564,468,459,176,495,703,483,"Rural",306196,418009,{"$error":"#N/A"},"N06000012","North Antrim",{"$f":"LOOKUP(OFFSET($D161,0,$B$12),{0,179,357,535,713;1,2,3,4,5})","v":3},{"$f":"LOOKUP(OFFSET($D161,0,$B$12),{0,90,179,268,357,446,535,624,713,802;1,2,3,4,5,6,7,8,9,10})","v":6},391,633,664,330,2018,"Northern Ireland",2018,null,null,null,null,null,null,null,"Bonamargy and Rathlin_&_Glenshesk",null,null,null,null,null,null,"Water Works_2"]
["95EE05W1","Dervock","N09000004","Causeway Coast and Glens",180,507,527,439,217,105,572,349,"Rural",298014,427669,{"$f":"IF(B162=$F$27,O162,NA())","v":{"$error":"#N/A"}},"N06000012","North Antrim",{"$f":"LOOKUP(OFFSET($D162,0,$B$12),{0,179,357,535,713;1,2,3,4,5})","v":2},{"$f":"LOOKUP(OFFSET($D162,0,$B$12),{0,90,179,268,357,446,535,624,713,802;1,2,3,4,5,6,7,8,9,10})","v":4},292,400,607,275,1575,"Northern Ireland",{"$f":"CHOOSE($K$5,$Y162,IF($D162=$B$27,$Y162,\"\"),IF($R162=$B$27,$Y162,\"\"))","v":1575},null,null,null,null,null,null,null,"Boneybefore",null,null,null,null,null,null,"Water Works_3"]
["95EE06W1","Dunloy","N09000004","Causeway Coast and Glens",582,632,581,643,68,435,875,581,"Rural",300833,419652,{"$error":"#N/A"},"N06000012","North Antrim",{"$f":"LOOKUP(OFFSET($D163,0,$B$12),{0,179,357,535,713;1,2,3,4,5})","v":4},{"$f":"LOOKUP(OFFSET($D163,0,$B$12),{0,90,179,268,357,446,535,624,713,802;1,2,3,4,5,6,7,8,9,10})","v":7},588,778,715,302,2383,"Northern Ireland",2383,null,null,null,null,null,null,null,"Botanic_1",null,null,null,null,null,null,"Whiterock_1"]
["95EE07W1","Fairhill","N09000004","Causeway Coast and Glens",502,338,340,411,506,584,585,488,"Urban",295460,425269,{"$error":"#N/A"},"N06000012","North Antrim",{"$f":"LOOKUP(OFFSET($D164,0,$B$12),{0,179,357,535,713;1,2,3,4,5})","v":3},{"$f":"LOOKUP(OFFSET($D164,0,$B$12),{0,90,179,268,357,446,535,624,713,802;1,2,3,4,5,6,7,8,9,10})","v":6},405,510,578,360,1852,"Northern Ireland",1852,null,null,null,null,null,null,null,"Botanic_2",null,null,null,null,null,null,"Whiterock_2"]
["95EE08W1","Glebe","N09000004","Causeway Coast and Glens",717,464,508,678,732,377,342,677,"Urban",294595,426509,{"$error":"#N/A"},"N06000012","North Antrim",{"$f":"LOOKUP(OFFSET($D165,0,$B$12),{0,179,357,535,713;1,2,3,4,5})","v":4},{"$f":"LOOKUP(OFFSET($D165,0,$B$12),{0,90,179,268,357,446,535,624,713,802;1,2,3,4,5,6,7,8,9,10})","v":8},254,456,609,498,1817,"Northern Ireland",1817,null,null,null,null,null,null,null,"Botanic_3",null,null,null,null,null,null,"Whiterock_3"]
["95EE09W1","Killoquin Lower","N09000004","Causeway Coast and Glens",520,516,544,503,204,230,819,546,"Rural",296273,418451,{"$error":"#N/A"},"N06000012","North Antrim",{"$f":"LOOKUP(OFFSET($D166,0,$B$12),{0,179,357,535,713;1,2,3,4,5})","v":4},{"$f":"LOOKUP(OFFSET($D166,0,$B$12),{0,90,179,268,357,446,535,624,713,802;1,2,3,4,5,6,7,8,9,10})","v":7},383,582,640,297,1902,"Northern Ireland",1902,null,null,null,null,null,null,null,"Botanic_4",null,null,null,null,null,null,"Windsor_1"]
["95EE10W1","Killoquin Upper","N09000004","Causeway Coast and Glens",588,627,687,350,167,244,633,566,"Rural",297677,411854,{"$error":"#N/A"},"N06000012","North Antrim",{"$f":"LOOKUP(OFFSET($D167,0,$B$12),{0,179,357,535,713;1,2,3,4,5})","v":4},{"$f":"LOOKUP(OFFSET($D167,0,$B$12),{0,90,179,268,357,446,535,624,713,802;1,2,3,4,5,6,7,8,9,10})","v":7},423,631,579,278,1911,"Northern Ireland",1911,null,null,null,null,null,null,null,"Botanic_5",null,null,null,null,null,null,"Windsor_2"]
["95EE11W1","Knockaholet","N09000004","Causeway Coast and Glens",603,659,737,691,70,86,799,575,"Rural",303193,423542,{"$error":"#N/A"},"N06000012","North Antrim",{"$f":"LOOKUP(OFFSET($D168,0,$B$12),{0,179,357,535,713;1,2,3,4,5})","v":4},{"$f":"LOOKUP(OFFSET($D168,0,$B$12),{0,90,179,268,357,446,535,624,713,802;1,2,3,4,5,6,7,8,9,10})","v":7},342,524,560,285,1711,"Northern Ireland",1711,null,null,null,null,null,null,null,"Bradshaw's Brae_1",null,null,null,null,null,null,"Windsor_3"]
["95EE12W1","Newhill","N09000004","Causeway Coast and Glens",118,232,243,172,553,816,578,204,"Urban",295280,426482,{"$error":"#N/A"},"N06000012","North Antrim",{"$f":"LOOKUP(OFFSET($D169,0,$B$12),{0,179,357,535,713;1,2,3,4,5})","v":2},{"$f":"LOOKUP(OFFSET($D169,0,$B$12),{0,90,179,268,357,446,535,624,713,802;1,2,3,4,5,6,7,8,9,10})","v":3},538,817,841,305,2500,"Northern Ireland",2500,null,null,null,null,null,null,null,"Bradshaw's Brae_2",null,null,null,null,null,null,"Windsor_4"]
["95EE13W1","Route","N09000004","Causeway Coast and Glens",147,132,265,384,696,269,261,197,"Urban",294369,425934,{"$error":"#N/A"},"N06000012","North Antrim",{"$f":"LOOKUP(OFFSET($D170,0,$B$12),{0,179,357,535,713;1,2,3,4,5})","v":2},{"$f":"LOOKUP(OFFSET($D170,0,$B$12),{0,90,179,268,357,446,535,624,713,802;1,2,3,4,5,6,7,8,9,10})","v":3},243,401,506,395,1546,"Northern Ireland",1546,null,null,null,null,null,null,null,"Brandywell",null,null,null,null,null,null,"Woodstock_1"]
["95EE14W1","Seacon","N09000004","Causeway Coast and Glens",499,436,470,464,279,650,593,533,"Mixed urban/rural",293276,425078,{"$error":"#N/A"},"N06000012","North Antrim",{"$f":"LOOKUP(OFFSET($D171,0,$B$12),{0,179,357,535,713;1,2,3,4,5})","v":3},{"$f":"LOOKUP(OFFSET($D171,0,$B$12),{0,90,179,268,357,446,535,624,713,802;1,2,3,4,5,6,7,8,9,10})","v":6},664,924,926,416,2930,"Northern Ireland",2930,null,null,null,null,null,null,null,"Broadway_1",null,null,null,null,null,null,"Woodstock_2"]
["95EE15W1","Stranocum","N09000004","Causeway Coast and Glens",460,569,667,616,105,386,744,552,"Rural",303158,429525,{"$error":"#N/A"},"N06000012","North Antrim",{"$f":"LOOKUP(OFFSET($D172,0,$B$12),{0,179,357,535,713;1,2,3,4,5})","v":4},{"$f":"LOOKUP(OFFSET($D172,0,$B$12),{0,90,179,268,357,446,535,624,713,802;1,2,3,4,5,6,7,8,9,10})","v":7},394,525,593,275,1787,"Northern Ireland",1787,null,null,null,null,null,null,null,"Broadway_2",null,null,null,null,null,null,"Woodstock_3"]
["95EE16W1","The Vow","N09000004","Causeway Coast and Glens",290,576,625,584,58,441,766,444,"Rural",293158,419379,{"$error":"#N/A"},"N06000012","North Antrim",{"$f":"LOOKUP(OFFSET($D173,0,$B$12),{0,179,357,535,713;1,2,3,4,5})","v":3},{"$f":"LOOKUP(OFFSET($D173,0,$B$12),{0,90,179,268,357,446,535,624,713,802;1,2,3,4,5,6,7,8,9,10})","v":5},487,653,703,314,2156,"Northern Ireland",2156,null,null,null,null,null,null,null,"Brookeborough",null,null,null,null,null,null,"Woodvale_1"]
["95FF01S1","Ballydown_1","N09000002","Armagh City, Banbridge and Craigavon",708,719,704,757,510,813,675,806,"Urban",313363,345906,{"$error":"#N/A"},"N06000017","Upper Bann",{"$f":"LOOKUP(OFFSET($D174,0,$B$12),{0,179,357,535,713;1,2,3,4,5})","v":5},{"$f":"LOOKUP(OFFSET($D174,0,$B$12),{0,90,179,268,357,446,535,624,713,802;1,2,3,4,5,6,7,8,9,10})","v":10},439,633,731,341,2144,"Northern Ireland",2144,null,null,null,null,null,null,null,"Broughshane_1",null,null,null,null,null,null,"Woodvale_2"]
["95FF01S2","Ballydown_2","N09000002","Armagh City, Banbridge and Craigavon",670,798,785,730,399,861,626,805,"Urban",313155,345442,{"$error":"#N/A"},"N06000017","Upper Bann",{"$f":"LOOKUP(OFFSET($D175,0,$B$12),{0,179,357,535,713;1,2,3,4,5})","v":5},{"$f":"LOOKUP(OFFSET($D175,0,$B$12),{0,90,179,268,357,446,535,624,713,802;1,2,3,4,5,6,7,8,9,10})","v":10},682,939,994,359,2974,"Northern Ireland",2974,null,null,null,null,null,null,null,"Broughshane_2",null,null,null,null,null,null,"Woodvale_3"]
["95FF02W1","Ballyward","N09000010","Newry, Mourne and Down",109,498,617,513,4,481,706,233,"Rural",329050,340769,{"$error":"#N/A"},"N06000015","South Down",{"$f":"LOOKUP(OFFSET($D176,0,$B$12),{0,179,357,535,713;1,2,3,4,5})","v":2},{"$f":"LOOKUP(OFFSET($D176,0,$B$12),{0,90,179,268,357,446,535,624,713,802;1,2,3,4,5,6,7,8,9,10})","v":3},744,905,962,395,3007,"Northern Ireland",3007,null,null,null,null,null,null,null,"Brownstown_1",null,null,null,null,null,null,"Wynchurch"]
["95FF03W1","Banbridge West","N09000002","Armagh City, Banbridge and Craigavon",388,413,354,267,458,794,372,430,"Urban",311495,345409,{"$error":"#N/A"},"N06000017","Upper Bann",{"$f":"LOOKUP(OFFSET($D177,0,$B$12),{0,179,357,535,713;1,2,3,4,5})","v":3},{"$f":"LOOKUP(OFFSET($D177,0,$B$12),{0,90,179,268,357,446,535,624,713,802;1,2,3,4,5,6,7,8,9,10})","v":5},739,1110,952,355,3155,"Northern Ireland",3155,null,null,null,null,null,null,null,"Brownstown_2"]
["95FF04W1","Bannside","N09000002","Armagh City, Banbridge and Craigavon",228,643,716,760,18,458,735,411,"Rural",316398,341831,{"$error":"#N/A"},"N06000015","South Down",{"$f":"LOOKUP(OFFSET($D178,0,$B$12),{0,179,357,535,713;1,2,3,4,5})","v":3},{"$f":"LOOKUP(OFFSET($D178,0,$B$12),{0,90,179,268,357,446,535,624,713,802;1,2,3,4,5,6,7,8,9,10})","v":5},671,751,983,409,2814,"Northern Ireland",2814,null,null,null,null,null,null,null,"Bryansburn_1"]
["95FF05W1","Dromore North","N09000002","Armagh City, Banbridge and Craigavon",359,458,446,351,543,779,509,502,"Urban",320638,353706,{"$error":"#N/A"},"N06000009","Lagan Valley",{"$f":"LOOKUP(OFFSET($D179,0,$B$12),{0,179,357,535,713;1,2,3,4,5})","v":3},{"$f":"LOOKUP(OFFSET($D179,0,$B$12),{0,90,179,268,357,446,535,624,713,802;1,2,3,4,5,6,7,8,9,10})","v":6},573,767,803,480,2622,"Northern Ireland",2622,null,null,null,null,null,null,null,"Bryansburn_2"]
["95FF06S1","Dromore South_1","N09000002","Armagh City, Banbridge and Craigavon",686,712,619,687,596,742,617,785,"Urban",319876,352872,{"$error":"#N/A"},"N06000009","Lagan Valley",{"$f":"LOOKUP(OFFSET($D180,0,$B$12),{0,179,357,535,713;1,2,3,4,5})","v":5},{"$f":"LOOKUP(OFFSET($D180,0,$B$12),{0,90,179,268,357,446,535,624,713,802;1,2,3,4,5,6,7,8,9,10})","v":9},453,624,644,352,2073,"Northern Ireland",2073,null,null,null,null,null,null,null,"Burleigh Hill_1"]
["95FF06S2","Dromore South_2","N09000002","Armagh City, Banbridge and Craigavon",729,794,792,736,250,834,846,797,"Mixed urban/rural",320749,352585,{"$error":"#N/A"},"N06000009","Lagan Valley",{"$f":"LOOKUP(OFFSET($D181,0,$B$12),{0,179,357,535,713;1,2,3,4,5})","v":5},{"$f":"LOOKUP(OFFSET($D181,0,$B$12),{0,90,179,268,357,446,535,624,713,802;1,2,3,4,5,6,7,8,9,10})","v":9},519,607,788,201,2115,"Northern Ireland",2115,null,null,null,null,null,null,null,"Burleigh Hill_2"]
["95FF07W1","Edenderry","N09000002","Armagh City, Banbridge and Craigavon",357,170,145,182,648,775,132,224,"Urban",311814,346204,{"$error":"#N/A"},"N06000017","Upper Bann",{"$f":"LOOKUP(OFFSET($D182,0,$B$12),{0,179,357,535,713;1,2,3,4,5})","v":2},{"$f":"LOOKUP(OFFSET($D182,0,$B$12),{0,90,179,268,357,446,535,624,713,802;1,2,3,4,5,6,7,8,9,10})","v":3},640,900,901,344,2786,"Northern Ireland",2786,null,null,null,null,null,null,null,"Burnthill_1"]
["95FF08W1","Fort","N09000002","Armagh City, Banbridge and Craigavon",638,307,393,383,561,777,230,503,"Urban",312014,345066,{"$error":"#N/A"},"N06000017","Upper Bann",{"$f":"LOOKUP(OFFSET($D183,0,$B$12),{0,179,357,535,713;1,2,3,4,5})","v":3},{"$f":"LOOKUP(OFFSET($D183,0,$B$12),{0,90,179,268,357,446,535,624,713,802;1,2,3,4,5,6,7,8,9,10})","v":6},371,627,773,506,2277,"Northern Ireland",2277,null,null,null,null,null,null,null,"Burnthill_2"]
["95FF09W1","Gilford","N09000002","Armagh City, Banbridge and Craigavon",360,345,302,289,284,509,294,347,"Rural",306494,348568,{"$error":"#N/A"},"N06000017","Upper Bann",{"$f":"LOOKUP(OFFSET($D184,0,$B$12),{0,179,357,535,713;1,2,3,4,5})","v":2},{"$f":"LOOKUP(OFFSET($D184,0,$B$12),{0,90,179,268,357,446,535,624,713,802;1,2,3,4,5,6,7,8,9,10})","v":4},562,798,833,390,2583,"Northern Ireland",2583,null,null,null,null,null,null,null,"Burren and Kilbroney_1"]
["95FF10W1","Gransha","N09000002","Armagh City, Banbridge and Craigavon",286,674,722,667,64,791,840,520,"Rural",324865,348606,{"$error":"#N/A"},"N06000009","Lagan Valley",{"$f":"LOOKUP(OFFSET($D185,0,$B$12),{0,179,357,535,713;1,2,3,4,5})","v":3},{"$f":"LOOKUP(OFFSET($D185,0,$B$12),{0,90,179,268,357,446,535,624,713,802;1,2,3,4,5,6,7,8,9,10})","v":6},879,1108,1239,444,3669,"Northern Ireland",3669,null,null,null,null,null,null,null,"Burren and Kilbroney_2"]
["95FF11W1","Katesbridge","N09000002","Armagh City, Banbridge and Craigavon",263,662,732,651,33,411,843,449,"Rural",321764,339704,{"$error":"#N/A"},"N06000015","South Down",{"$f":"LOOKUP(OFFSET($D186,0,$B$12),{0,179,357,535,713;1,2,3,4,5})","v":3},{"$f":"LOOKUP(OFFSET($D186,0,$B$12),{0,90,179,268,357,446,535,624,713,802;1,2,3,4,5,6,7,8,9,10})","v":6},684,771,918,410,2783,"Northern Ireland",2783,null,null,null,null,null,null,null,"Cairnshill_1"]
["95FF12W1","Lawrencetown","N09000002","Armagh City, Banbridge and Craigavon",441,463,439,601,193,457,383,496,"Rural",310159,348624,{"$error":"#N/A"},"N06000017","Upper Bann",{"$f":"LOOKUP(OFFSET($D187,0,$B$12),{0,179,357,535,713;1,2,3,4,5})","v":3},{"$f":"LOOKUP(OFFSET($D187,0,$B$12),{0,90,179,268,357,446,535,624,713,802;1,2,3,4,5,6,7,8,9,10})","v":6},565,857,894,434,2750,"Northern Ireland",2750,null,null,null,null,null,null,null,"Cairnshill_2"]
["95FF13W1","Loughbrickland","N09000002","Armagh City, Banbridge and Craigavon",346,501,507,538,200,582,388,485,"Rural",309113,341741,{"$error":"#N/A"},"N06000017","Upper Bann",{"$f":"LOOKUP(OFFSET($D188,0,$B$12),{0,179,357,535,713;1,2,3,4,5})","v":3},{"$f":"LOOKUP(OFFSET($D188,0,$B$12),{0,90,179,268,357,446,535,624,713,802;1,2,3,4,5,6,7,8,9,10})","v":6},671,854,990,424,2940,"Northern Ireland",2940,null,null,null,null,null,null,null,"Caledon"]
["95FF14W1","Quilly","N09000002","Armagh City, Banbridge and Craigavon",493,691,793,821,98,347,817,639,"Rural",317331,351439,{"$error":"#N/A"},"N06000009","Lagan Valley",{"$f":"LOOKUP(OFFSET($D189,0,$B$12),{0,179,357,535,713;1,2,3,4,5})","v":4},{"$f":"LOOKUP(OFFSET($D189,0,$B$12),{0,90,179,268,357,446,535,624,713,802;1,2,3,4,5,6,7,8,9,10})","v":8},478,568,985,483,2514,"Northern Ireland",2514,null,null,null,null,null,null,null,"Callan Bridge"]
["95FF15W1","Rathfriland","N09000002","Armagh City, Banbridge and Craigavon",231,332,311,288,440,704,433,328,"Rural",319746,333489,{"$error":"#N/A"},"N06000015","South Down",{"$f":"LOOKUP(OFFSET($D190,0,$B$12),{0,179,357,535,713;1,2,3,4,5})","v":2},{"$f":"LOOKUP(OFFSET($D190,0,$B$12),{0,90,179,268,357,446,535,624,713,802;1,2,3,4,5,6,7,8,9,10})","v":4},555,854,777,532,2718,"Northern Ireland",2718,null,null,null,null,null,null,null,"Camlough"]
["95FF16W1","Seapatrick","N09000002","Armagh City, Banbridge and Craigavon",621,490,604,731,423,682,409,672,"Urban",312438,347186,{"$error":"#N/A"},"N06000017","Upper Bann",{"$f":"LOOKUP(OFFSET($D191,0,$B$12),{0,179,357,535,713;1,2,3,4,5})","v":4},{"$f":"LOOKUP(OFFSET($D191,0,$B$12),{0,90,179,268,357,446,535,624,713,802;1,2,3,4,5,6,7,8,9,10})","v":8},430,628,858,503,2418,"Northern Ireland",2418,null,null,null,null,null,null,null,"Camowen"]
["95FF17W1","The Cut","N09000002","Armagh City, Banbridge and Craigavon",190,119,130,184,763,69,15,120,"Urban",312786,345994,{"$error":"#N/A"},"N06000017","Upper Bann",{"$f":"LOOKUP(OFFSET($D192,0,$B$12),{0,179,357,535,713;1,2,3,4,5})","v":1},{"$f":"LOOKUP(OFFSET($D192,0,$B$12),{0,90,179,268,357,446,535,624,713,802;1,2,3,4,5,6,7,8,9,10})","v":2},287,508,520,349,1663,"Northern Ireland",1663,null,null,null,null,null,null,null,"Carn Hill_1"]
["95GG01S1","Andersonstown_1","N09000003","Belfast",786,159,143,387,867,505,408,388,"Urban",329622,370947,{"$error":"#N/A"},"N06000004","Belfast West",{"$f":"LOOKUP(OFFSET($D193,0,$B$12),{0,179,357,535,713;1,2,3,4,5})","v":3},{"$f":"LOOKUP(OFFSET($D193,0,$B$12),{0,90,179,268,357,446,535,624,713,802;1,2,3,4,5,6,7,8,9,10})","v":5},256,457,539,445,1697,"Northern Ireland",1697,null,null,null,null,null,null,null,"Carn Hill_2"]
["95GG01S2","Andersonstown_2","N09000003","Belfast",590,110,111,228,755,76,112,198,"Urban",329949,371231,{"$error":"#N/A"},"N06000004","Belfast West",{"$f":"LOOKUP(OFFSET($D194,0,$B$12),{0,179,357,535,713;1,2,3,4,5})","v":2},{"$f":"LOOKUP(OFFSET($D194,0,$B$12),{0,90,179,268,357,446,535,624,713,802;1,2,3,4,5,6,7,8,9,10})","v":3},235,376,473,358,1443,"Northern Ireland",1443,null,null,null,null,null,null,null,"Carnany"]
["95GG01S3","Andersonstown_3","N09000003","Belfast",439,226,151,295,869,262,331,320,"Urban",330276,371542,{"$error":"#N/A"},"N06000004","Belfast West",{"$f":"LOOKUP(OFFSET($D195,0,$B$12),{0,179,357,535,713;1,2,3,4,5})","v":2},{"$f":"LOOKUP(OFFSET($D195,0,$B$12),{0,90,179,268,357,446,535,624,713,802;1,2,3,4,5,6,7,8,9,10})","v":4},289,477,535,299,1600,"Northern Ireland",1600,null,null,null,null,null,null,null,"Carncastle"]
["95GG02S1","Ardoyne_1","N09000003","Belfast",29,19,19,58,814,78,74,16,"Urban",331598,376094,{"$error":"#N/A"},"N06000002","Belfast North",{"$f":"LOOKUP(OFFSET($D196,0,$B$12),{0,179,357,535,713;1,2,3,4,5})","v":1},{"$f":"LOOKUP(OFFSET($D196,0,$B$12),{0,90,179,268,357,446,535,624,713,802;1,2,3,4,5,6,7,8,9,10})","v":1},409,572,421,246,1648,"Northern Ireland",1648,null,null,null,null,null,null,null,"Carnlough"]
["95GG02S2","Ardoyne_2","N09000003","Belfast",8,15,12,39,827,66,108,4,"Urban",331891,376204,{"$error":"#N/A"},"N06000002","Belfast North",{"$f":"LOOKUP(OFFSET($D197,0,$B$12),{0,179,357,535,713;1,2,3,4,5})","v":1},{"$f":"LOOKUP(OFFSET($D197,0,$B$12),{0,90,179,268,357,446,535,624,713,802;1,2,3,4,5,6,7,8,9,10})","v":1},512,662,498,245,1917,"Northern Ireland",1917,null,null,null,null,null,null,null,"Carnmoney_1"]
["95GG02S3","Ardoyne_3","N09000003","Belfast",67,12,6,19,804,87,16,9,"Urban",332112,375901,{"$error":"#N/A"},"N06000002","Belfast North",{"$f":"LOOKUP(OFFSET($D198,0,$B$12),{0,179,357,535,713;1,2,3,4,5})","v":1},{"$f":"LOOKUP(OFFSET($D198,0,$B$12),{0,90,179,268,357,446,535,624,713,802;1,2,3,4,5,6,7,8,9,10})","v":1},634,764,633,268,2299,"Northern Ireland",2299,null,null,null,null,null,null,null,"Carnmoney_2"]
["95GG03S1","Ballyhackamore_1","N09000003","Belfast",813,784,671,835,853,142,394,811,"Urban",337767,373787,{"$error":"#N/A"},"N06000001","Belfast East",{"$f":"LOOKUP(OFFSET($D199,0,$B$12),{0,179,357,535,713;1,2,3,4,5})","v":5},{"$f":"LOOKUP(OFFSET($D199,0,$B$12),{0,90,179,268,357,446,535,624,713,802;1,2,3,4,5,6,7,8,9,10})","v":10},365,523,686,386,1960,"Northern Ireland",1960,null,null,null,null,null,null,null,"Carnmoon_&_Dunseverick"]
["95GG03S2","Ballyhackamore_2","N09000003","Belfast",777,775,766,798,890,209,370,823,"Urban",337655,374264,{"$error":"#N/A"},"N06000001","Belfast East",{"$f":"LOOKUP(OFFSET($D200,0,$B$12),{0,179,357,535,713;1,2,3,4,5})","v":5},{"$f":"LOOKUP(OFFSET($D200,0,$B$12),{0,90,179,268,357,446,535,624,713,802;1,2,3,4,5,6,7,8,9,10})","v":10},349,454,676,305,1784,"Northern Ireland",1784,null,null,null,null,null,null,null,"Carrigatuke"]
["95GG03S3","Ballyhackamore_3","N09000003","Belfast",646,591,473,364,700,254,233,601,"Urban",337278,374466,{"$error":"#N/A"},"N06000001","Belfast East",{"$f":"LOOKUP(OFFSET($D201,0,$B$12),{0,179,357,535,713;1,2,3,4,5})","v":4},{"$f":"LOOKUP(OFFSET($D201,0,$B$12),{0,90,179,268,357,446,535,624,713,802;1,2,3,4,5,6,7,8,9,10})","v":7},334,672,697,351,2054,"Northern Ireland",2054,null,null,null,null,null,null,null,"Carrowdore_1"]
["95GG04S1","Ballymacarrett_1","N09000003","Belfast",255,91,52,48,642,512,83,95,"Urban",335144,374262,{"$error":"#N/A"},"N06000001","Belfast East",{"$f":"LOOKUP(OFFSET($D202,0,$B$12),{0,179,357,535,713;1,2,3,4,5})","v":1},{"$f":"LOOKUP(OFFSET($D202,0,$B$12),{0,90,179,268,357,446,535,624,713,802;1,2,3,4,5,6,7,8,9,10})","v":2},355,632,486,220,1693,"Northern Ireland",1693,null,null,null,null,null,null,null,"Carrowdore_2"]
["95GG04S2","Ballymacarrett_2","N09000003","Belfast",474,60,33,25,855,276,31,78,"Urban",335382,374138,{"$error":"#N/A"},"N06000001","Belfast East",{"$f":"LOOKUP(OFFSET($D203,0,$B$12),{0,179,357,535,713;1,2,3,4,5})","v":1},{"$f":"LOOKUP(OFFSET($D203,0,$B$12),{0,90,179,268,357,446,535,624,713,802;1,2,3,4,5,6,7,8,9,10})","v":1},418,533,422,186,1559,"Northern Ireland",1559,null,null,null,null,null,null,null,"Carrowreagh_1"]
["95GG04S3","Ballymacarrett_3","N09000003","Belfast",80,64,43,17,801,335,53,40,"Urban",335743,374216,{"$error":"#N/A"},"N06000001","Belfast East",{"$f":"LOOKUP(OFFSET($D204,0,$B$12),{0,179,357,535,713;1,2,3,4,5})","v":1},{"$f":"LOOKUP(OFFSET($D204,0,$B$12),{0,90,179,268,357,446,535,624,713,802;1,2,3,4,5,6,7,8,9,10})","v":1},314,713,545,230,1802,"Northern Ireland",1802,null,null,null,null,null,null,null,"Carrowreagh_2"]
["95GG05S1","Ballynafeigh_1","N09000003","Belfast",743,486,430,684,847,31,154,579,"Urban",334762,371733,{"$error":"#N/A"},"N06000003","Belfast South",{"$f":"LOOKUP(OFFSET($D205,0,$B$12),{0,179,357,535,713;1,2,3,4,5})","v":4},{"$f":"LOOKUP(OFFSET($D205,0,$B$12),{0,90,179,268,357,446,535,624,713,802;1,2,3,4,5,6,7,8,9,10})","v":7},308,719,536,201,1764,"Northern Ireland",1764,null,null,null,null,null,null,null,"Carryduff East_1"]
["95GG05S2","Ballynafeigh_2","N09000003","Belfast",784,743,634,313,868,39,303,652,"Urban",334313,371786,{"$error":"#N/A"},"N06000003","Belfast South",{"$f":"LOOKUP(OFFSET($D206,0,$B$12),{0,179,357,535,713;1,2,3,4,5})","v":4},{"$f":"LOOKUP(OFFSET($D206,0,$B$12),{0,90,179,268,357,446,535,624,713,802;1,2,3,4,5,6,7,8,9,10})","v":8},314,892,608,134,1947,"Northern Ireland",1947,null,null,null,null,null,null,null,"Carryduff East_2"]
["95GG05S3","Ballynafeigh_3","N09000003","Belfast",251,405,284,151,882,147,88,270,"Urban",334347,372097,{"$error":"#N/A"},"N06000003","Belfast South",{"$f":"LOOKUP(OFFSET($D207,0,$B$12),{0,179,357,535,713;1,2,3,4,5})","v":2},{"$f":"LOOKUP(OFFSET($D207,0,$B$12),{0,90,179,268,357,446,535,624,713,802;1,2,3,4,5,6,7,8,9,10})","v":4},325,1151,550,174,2200,"Northern Ireland",2200,null,null,null,null,null,null,null,"Carryduff West_1"]
["95GG06S1","Ballysillan_1","N09000003","Belfast",138,193,144,47,787,68,84,109,"Urban",331073,377342,{"$error":"#N/A"},"N06000002","Belfast North",{"$f":"LOOKUP(OFFSET($D208,0,$B$12),{0,179,357,535,713;1,2,3,4,5})","v":1},{"$f":"LOOKUP(OFFSET($D208,0,$B$12),{0,90,179,268,357,446,535,624,713,802;1,2,3,4,5,6,7,8,9,10})","v":2},441,618,536,311,1907,"Northern Ireland",1907,null,null,null,null,null,null,null,"Carryduff West_2"]
["95GG06S2","Ballysillan_2","N09000003","Belfast",543,224,205,146,766,63,234,268,"Urban",331540,377416,{"$error":"#N/A"},"N06000002","Belfast North",{"$f":"LOOKUP(OFFSET($D209,0,$B$12),{0,179,357,535,713;1,2,3,4,5})","v":2},{"$f":"LOOKUP(OFFSET($D209,0,$B$12),{0,90,179,268,357,446,535,624,713,802;1,2,3,4,5,6,7,8,9,10})","v":4},302,585,585,251,1724,"Northern Ireland",1724,null,null,null,null,null,null,null,"Castle Demesne"]
["95GG06S3","Ballysillan_3","N09000003","Belfast",463,359,281,270,676,616,367,433,"Urban",331637,377770,{"$error":"#N/A"},"N06000002","Belfast North",{"$f":"LOOKUP(OFFSET($D210,0,$B$12),{0,179,357,535,713;1,2,3,4,5})","v":3},{"$f":"LOOKUP(OFFSET($D210,0,$B$12),{0,90,179,268,357,446,535,624,713,802;1,2,3,4,5,6,7,8,9,10})","v":5},471,657,728,212,2068,"Northern Ireland",2068,null,null,null,null,null,null,null,"Castlecaulfield"]
["95GG07S1","Beechmount_1","N09000003","Belfast",674,70,55,132,744,4,80,121,"Urban",331603,373141,{"$error":"#N/A"},"N06000004","Belfast West",{"$f":"LOOKUP(OFFSET($D211,0,$B$12),{0,179,357,535,713;1,2,3,4,5})","v":1},{"$f":"LOOKUP(OFFSET($D211,0,$B$12),{0,90,179,268,357,446,535,624,713,802;1,2,3,4,5,6,7,8,9,10})","v":2},415,692,525,244,1876,"Northern Ireland",1876,null,null,null,null,null,null,null,"Castlecoole_1"]
["95GG07S2","Beechmount_2","N09000003","Belfast",188,54,37,66,878,29,210,66,"Urban",331693,373590,{"$error":"#N/A"},"N06000004","Belfast West",{"$f":"LOOKUP(OFFSET($D212,0,$B$12),{0,179,357,535,713;1,2,3,4,5})","v":1},{"$f":"LOOKUP(OFFSET($D212,0,$B$12),{0,90,179,268,357,446,535,624,713,802;1,2,3,4,5,6,7,8,9,10})","v":1},464,679,524,196,1863,"Northern Ireland",1863,null,null,null,null,null,null,null,"Castlecoole_2"]
["95GG07S3","Beechmount_3","N09000003","Belfast",508,113,99,162,796,111,91,181,"Urban",331487,373835,{"$error":"#N/A"},"N06000004","Belfast West",{"$f":"LOOKUP(OFFSET($D213,0,$B$12),{0,179,357,535,713;1,2,3,4,5})","v":2},{"$f":"LOOKUP(OFFSET($D213,0,$B$12),{0,90,179,268,357,446,535,624,713,802;1,2,3,4,5,6,7,8,9,10})","v":3},332,517,553,209,1611,"Northern Ireland",1611,null,null,null,null,null,null,null,"Castledawson_1"]
["95GG08S1","Bellevue_1","N09000003","Belfast",458,470,494,588,565,476,274,570,"Urban",333081,380775,{"$error":"#N/A"},"N06000002","Belfast North",{"$f":"LOOKUP(OFFSET($D214,0,$B$12),{0,179,357,535,713;1,2,3,4,5})","v":4},{"$f":"LOOKUP(OFFSET($D214,0,$B$12),{0,90,179,268,357,446,535,624,713,802;1,2,3,4,5,6,7,8,9,10})","v":7},291,355,465,277,1388,"Northern Ireland",1388,null,null,null,null,null,null,null,"Castledawson_2"]
["95GG08S2","Bellevue_2","N09000003","Belfast",101,155,157,127,703,177,160,123,"Urban",334026,379681,{"$error":"#N/A"},"N06000002","Belfast North",{"$f":"LOOKUP(OFFSET($D215,0,$B$12),{0,179,357,535,713;1,2,3,4,5})","v":1},{"$f":"LOOKUP(OFFSET($D215,0,$B$12),{0,90,179,268,357,446,535,624,713,802;1,2,3,4,5,6,7,8,9,10})","v":2},395,613,553,246,1807,"Northern Ireland",1807,null,null,null,null,null,null,null,"Castlederg"]
["95GG08S3","Bellevue_3","N09000003","Belfast",292,290,271,204,656,830,186,315,"Urban",333539,380183,{"$error":"#N/A"},"N06000002","Belfast North",{"$f":"LOOKUP(OFFSET($D216,0,$B$12),{0,179,357,535,713;1,2,3,4,5})","v":2},{"$f":"LOOKUP(OFFSET($D216,0,$B$12),{0,90,179,268,357,446,535,624,713,802;1,2,3,4,5,6,7,8,9,10})","v":4},445,746,539,234,1964,"Northern Ireland",1964,null,null,null,null,null,null,null,"Castlerock_1"]
["95GG09S1","Belmont_1","N09000003","Belfast",882,875,859,866,631,841,792,890,"Urban",338020,375004,{"$error":"#N/A"},"N06000001","Belfast East",{"$f":"LOOKUP(OFFSET($D217,0,$B$12),{0,179,357,535,713;1,2,3,4,5})","v":5},{"$f":"LOOKUP(OFFSET($D217,0,$B$12),{0,90,179,268,357,446,535,624,713,802;1,2,3,4,5,6,7,8,9,10})","v":10},400,515,798,453,2166,"Northern Ireland",2166,null,null,null,null,null,null,null,"Castlerock_2"]
["95GG09S2","Belmont_2","N09000003","Belfast",841,618,531,508,569,770,652,747,"Urban",338165,375663,{"$error":"#N/A"},"N06000001","Belfast East",{"$f":"LOOKUP(OFFSET($D218,0,$B$12),{0,179,357,535,713;1,2,3,4,5})","v":5},{"$f":"LOOKUP(OFFSET($D218,0,$B$12),{0,90,179,268,357,446,535,624,713,802;1,2,3,4,5,6,7,8,9,10})","v":9},281,546,649,397,1873,"Northern Ireland",1873,null,null,null,null,null,null,null,"Castleview_1"]
["95GG09S3","Belmont_3","N09000003","Belfast",637,358,227,170,574,516,260,401,"Urban",338682,376511,{"$error":"#N/A"},"N06000001","Belfast East",{"$f":"LOOKUP(OFFSET($D219,0,$B$12),{0,179,357,535,713;1,2,3,4,5})","v":3},{"$f":"LOOKUP(OFFSET($D219,0,$B$12),{0,90,179,268,357,446,535,624,713,802;1,2,3,4,5,6,7,8,9,10})","v":5},493,728,702,278,2202,"Northern Ireland",2202,null,null,null,null,null,null,null,"Castleview_2"]
["95GG10S1","Blackstaff_1","N09000003","Belfast",35,213,186,22,500,8,212,58,"Urban",332253,372709,{"$error":"#N/A"},"N06000003","Belfast South",{"$f":"LOOKUP(OFFSET($D220,0,$B$12),{0,179,357,535,713;1,2,3,4,5})","v":1},{"$f":"LOOKUP(OFFSET($D220,0,$B$12),{0,90,179,268,357,446,535,624,713,802;1,2,3,4,5,6,7,8,9,10})","v":1},349,833,536,208,1926,"Northern Ireland",1926,null,null,null,null,null,null,null,"Castleview_3"]
["95GG10S2","Blackstaff_2","N09000003","Belfast",141,215,133,36,641,54,71,102,"Urban",332446,373120,{"$error":"#N/A"},"N06000003","Belfast South",{"$f":"LOOKUP(OFFSET($D221,0,$B$12),{0,179,357,535,713;1,2,3,4,5})","v":1},{"$f":"LOOKUP(OFFSET($D221,0,$B$12),{0,90,179,268,357,446,535,624,713,802;1,2,3,4,5,6,7,8,9,10})","v":2},478,1114,584,200,2376,"Northern Ireland",2376,null,null,null,null,null,null,null,"Castlewellan_1"]
["95GG11S1","Bloomfield_1_Belfast","N09000003","Belfast",218,234,165,60,794,34,48,139,"Urban",336556,373889,{"$error":"#N/A"},"N06000001","Belfast East",{"$f":"LOOKUP(OFFSET($D222,0,$B$12),{0,179,357,535,713;1,2,3,4,5})","v":1},{"$f":"LOOKUP(OFFSET($D222,0,$B$12),{0,90,179,268,357,446,535,624,713,802;1,2,3,4,5,6,7,8,9,10})","v":2},374,849,514,235,1973,"Northern Ireland",1973,null,null,null,null,null,null,null,"Castlewellan_2"]
["95GG11S2","Bloomfield_2_Belfast","N09000003","Belfast",644,586,554,671,843,67,337,656,"Urban",336960,373744,{"$error":"#N/A"},"N06000001","Belfast East",{"$f":"LOOKUP(OFFSET($D223,0,$B$12),{0,179,357,535,713;1,2,3,4,5})","v":4},{"$f":"LOOKUP(OFFSET($D223,0,$B$12),{0,90,179,268,357,446,535,624,713,802;1,2,3,4,5,6,7,8,9,10})","v":8},306,533,546,262,1647,"Northern Ireland",1647,null,null,null,null,null,null,null,"Cathedral_1"]
["95GG11S3","Bloomfield_3_Belfast","N09000003","Belfast",240,302,259,143,851,56,87,215,"Urban",336708,373516,{"$error":"#N/A"},"N06000001","Belfast East",{"$f":"LOOKUP(OFFSET($D224,0,$B$12),{0,179,357,535,713;1,2,3,4,5})","v":2},{"$f":"LOOKUP(OFFSET($D224,0,$B$12),{0,90,179,268,357,446,535,624,713,802;1,2,3,4,5,6,7,8,9,10})","v":3},272,780,535,231,1817,"Northern Ireland",1817,null,null,null,null,null,null,null,"Cathedral_2"]
["95GG12S1","Botanic_1","N09000003","Belfast",375,851,850,833,833,2,70,580,"Urban",333226,372454,{"$error":"#N/A"},"N06000003","Belfast South",{"$f":"LOOKUP(OFFSET($D225,0,$B$12),{0,179,357,535,713;1,2,3,4,5})","v":4},{"$f":"LOOKUP(OFFSET($D225,0,$B$12),{0,90,179,268,357,446,535,624,713,802;1,2,3,4,5,6,7,8,9,10})","v":7},119,1177,179,50,1526,"Northern Ireland",1526,null,null,null,null,null,null,null,"Cavehill_1"]
["95GG12S2","Botanic_2","N09000003","Belfast",505,883,811,241,687,1,11,457,"Urban",333969,372388,{"$f":"IF(B226=$F$27,O226,NA())","v":{"$error":"#N/A"}},"N06000003","Belfast South",{"$f":"LOOKUP(OFFSET($D226,0,$B$12),{0,179,357,535,713;1,2,3,4,5})","v":3},{"$f":"LOOKUP(OFFSET($D226,0,$B$12),{0,90,179,268,357,446,535,624,713,802;1,2,3,4,5,6,7,8,9,10})","v":6},130,1799,198,57,2184,"Northern Ireland",{"$f":"CHOOSE($K$5,$Y226,IF($D226=$B$27,$Y226,\"\"),IF($R226=$B$27,$Y226,\"\"))","v":2184},null,null,null,null,null,null,null,"Cavehill_2"]
["95GG12S3","Botanic_3","N09000003","Belfast",481,856,775,303,815,11,4,481,"Urban",334042,372662,{"$error":"#N/A"},"N06000003","Belfast South",{"$f":"LOOKUP(OFFSET($D227,0,$B$12),{0,179,357,535,713;1,2,3,4,5})","v":3},{"$f":"LOOKUP(OFFSET($D227,0,$B$12),{0,90,179,268,357,446,535,624,713,802;1,2,3,4,5,6,7,8,9,10})","v":6},153,1738,232,68,2192,"Northern Ireland",2192,null,null,null,null,null,null,null,"Cavehill_3"]
["95GG12S4","Botanic_4","N09000003","Belfast",107,588,246,120,786,14,105,189,"Urban",333725,372926,{"$error":"#N/A"},"N06000003","Belfast South",{"$f":"LOOKUP(OFFSET($D228,0,$B$12),{0,179,357,535,713;1,2,3,4,5})","v":2},{"$f":"LOOKUP(OFFSET($D228,0,$B$12),{0,90,179,268,357,446,535,624,713,802;1,2,3,4,5,6,7,8,9,10})","v":3},98,1471,233,39,1841,"Northern Ireland",1841,null,null,null,null,null,null,null,"Caw"]
["95GG12S5","Botanic_5","N09000003","Belfast",221,149,58,44,713,27,13,79,"Urban",334369,372872,{"$error":"#N/A"},"N06000003","Belfast South",{"$f":"LOOKUP(OFFSET($D229,0,$B$12),{0,179,357,535,713;1,2,3,4,5})","v":1},{"$f":"LOOKUP(OFFSET($D229,0,$B$12),{0,90,179,268,357,446,535,624,713,802;1,2,3,4,5,6,7,8,9,10})","v":1},543,1141,607,164,2456,"Northern Ireland",2456,null,null,null,null,null,null,null,"Central_Ards"]
["95GG13S1","Castleview_1","N09000003","Belfast",165,111,155,91,661,157,142,119,"Urban",333967,378080,{"$error":"#N/A"},"N06000002","Belfast North",{"$f":"LOOKUP(OFFSET($D230,0,$B$12),{0,179,357,535,713;1,2,3,4,5})","v":1},{"$f":"LOOKUP(OFFSET($D230,0,$B$12),{0,90,179,268,357,446,535,624,713,802;1,2,3,4,5,6,7,8,9,10})","v":2},251,443,459,191,1344,"Northern Ireland",1344,null,null,null,null,null,null,null,"Central_Coleraine"]
["95GG13S2","Castleview_2","N09000003","Belfast",607,709,615,805,651,97,523,711,"Urban",333585,378486,{"$error":"#N/A"},"N06000002","Belfast North",{"$f":"LOOKUP(OFFSET($D231,0,$B$12),{0,179,357,535,713;1,2,3,4,5})","v":4},{"$f":"LOOKUP(OFFSET($D231,0,$B$12),{0,90,179,268,357,446,535,624,713,802;1,2,3,4,5,6,7,8,9,10})","v":8},354,471,549,313,1687,"Northern Ireland",1687,null,null,null,null,null,null,null,"Central_Larne"]
["95GG13S3","Castleview_3","N09000003","Belfast",589,342,256,334,702,578,247,463,"Urban",333979,378813,{"$error":"#N/A"},"N06000002","Belfast North",{"$f":"LOOKUP(OFFSET($D232,0,$B$12),{0,179,357,535,713;1,2,3,4,5})","v":3},{"$f":"LOOKUP(OFFSET($D232,0,$B$12),{0,90,179,268,357,446,535,624,713,802;1,2,3,4,5,6,7,8,9,10})","v":6},292,495,530,328,1646,"Northern Ireland",1646,null,null,null,null,null,null,null,"Charlemont"]
["95GG14S1","Cavehill_1","N09000003","Belfast",865,768,749,755,541,601,241,819,"Urban",332294,377961,{"$error":"#N/A"},"N06000002","Belfast North",{"$f":"LOOKUP(OFFSET($D233,0,$B$12),{0,179,357,535,713;1,2,3,4,5})","v":5},{"$f":"LOOKUP(OFFSET($D233,0,$B$12),{0,90,179,268,357,446,535,624,713,802;1,2,3,4,5,6,7,8,9,10})","v":10},312,453,549,299,1613,"Northern Ireland",1613,null,null,null,null,null,null,null,"Cherryvalley_1"]
["95GG14S2","Cavehill_2","N09000003","Belfast",517,778,844,844,550,231,335,736,"Urban",332912,378321,{"$error":"#N/A"},"N06000002","Belfast North",{"$f":"LOOKUP(OFFSET($D234,0,$B$12),{0,179,357,535,713;1,2,3,4,5})","v":5},{"$f":"LOOKUP(OFFSET($D234,0,$B$12),{0,90,179,268,357,446,535,624,713,802;1,2,3,4,5,6,7,8,9,10})","v":9},265,434,578,298,1574,"Northern Ireland",1574,null,null,null,null,null,null,null,"Cherryvalley_2"]
["95GG14S3","Cavehill_3","N09000003","Belfast",885,780,782,778,441,868,329,848,"Urban",332296,378404,{"$error":"#N/A"},"N06000002","Belfast North",{"$f":"LOOKUP(OFFSET($D235,0,$B$12),{0,179,357,535,713;1,2,3,4,5})","v":5},{"$f":"LOOKUP(OFFSET($D235,0,$B$12),{0,90,179,268,357,446,535,624,713,802;1,2,3,4,5,6,7,8,9,10})","v":10},331,493,580,261,1664,"Northern Ireland",1664,null,null,null,null,null,null,null,"Cherryvalley_3"]
["95GG15S1","Cherryvalley_1","N09000003","Belfast",877,867,849,883,602,167,886,873,"Urban",338818,373051,{"$error":"#N/A"},"N06000001","Belfast East",{"$f":"LOOKUP(OFFSET($D236,0,$B$12),{0,179,357,535,713;1,2,3,4,5})","v":5},{"$f":"LOOKUP(OFFSET($D236,0,$B$12),{0,90,179,268,357,446,535,624,713,802;1,2,3,4,5,6,7,8,9,10})","v":10},372,401,723,510,2007,"Northern Ireland",2007,null,null,null,null,null,null,null,"Chichester Park_1"]
["95GG15S2","Cherryvalley_2","N09000003","Belfast",824,865,831,868,829,496,602,885,"Urban",339294,373646,{"$error":"#N/A"},"N06000001","Belfast East",{"$f":"LOOKUP(OFFSET($D237,0,$B$12),{0,179,357,535,713;1,2,3,4,5})","v":5},{"$f":"LOOKUP(OFFSET($D237,0,$B$12),{0,90,179,268,357,446,535,624,713,802;1,2,3,4,5,6,7,8,9,10})","v":10},344,595,711,401,2051,"Northern Ireland",2051,null,null,null,null,null,null,null,"Chichester Park_2"]
["95GG15S3","Cherryvalley_3","N09000003","Belfast",775,427,457,394,740,669,460,640,"Urban",340284,373745,{"$error":"#N/A"},"N06000001","Belfast East",{"$f":"LOOKUP(OFFSET($D238,0,$B$12),{0,179,357,535,713;1,2,3,4,5})","v":4},{"$f":"LOOKUP(OFFSET($D238,0,$B$12),{0,90,179,268,357,446,535,624,713,802;1,2,3,4,5,6,7,8,9,10})","v":8},353,553,637,419,1963,"Northern Ireland",1963,null,null,null,null,null,null,null,"Chichester Park_3"]
["95GG16S1","Chichester Park_1","N09000003","Belfast",196,153,116,141,848,12,60,122,"Urban",333282,377001,{"$error":"#N/A"},"N06000002","Belfast North",{"$f":"LOOKUP(OFFSET($D239,0,$B$12),{0,179,357,535,713;1,2,3,4,5})","v":1},{"$f":"LOOKUP(OFFSET($D239,0,$B$12),{0,90,179,268,357,446,535,624,713,802;1,2,3,4,5,6,7,8,9,10})","v":2},403,775,687,224,2089,"Northern Ireland",2089,null,null,null,null,null,null,null,"Church"]
["95GG16S2","Chichester Park_2","N09000003","Belfast",549,242,234,421,870,178,122,377,"Urban",333022,377411,{"$error":"#N/A"},"N06000002","Belfast North",{"$f":"LOOKUP(OFFSET($D240,0,$B$12),{0,179,357,535,713;1,2,3,4,5})","v":3},{"$f":"LOOKUP(OFFSET($D240,0,$B$12),{0,90,179,268,357,446,535,624,713,802;1,2,3,4,5,6,7,8,9,10})","v":5},391,606,667,277,1940,"Northern Ireland",1940,null,null,null,null,null,null,null,"Churchill_1"]
["95GG16S3","Chichester Park_3","N09000003","Belfast",721,476,403,400,578,180,282,559,"Urban",332784,377548,{"$error":"#N/A"},"N06000002","Belfast North",{"$f":"LOOKUP(OFFSET($D241,0,$B$12),{0,179,357,535,713;1,2,3,4,5})","v":4},{"$f":"LOOKUP(OFFSET($D241,0,$B$12),{0,90,179,268,357,446,535,624,713,802;1,2,3,4,5,6,7,8,9,10})","v":7},331,431,484,206,1452,"Northern Ireland",1452,null,null,null,null,null,null,null,"Churchill_2"]
["95GG17S1","Cliftonville_1","N09000003","Belfast",161,75,74,183,638,109,100,98,"Urban",332405,376428,{"$error":"#N/A"},"N06000002","Belfast North",{"$f":"LOOKUP(OFFSET($D242,0,$B$12),{0,179,357,535,713;1,2,3,4,5})","v":1},{"$f":"LOOKUP(OFFSET($D242,0,$B$12),{0,90,179,268,357,446,535,624,713,802;1,2,3,4,5,6,7,8,9,10})","v":2},631,814,598,200,2242,"Northern Ireland",2242,null,null,null,null,null,null,null,"Churchland"]
["95GG17S2","Cliftonville_2","N09000003","Belfast",725,361,334,580,888,55,202,515,"Urban",332043,376821,{"$error":"#N/A"},"N06000002","Belfast North",{"$f":"LOOKUP(OFFSET($D243,0,$B$12),{0,179,357,535,713;1,2,3,4,5})","v":3},{"$f":"LOOKUP(OFFSET($D243,0,$B$12),{0,90,179,268,357,446,535,624,713,802;1,2,3,4,5,6,7,8,9,10})","v":6},260,434,521,305,1519,"Northern Ireland",1519,null,null,null,null,null,null,null,"Clady"]
["95GG17S3","Cliftonville_3","N09000003","Belfast",219,120,96,129,864,398,155,150,"Urban",331662,376621,{"$error":"#N/A"},"N06000002","Belfast North",{"$f":"LOOKUP(OFFSET($D244,0,$B$12),{0,179,357,535,713;1,2,3,4,5})","v":1},{"$f":"LOOKUP(OFFSET($D244,0,$B$12),{0,90,179,268,357,446,535,624,713,802;1,2,3,4,5,6,7,8,9,10})","v":2},481,584,477,217,1759,"Northern Ireland",1759,null,null,null,null,null,null,null,"Clanabogan"]
["95GG18S1","Clonard_1","N09000003","Belfast",73,49,41,101,737,100,131,50,"Urban",331780,374228,{"$error":"#N/A"},"N06000004","Belfast West",{"$f":"LOOKUP(OFFSET($D245,0,$B$12),{0,179,357,535,713;1,2,3,4,5})","v":1},{"$f":"LOOKUP(OFFSET($D245,0,$B$12),{0,90,179,268,357,446,535,624,713,802;1,2,3,4,5,6,7,8,9,10})","v":1},649,851,691,295,2486,"Northern Ireland",2486,null,null,null,null,null,null,null,"Clandeboye_1"]
["95GG18S2","Clonard_2","N09000003","Belfast",293,46,15,73,885,40,14,55,"Urban",332152,374089,{"$error":"#N/A"},"N06000004","Belfast West",{"$f":"LOOKUP(OFFSET($D246,0,$B$12),{0,179,357,535,713;1,2,3,4,5})","v":1},{"$f":"LOOKUP(OFFSET($D246,0,$B$12),{0,90,179,268,357,446,535,624,713,802;1,2,3,4,5,6,7,8,9,10})","v":1},531,971,755,263,2520,"Northern Ireland",2520,null,null,null,null,null,null,null,"Clandeboye_2"]
["95GG19S1","Crumlin_1_Belfast","N09000003","Belfast",34,25,34,20,667,422,218,24,"Urban",332417,375057,{"$error":"#N/A"},"N06000002","Belfast North",{"$f":"LOOKUP(OFFSET($D247,0,$B$12),{0,179,357,535,713;1,2,3,4,5})","v":1},{"$f":"LOOKUP(OFFSET($D247,0,$B$12),{0,90,179,268,357,446,535,624,713,802;1,2,3,4,5,6,7,8,9,10})","v":1},336,501,622,517,1976,"Northern Ireland",1976,null,null,null,null,null,null,null,"Clandeboye_3"]
["95GG19S2","Crumlin_2_Belfast","N09000003","Belfast",30,56,20,10,749,168,68,21,"Urban",332501,375447,{"$error":"#N/A"},"N06000002","Belfast North",{"$f":"LOOKUP(OFFSET($D248,0,$B$12),{0,179,357,535,713;1,2,3,4,5})","v":1},{"$f":"LOOKUP(OFFSET($D248,0,$B$12),{0,90,179,268,357,446,535,624,713,802;1,2,3,4,5,6,7,8,9,10})","v":1},732,985,706,354,2776,"Northern Ireland",2776,null,null,null,null,null,null,null,"Clare"]
["95GG20S1","Duncairn_1","N09000003","Belfast",47,106,73,35,515,121,135,49,"Urban",334109,375865,{"$error":"#N/A"},"N06000002","Belfast North",{"$f":"LOOKUP(OFFSET($D249,0,$B$12),{0,179,357,535,713;1,2,3,4,5})","v":1},{"$f":"LOOKUP(OFFSET($D249,0,$B$12),{0,90,179,268,357,446,535,624,713,802;1,2,3,4,5,6,7,8,9,10})","v":1},494,1435,894,357,3180,"Northern Ireland",3180,null,null,null,null,null,null,null,"Claudy_1"]
["95GG20S2","Duncairn_2","N09000003","Belfast",44,78,89,56,760,360,43,53,"Urban",333815,376403,{"$error":"#N/A"},"N06000002","Belfast North",{"$f":"LOOKUP(OFFSET($D250,0,$B$12),{0,179,357,535,713;1,2,3,4,5})","v":1},{"$f":"LOOKUP(OFFSET($D250,0,$B$12),{0,90,179,268,357,446,535,624,713,802;1,2,3,4,5,6,7,8,9,10})","v":1},532,711,603,305,2150,"Northern Ireland",2150,null,null,null,null,null,null,null,"Claudy_2"]
["95GG21S1","Falls_1","N09000003","Belfast",211,27,14,27,818,136,258,41,"Urban",332490,373845,{"$error":"#N/A"},"N06000004","Belfast West",{"$f":"LOOKUP(OFFSET($D251,0,$B$12),{0,179,357,535,713;1,2,3,4,5})","v":1},{"$f":"LOOKUP(OFFSET($D251,0,$B$12),{0,90,179,268,357,446,535,624,713,802;1,2,3,4,5,6,7,8,9,10})","v":1},300,478,447,225,1450,"Northern Ireland",1450,null,null,null,null,null,null,null,"Cliftonville_1"]
["95GG21S2","Falls_2","N09000003","Belfast",233,36,7,9,875,79,2,30,"Urban",332784,374021,{"$error":"#N/A"},"N06000004","Belfast West",{"$f":"LOOKUP(OFFSET($D252,0,$B$12),{0,179,357,535,713;1,2,3,4,5})","v":1},{"$f":"LOOKUP(OFFSET($D252,0,$B$12),{0,90,179,268,357,446,535,624,713,802;1,2,3,4,5,6,7,8,9,10})","v":1},480,596,458,201,1735,"Northern Ireland",1735,null,null,null,null,null,null,null,"Cliftonville_2"]
["95GG21S3","Falls_3","N09000003","Belfast",88,30,11,46,788,258,9,29,"Urban",333119,374274,{"$error":"#N/A"},"N06000004","Belfast West",{"$f":"LOOKUP(OFFSET($D253,0,$B$12),{0,179,357,535,713;1,2,3,4,5})","v":1},{"$f":"LOOKUP(OFFSET($D253,0,$B$12),{0,90,179,268,357,446,535,624,713,802;1,2,3,4,5,6,7,8,9,10})","v":1},388,771,589,245,1993,"Northern Ireland",1993,null,null,null,null,null,null,null,"Cliftonville_3"]
["95GG22S1","Falls Park_1","N09000003","Belfast",692,212,244,293,873,33,25,297,"Urban",330856,372596,{"$error":"#N/A"},"N06000004","Belfast West",{"$f":"LOOKUP(OFFSET($D254,0,$B$12),{0,179,357,535,713;1,2,3,4,5})","v":2},{"$f":"LOOKUP(OFFSET($D254,0,$B$12),{0,90,179,268,357,446,535,624,713,802;1,2,3,4,5,6,7,8,9,10})","v":4},295,531,541,323,1690,"Northern Ireland",1690,null,null,null,null,null,null,null,"Clipperstown"]
["95GG22S2","Falls Park_2","N09000003","Belfast",753,185,142,428,863,504,256,393,"Urban",330423,372098,{"$error":"#N/A"},"N06000004","Belfast West",{"$f":"LOOKUP(OFFSET($D255,0,$B$12),{0,179,357,535,713;1,2,3,4,5})","v":3},{"$f":"LOOKUP(OFFSET($D255,0,$B$12),{0,90,179,268,357,446,535,624,713,802;1,2,3,4,5,6,7,8,9,10})","v":5},303,537,622,454,1915,"Northern Ireland",1915,null,null,null,null,null,null,null,"Clogh Mills"]
["95GG22S3","Falls Park_3","N09000003","Belfast",650,197,140,340,874,306,191,338,"Urban",330136,372553,{"$error":"#N/A"},"N06000004","Belfast West",{"$f":"LOOKUP(OFFSET($D256,0,$B$12),{0,179,357,535,713;1,2,3,4,5})","v":2},{"$f":"LOOKUP(OFFSET($D256,0,$B$12),{0,90,179,268,357,446,535,624,713,802;1,2,3,4,5,6,7,8,9,10})","v":4},344,472,581,305,1702,"Northern Ireland",1702,null,null,null,null,null,null,null,"Clogher"]
["95GG23S1","Finaghy_1","N09000003","Belfast",828,781,809,816,472,451,847,856,"Urban",330545,368913,{"$error":"#N/A"},"N06000003","Belfast South",{"$f":"LOOKUP(OFFSET($D257,0,$B$12),{0,179,357,535,713;1,2,3,4,5})","v":5},{"$f":"LOOKUP(OFFSET($D257,0,$B$12),{0,90,179,268,357,446,535,624,713,802;1,2,3,4,5,6,7,8,9,10})","v":10},262,330,477,328,1398,"Northern Ireland",1398,null,null,null,null,null,null,null,"Clonallan_1"]
["95GG23S2","Finaghy_2","N09000003","Belfast",858,764,713,875,877,259,457,854,"Urban",330106,369695,{"$error":"#N/A"},"N06000003","Belfast South",{"$f":"LOOKUP(OFFSET($D258,0,$B$12),{0,179,357,535,713;1,2,3,4,5})","v":5},{"$f":"LOOKUP(OFFSET($D258,0,$B$12),{0,90,179,268,357,446,535,624,713,802;1,2,3,4,5,6,7,8,9,10})","v":10},262,417,533,327,1538,"Northern Ireland",1538,null,null,null,null,null,null,null,"Clonallan_2"]
["95GG23S3","Finaghy_3","N09000003","Belfast",787,741,703,819,789,552,678,859,"Urban",330601,369266,{"$error":"#N/A"},"N06000003","Belfast South",{"$f":"LOOKUP(OFFSET($D259,0,$B$12),{0,179,357,535,713;1,2,3,4,5})","v":5},{"$f":"LOOKUP(OFFSET($D259,0,$B$12),{0,90,179,268,357,446,535,624,713,802;1,2,3,4,5,6,7,8,9,10})","v":10},288,492,498,360,1639,"Northern Ireland",1639,null,null,null,null,null,null,null,"Clonard_1"]
["95GG24S1","Fortwilliam_1","N09000003","Belfast",855,418,405,797,856,266,360,685,"Urban",333548,377347,{"$error":"#N/A"},"N06000002","Belfast North",{"$f":"LOOKUP(OFFSET($D260,0,$B$12),{0,179,357,535,713;1,2,3,4,5})","v":4},{"$f":"LOOKUP(OFFSET($D260,0,$B$12),{0,90,179,268,357,446,535,624,713,802;1,2,3,4,5,6,7,8,9,10})","v":8},208,310,450,363,1331,"Northern Ireland",1331,null,null,null,null,null,null,null,"Clonard_2"]
["95GG24S2","Fortwilliam_2","N09000003","Belfast",417,268,277,266,824,32,143,298,"Urban",333955,377125,{"$error":"#N/A"},"N06000002","Belfast North",{"$f":"LOOKUP(OFFSET($D261,0,$B$12),{0,179,357,535,713;1,2,3,4,5})","v":2},{"$f":"LOOKUP(OFFSET($D261,0,$B$12),{0,90,179,268,357,446,535,624,713,802;1,2,3,4,5,6,7,8,9,10})","v":4},264,489,530,281,1563,"Northern Ireland",1563,null,null,null,null,null,null,null,"Clondermot_1"]
["95GG24S3","Fortwilliam_3","N09000003","Belfast",699,480,464,630,779,89,293,611,"Urban",333760,377771,{"$error":"#N/A"},"N06000002","Belfast North",{"$f":"LOOKUP(OFFSET($D262,0,$B$12),{0,179,357,535,713;1,2,3,4,5})","v":4},{"$f":"LOOKUP(OFFSET($D262,0,$B$12),{0,90,179,268,357,446,535,624,713,802;1,2,3,4,5,6,7,8,9,10})","v":7},284,421,551,321,1577,"Northern Ireland",1577,null,null,null,null,null,null,null,"Clondermot_2"]
["95GG25S1","Glen Road_1","N09000003","Belfast",424,82,87,220,835,470,164,185,"Urban",329717,372075,{"$error":"#N/A"},"N06000004","Belfast West",{"$f":"LOOKUP(OFFSET($D263,0,$B$12),{0,179,357,535,713;1,2,3,4,5})","v":2},{"$f":"LOOKUP(OFFSET($D263,0,$B$12),{0,90,179,268,357,446,535,624,713,802;1,2,3,4,5,6,7,8,9,10})","v":3},561,799,739,387,2486,"Northern Ireland",2486,null,null,null,null,null,null,null,"Cloughfern_1"]
["95GG25S2","Glen Road_2","N09000003","Belfast",526,160,132,300,819,96,340,267,"Urban",329604,371646,{"$error":"#N/A"},"N06000004","Belfast West",{"$f":"LOOKUP(OFFSET($D264,0,$B$12),{0,179,357,535,713;1,2,3,4,5})","v":2},{"$f":"LOOKUP(OFFSET($D264,0,$B$12),{0,90,179,268,357,446,535,624,713,802;1,2,3,4,5,6,7,8,9,10})","v":3},336,590,605,233,1764,"Northern Ireland",1764,null,null,null,null,null,null,null,"Cloughfern_2"]
["95GG25S3","Glen Road_3","N09000003","Belfast",246,125,106,126,859,199,296,158,"Urban",329092,371570,{"$error":"#N/A"},"N06000004","Belfast West",{"$f":"LOOKUP(OFFSET($D265,0,$B$12),{0,179,357,535,713;1,2,3,4,5})","v":1},{"$f":"LOOKUP(OFFSET($D265,0,$B$12),{0,90,179,268,357,446,535,624,713,802;1,2,3,4,5,6,7,8,9,10})","v":2},333,530,466,159,1487,"Northern Ireland",1487,null,null,null,null,null,null,null,"Coagh"]
["95GG26S1","Glencairn_1","N09000003","Belfast",353,84,102,15,332,237,219,87,"Urban",330454,376093,{"$error":"#N/A"},"N06000004","Belfast West",{"$f":"LOOKUP(OFFSET($D266,0,$B$12),{0,179,357,535,713;1,2,3,4,5})","v":1},{"$f":"LOOKUP(OFFSET($D266,0,$B$12),{0,90,179,268,357,446,535,624,713,802;1,2,3,4,5,6,7,8,9,10})","v":1},454,670,511,360,1994,"Northern Ireland",1994,null,null,null,null,null,null,null,"Coalisland North"]
["95GG26S2","Glencairn_2","N09000003","Belfast",191,118,109,99,800,374,184,136,"Urban",331209,375887,{"$error":"#N/A"},"N06000004","Belfast West",{"$f":"LOOKUP(OFFSET($D267,0,$B$12),{0,179,357,535,713;1,2,3,4,5})","v":1},{"$f":"LOOKUP(OFFSET($D267,0,$B$12),{0,90,179,268,357,446,535,624,713,802;1,2,3,4,5,6,7,8,9,10})","v":2},360,509,532,390,1791,"Northern Ireland",1791,null,null,null,null,null,null,null,"Coalisland South"]
["95GG27S1","Glencolin_1","N09000003","Belfast",853,209,215,353,355,305,309,391,"Mixed urban/rural",327626,371891,{"$error":"#N/A"},"N06000004","Belfast West",{"$f":"LOOKUP(OFFSET($D268,0,$B$12),{0,179,357,535,713;1,2,3,4,5})","v":3},{"$f":"LOOKUP(OFFSET($D268,0,$B$12),{0,90,179,268,357,446,535,624,713,802;1,2,3,4,5,6,7,8,9,10})","v":5},408,552,541,146,1647,"Northern Ireland",1647,null,null,null,null,null,null,null,"Coalisland West and Newmills"]
["95GG27S2","Glencolin_2","N09000003","Belfast",385,72,50,168,726,270,133,131,"Urban",327977,371418,{"$error":"#N/A"},"N06000004","Belfast West",{"$f":"LOOKUP(OFFSET($D269,0,$B$12),{0,179,357,535,713;1,2,3,4,5})","v":1},{"$f":"LOOKUP(OFFSET($D269,0,$B$12),{0,90,179,268,357,446,535,624,713,802;1,2,3,4,5,6,7,8,9,10})","v":2},402,560,471,195,1629,"Northern Ireland",1629,null,null,null,null,null,null,null,"Collin Glen_1"]
["95GG27S3","Glencolin_3","N09000003","Belfast",471,88,71,109,708,681,150,162,"Urban",328468,371171,{"$error":"#N/A"},"N06000004","Belfast West",{"$f":"LOOKUP(OFFSET($D270,0,$B$12),{0,179,357,535,713;1,2,3,4,5})","v":1},{"$f":"LOOKUP(OFFSET($D270,0,$B$12),{0,90,179,268,357,446,535,624,713,802;1,2,3,4,5,6,7,8,9,10})","v":2},314,550,519,267,1649,"Northern Ireland",1649,null,null,null,null,null,null,null,"Collin Glen_2"]
["95GG27S4","Glencolin_4","N09000003","Belfast",500,66,39,118,849,77,117,116,"Urban",328547,371541,{"$error":"#N/A"},"N06000004","Belfast West",{"$f":"LOOKUP(OFFSET($D271,0,$B$12),{0,179,357,535,713;1,2,3,4,5})","v":1},{"$f":"LOOKUP(OFFSET($D271,0,$B$12),{0,90,179,268,357,446,535,624,713,802;1,2,3,4,5,6,7,8,9,10})","v":2},328,507,433,292,1560,"Northern Ireland",1560,null,null,null,null,null,null,null,"Collin Glen_3"]
["95GG28S1","Highfield_1","N09000003","Belfast",617,523,383,249,314,803,439,522,"Urban",330336,375152,{"$error":"#N/A"},"N06000004","Belfast West",{"$f":"LOOKUP(OFFSET($D272,0,$B$12),{0,179,357,535,713;1,2,3,4,5})","v":3},{"$f":"LOOKUP(OFFSET($D272,0,$B$12),{0,90,179,268,357,446,535,624,713,802;1,2,3,4,5,6,7,8,9,10})","v":6},489,706,717,326,2237,"Northern Ireland",2237,null,null,null,null,null,null,null,"Collinbridge_1"]
["95GG28S2","Highfield_2","N09000003","Belfast",654,204,185,219,781,357,327,343,"Urban",330918,374911,{"$error":"#N/A"},"N06000004","Belfast West",{"$f":"LOOKUP(OFFSET($D273,0,$B$12),{0,179,357,535,713;1,2,3,4,5})","v":2},{"$f":"LOOKUP(OFFSET($D273,0,$B$12),{0,90,179,268,357,446,535,624,713,802;1,2,3,4,5,6,7,8,9,10})","v":4},320,517,580,282,1699,"Northern Ireland",1699,null,null,null,null,null,null,null,"Collinbridge_2"]
["95GG28S3","Highfield_3","N09000003","Belfast",56,76,66,78,538,352,213,60,"Urban",330797,374455,{"$error":"#N/A"},"N06000004","Belfast West",{"$f":"LOOKUP(OFFSET($D274,0,$B$12),{0,179,357,535,713;1,2,3,4,5})","v":1},{"$f":"LOOKUP(OFFSET($D274,0,$B$12),{0,90,179,268,357,446,535,624,713,802;1,2,3,4,5,6,7,8,9,10})","v":1},422,573,512,225,1733,"Northern Ireland",1733,null,null,null,null,null,null,null,"Comber East_1"]
["95GG29S1","Island_1","N09000003","Belfast",404,173,78,34,434,346,250,140,"Urban",335899,374608,{"$error":"#N/A"},"N06000001","Belfast East",{"$f":"LOOKUP(OFFSET($D275,0,$B$12),{0,179,357,535,713;1,2,3,4,5})","v":1},{"$f":"LOOKUP(OFFSET($D275,0,$B$12),{0,90,179,268,357,446,535,624,713,802;1,2,3,4,5,6,7,8,9,10})","v":2},558,1046,721,277,2602,"Northern Ireland",2602,null,null,null,null,null,null,null,"Comber East_2"]
["95GG29S2","Island_2","N09000003","Belfast",402,399,286,186,792,131,194,350,"Urban",336661,374456,{"$error":"#N/A"},"N06000001","Belfast East",{"$f":"LOOKUP(OFFSET($D276,0,$B$12),{0,179,357,535,713;1,2,3,4,5})","v":2},{"$f":"LOOKUP(OFFSET($D276,0,$B$12),{0,90,179,268,357,446,535,624,713,802;1,2,3,4,5,6,7,8,9,10})","v":4},554,1255,740,299,2848,"Northern Ireland",2848,null,null,null,null,null,null,null,"Comber North_1"]
["95GG30S1","Knock_1","N09000003","Belfast",547,249,279,283,526,325,398,384,"Urban",338009,372983,{"$error":"#N/A"},"N06000001","Belfast East",{"$f":"LOOKUP(OFFSET($D277,0,$B$12),{0,179,357,535,713;1,2,3,4,5})","v":3},{"$f":"LOOKUP(OFFSET($D277,0,$B$12),{0,90,179,268,357,446,535,624,713,802;1,2,3,4,5,6,7,8,9,10})","v":5},295,455,537,296,1584,"Northern Ireland",1584,null,null,null,null,null,null,null,"Comber North_2"]
["95GG30S2","Knock_2","N09000003","Belfast",807,857,796,851,797,602,644,882,"Urban",338203,373531,{"$error":"#N/A"},"N06000001","Belfast East",{"$f":"LOOKUP(OFFSET($D278,0,$B$12),{0,179,357,535,713;1,2,3,4,5})","v":5},{"$f":"LOOKUP(OFFSET($D278,0,$B$12),{0,90,179,268,357,446,535,624,713,802;1,2,3,4,5,6,7,8,9,10})","v":10},304,434,613,328,1680,"Northern Ireland",1680,null,null,null,null,null,null,null,"Comber West_1"]
["95GG30S3","Knock_3","N09000003","Belfast",776,745,676,745,721,725,537,841,"Urban",337349,373426,{"$error":"#N/A"},"N06000001","Belfast East",{"$f":"LOOKUP(OFFSET($D279,0,$B$12),{0,179,357,535,713;1,2,3,4,5})","v":5},{"$f":"LOOKUP(OFFSET($D279,0,$B$12),{0,90,179,268,357,446,535,624,713,802;1,2,3,4,5,6,7,8,9,10})","v":10},230,405,480,331,1445,"Northern Ireland",1445,null,null,null,null,null,null,null,"Comber West_2"]
["95GG31S1","Ladybrook_1","N09000003","Belfast",851,598,420,578,785,873,615,763,"Urban",329531,370359,{"$error":"#N/A"},"N06000004","Belfast West",{"$f":"LOOKUP(OFFSET($D280,0,$B$12),{0,179,357,535,713;1,2,3,4,5})","v":5},{"$f":"LOOKUP(OFFSET($D280,0,$B$12),{0,90,179,268,357,446,535,624,713,802;1,2,3,4,5,6,7,8,9,10})","v":9},435,776,743,317,2271,"Northern Ireland",2271,null,null,null,null,null,null,null,"Conlig_1"]
["95GG31S2","Ladybrook_2","N09000003","Belfast",613,236,196,194,807,736,313,368,"Urban",329039,370498,{"$error":"#N/A"},"N06000004","Belfast West",{"$f":"LOOKUP(OFFSET($D281,0,$B$12),{0,179,357,535,713;1,2,3,4,5})","v":3},{"$f":"LOOKUP(OFFSET($D281,0,$B$12),{0,90,179,268,357,446,535,624,713,802;1,2,3,4,5,6,7,8,9,10})","v":5},384,634,568,378,1963,"Northern Ireland",1963,null,null,null,null,null,null,null,"Conlig_2"]
["95GG31S3","Ladybrook_3","N09000003","Belfast",201,63,60,53,813,304,63,76,"Urban",328744,370907,{"$error":"#N/A"},"N06000004","Belfast West",{"$f":"LOOKUP(OFFSET($D282,0,$B$12),{0,179,357,535,713;1,2,3,4,5})","v":1},{"$f":"LOOKUP(OFFSET($D282,0,$B$12),{0,90,179,268,357,446,535,624,713,802;1,2,3,4,5,6,7,8,9,10})","v":1},492,727,627,315,2160,"Northern Ireland",2160,null,null,null,null,null,null,null,"Conlig_3"]
["95GG32S1","Legoniel_1","N09000003","Belfast",223,211,129,117,326,454,103,161,"Urban",330142,377403,{"$error":"#N/A"},"N06000002","Belfast North",{"$f":"LOOKUP(OFFSET($D283,0,$B$12),{0,179,357,535,713;1,2,3,4,5})","v":1},{"$f":"LOOKUP(OFFSET($D283,0,$B$12),{0,90,179,268,357,446,535,624,713,802;1,2,3,4,5,6,7,8,9,10})","v":2},996,1258,948,312,3514,"Northern Ireland",3514,null,null,null,null,null,null,null,"Coole"]
["95GG32S2","Legoniel_2","N09000003","Belfast",111,80,101,121,782,251,92,88,"Urban",330754,377030,{"$error":"#N/A"},"N06000002","Belfast North",{"$f":"LOOKUP(OFFSET($D284,0,$B$12),{0,179,357,535,713;1,2,3,4,5})","v":1},{"$f":"LOOKUP(OFFSET($D284,0,$B$12),{0,90,179,268,357,446,535,624,713,802;1,2,3,4,5,6,7,8,9,10})","v":1},302,477,468,282,1528,"Northern Ireland",1528,null,null,null,null,null,null,null,"Coolessan"]
["95GG32S3","Legoniel_3","N09000003","Belfast",509,291,269,319,733,219,161,386,"Urban",331022,376419,{"$error":"#N/A"},"N06000002","Belfast North",{"$f":"LOOKUP(OFFSET($D285,0,$B$12),{0,179,357,535,713;1,2,3,4,5})","v":3},{"$f":"LOOKUP(OFFSET($D285,0,$B$12),{0,90,179,268,357,446,535,624,713,802;1,2,3,4,5,6,7,8,9,10})","v":5},280,506,523,314,1623,"Northern Ireland",1623,null,null,null,null,null,null,null,"Coolhill"]
["95GG33S1","Malone_1","N09000003","Belfast",868,871,885,881,606,93,467,849,"Urban",331891,370323,{"$error":"#N/A"},"N06000003","Belfast South",{"$f":"LOOKUP(OFFSET($D286,0,$B$12),{0,179,357,535,713;1,2,3,4,5})","v":5},{"$f":"LOOKUP(OFFSET($D286,0,$B$12),{0,90,179,268,357,446,535,624,713,802;1,2,3,4,5,6,7,8,9,10})","v":10},342,494,634,408,1878,"Northern Ireland",1878,null,null,null,null,null,null,null,"Coolnagard"]
["95GG33S2","Malone_2","N09000003","Belfast",840,878,875,888,678,213,619,875,"Urban",332206,370695,{"$error":"#N/A"},"N06000003","Belfast South",{"$f":"LOOKUP(OFFSET($D287,0,$B$12),{0,179,357,535,713;1,2,3,4,5})","v":5},{"$f":"LOOKUP(OFFSET($D287,0,$B$12),{0,90,179,268,357,446,535,624,713,802;1,2,3,4,5,6,7,8,9,10})","v":10},311,428,568,350,1658,"Northern Ireland",1658,null,null,null,null,null,null,null,"Corcrain_1"]
["95GG33S3","Malone_3","N09000003","Belfast",792,860,860,886,821,6,347,773,"Urban",332357,371340,{"$error":"#N/A"},"N06000003","Belfast South",{"$f":"LOOKUP(OFFSET($D288,0,$B$12),{0,179,357,535,713;1,2,3,4,5})","v":5},{"$f":"LOOKUP(OFFSET($D288,0,$B$12),{0,90,179,268,357,446,535,624,713,802;1,2,3,4,5,6,7,8,9,10})","v":9},349,680,645,298,1973,"Northern Ireland",1973,null,null,null,null,null,null,null,"Corcrain_2"]
["95GG34S1","Musgrave_1","N09000003","Belfast",158,237,253,299,747,440,437,256,"Urban",330780,369739,{"$error":"#N/A"},"N06000003","Belfast South",{"$f":"LOOKUP(OFFSET($D289,0,$B$12),{0,179,357,535,713;1,2,3,4,5})","v":2},{"$f":"LOOKUP(OFFSET($D289,0,$B$12),{0,90,179,268,357,446,535,624,713,802;1,2,3,4,5,6,7,8,9,10})","v":3},311,430,483,244,1468,"Northern Ireland",1468,null,null,null,null,null,null,null,"Court_1"]
["95GG34S2","Musgrave_2","N09000003","Belfast",860,635,551,785,803,169,332,757,"Urban",330197,370368,{"$f":"IF(B290=$F$27,O290,NA())","v":{"$error":"#N/A"}},"N06000003","Belfast South",{"$f":"LOOKUP(OFFSET($D290,0,$B$12),{0,179,357,535,713;1,2,3,4,5})","v":5},{"$f":"LOOKUP(OFFSET($D290,0,$B$12),{0,90,179,268,357,446,535,624,713,802;1,2,3,4,5,6,7,8,9,10})","v":9},207,423,533,331,1495,"Northern Ireland",{"$f":"CHOOSE($K$5,$Y290,IF($D290=$B$27,$Y290,\"\"),IF($R290=$B$27,$Y290,\"\"))","v":1495},null,null,null,null,null,null,null,"Court_2"]
["95GG34S3","Musgrave_3","N09000003","Belfast",870,820,735,815,735,103,455,820,"Urban",330844,370447,{"$error":"#N/A"},"N06000003","Belfast South",{"$f":"LOOKUP(OFFSET($D291,0,$B$12),{0,179,357,535,713;1,2,3,4,5})","v":5},{"$f":"LOOKUP(OFFSET($D291,0,$B$12),{0,90,179,268,357,446,535,624,713,802;1,2,3,4,5,6,7,8,9,10})","v":10},289,633,610,277,1809,"Northern Ireland",1809,null,null,null,null,null,null,null,"Craigavad"]
["95GG35S1","New Lodge_1","N09000003","Belfast",250,9,10,18,707,114,22,25,"Urban",333683,375123,{"$error":"#N/A"},"N06000002","Belfast North",{"$f":"LOOKUP(OFFSET($D292,0,$B$12),{0,179,357,535,713;1,2,3,4,5})","v":1},{"$f":"LOOKUP(OFFSET($D292,0,$B$12),{0,90,179,268,357,446,535,624,713,802;1,2,3,4,5,6,7,8,9,10})","v":1},413,594,602,367,1976,"Northern Ireland",1976,null,null,null,null,null,null,null,"Craigy Hill"]
["95GG35S2","New Lodge_2","N09000003","Belfast",63,1,3,49,889,192,51,7,"Urban",333582,375557,{"$error":"#N/A"},"N06000002","Belfast North",{"$f":"LOOKUP(OFFSET($D293,0,$B$12),{0,179,357,535,713;1,2,3,4,5})","v":1},{"$f":"LOOKUP(OFFSET($D293,0,$B$12),{0,90,179,268,357,446,535,624,713,802;1,2,3,4,5,6,7,8,9,10})","v":1},270,442,513,228,1453,"Northern Ireland",1453,null,null,null,null,null,null,null,"Craigywarren"]
["95GG35S3","New Lodge_3","N09000003","Belfast",162,37,18,1,881,107,65,32,"Urban",333619,375770,{"$error":"#N/A"},"N06000002","Belfast North",{"$f":"LOOKUP(OFFSET($D294,0,$B$12),{0,179,357,535,713;1,2,3,4,5})","v":1},{"$f":"LOOKUP(OFFSET($D294,0,$B$12),{0,90,179,268,357,446,535,624,713,802;1,2,3,4,5,6,7,8,9,10})","v":1},288,446,357,156,1247,"Northern Ireland",1247,null,null,null,null,null,null,null,"Cranfield"]
["95GG36S1","Orangefield_1","N09000003","Belfast",696,671,435,381,840,466,288,667,"Urban",336170,372908,{"$error":"#N/A"},"N06000001","Belfast East",{"$f":"LOOKUP(OFFSET($D295,0,$B$12),{0,179,357,535,713;1,2,3,4,5})","v":4},{"$f":"LOOKUP(OFFSET($D295,0,$B$12),{0,90,179,268,357,446,535,624,713,802;1,2,3,4,5,6,7,8,9,10})","v":8},310,693,605,233,1841,"Northern Ireland",1841,null,null,null,null,null,null,null,"Crawfordsburn"]
["95GG36S2","Orangefield_2","N09000003","Belfast",779,770,638,712,825,442,667,834,"Urban",336685,372551,{"$error":"#N/A"},"N06000001","Belfast East",{"$f":"LOOKUP(OFFSET($D296,0,$B$12),{0,179,357,535,713;1,2,3,4,5})","v":5},{"$f":"LOOKUP(OFFSET($D296,0,$B$12),{0,90,179,268,357,446,535,624,713,802;1,2,3,4,5,6,7,8,9,10})","v":10},336,568,680,344,1928,"Northern Ireland",1928,null,null,null,null,null,null,null,"Cregagh"]
["95GG36S3","Orangefield_3","N09000003","Belfast",838,682,672,697,727,604,407,813,"Urban",336795,372915,{"$error":"#N/A"},"N06000001","Belfast East",{"$f":"LOOKUP(OFFSET($D297,0,$B$12),{0,179,357,535,713;1,2,3,4,5})","v":5},{"$f":"LOOKUP(OFFSET($D297,0,$B$12),{0,90,179,268,357,446,535,624,713,802;1,2,3,4,5,6,7,8,9,10})","v":10},335,569,671,340,1914,"Northern Ireland",1914,null,null,null,null,null,null,null,"Creggan"]
["95GG37S1","Ravenhill_1","N09000003","Belfast",856,824,803,862,666,162,338,833,"Urban",335183,372258,{"$error":"#N/A"},"N06000003","Belfast South",{"$f":"LOOKUP(OFFSET($D298,0,$B$12),{0,179,357,535,713;1,2,3,4,5})","v":5},{"$f":"LOOKUP(OFFSET($D298,0,$B$12),{0,90,179,268,357,446,535,624,713,802;1,2,3,4,5,6,7,8,9,10})","v":10},413,658,772,351,2194,"Northern Ireland",2194,null,null,null,null,null,null,null,"Creggan Central_1"]
["95GG37S2","Ravenhill_2","N09000003","Belfast",770,698,584,519,880,41,207,668,"Urban",335830,372522,{"$error":"#N/A"},"N06000003","Belfast South",{"$f":"LOOKUP(OFFSET($D299,0,$B$12),{0,179,357,535,713;1,2,3,4,5})","v":4},{"$f":"LOOKUP(OFFSET($D299,0,$B$12),{0,90,179,268,357,446,535,624,713,802;1,2,3,4,5,6,7,8,9,10})","v":8},320,675,602,278,1875,"Northern Ireland",1875,null,null,null,null,null,null,null,"Creggan Central_2"]
["95GG37S3","Ravenhill_3","N09000003","Belfast",791,785,575,323,811,716,248,730,"Urban",335456,372761,{"$error":"#N/A"},"N06000003","Belfast South",{"$f":"LOOKUP(OFFSET($D300,0,$B$12),{0,179,357,535,713;1,2,3,4,5})","v":5},{"$f":"LOOKUP(OFFSET($D300,0,$B$12),{0,90,179,268,357,446,535,624,713,802;1,2,3,4,5,6,7,8,9,10})","v":9},346,1113,595,257,2311,"Northern Ireland",2311,null,null,null,null,null,null,null,"Creggan South"]
["95GG38S1","Rosetta_1","N09000003","Belfast",671,818,778,860,623,643,503,846,"Urban",334443,371142,{"$error":"#N/A"},"N06000003","Belfast South",{"$f":"LOOKUP(OFFSET($D301,0,$B$12),{0,179,357,535,713;1,2,3,4,5})","v":5},{"$f":"LOOKUP(OFFSET($D301,0,$B$12),{0,90,179,268,357,446,535,624,713,802;1,2,3,4,5,6,7,8,9,10})","v":10},510,1216,1001,445,3172,"Northern Ireland",3172,null,null,null,null,null,null,null,"Crevagh_1"]
["95GG38S2","Rosetta_2","N09000003","Belfast",761,475,428,753,844,591,420,707,"Urban",335072,371287,{"$error":"#N/A"},"N06000003","Belfast South",{"$f":"LOOKUP(OFFSET($D302,0,$B$12),{0,179,357,535,713;1,2,3,4,5})","v":4},{"$f":"LOOKUP(OFFSET($D302,0,$B$12),{0,90,179,268,357,446,535,624,713,802;1,2,3,4,5,6,7,8,9,10})","v":8},274,703,575,321,1873,"Northern Ireland",1873,null,null,null,null,null,null,null,"Crevagh_2"]
["95GG38S3","Rosetta_3","N09000003","Belfast",883,831,801,870,852,339,656,881,"Urban",335243,371016,{"$error":"#N/A"},"N06000003","Belfast South",{"$f":"LOOKUP(OFFSET($D303,0,$B$12),{0,179,357,535,713;1,2,3,4,5})","v":5},{"$f":"LOOKUP(OFFSET($D303,0,$B$12),{0,90,179,268,357,446,535,624,713,802;1,2,3,4,5,6,7,8,9,10})","v":10},296,461,551,267,1575,"Northern Ireland",1575,null,null,null,null,null,null,null,"Crevagh_3"]
["95GG39S1","Shaftesbury_1","N09000003","Belfast",464,128,70,104,739,187,123,163,"Urban",334168,373751,{"$error":"#N/A"},"N06000003","Belfast South",{"$f":"LOOKUP(OFFSET($D304,0,$B$12),{0,179,357,535,713;1,2,3,4,5})","v":1},{"$f":"LOOKUP(OFFSET($D304,0,$B$12),{0,90,179,268,357,446,535,624,713,802;1,2,3,4,5,6,7,8,9,10})","v":2},453,1005,581,236,2275,"Northern Ireland",2275,null,null,null,null,null,null,null,"Cross Glebe"]
["95GG39S2","Shaftesbury_2","N09000003","Belfast",438,146,68,72,769,275,39,146,"Urban",333822,373354,{"$error":"#N/A"},"N06000003","Belfast South",{"$f":"LOOKUP(OFFSET($D305,0,$B$12),{0,179,357,535,713;1,2,3,4,5})","v":1},{"$f":"LOOKUP(OFFSET($D305,0,$B$12),{0,90,179,268,357,446,535,624,713,802;1,2,3,4,5,6,7,8,9,10})","v":2},446,1255,780,364,2845,"Northern Ireland",2845,null,null,null,null,null,null,null,"Crossgar_1"]
["95GG39S3","Shaftesbury_3","N09000003","Belfast",127,81,61,16,808,212,352,67,"Urban",333033,373160,{"$error":"#N/A"},"N06000003","Belfast South",{"$f":"LOOKUP(OFFSET($D306,0,$B$12),{0,179,357,535,713;1,2,3,4,5})","v":1},{"$f":"LOOKUP(OFFSET($D306,0,$B$12),{0,90,179,268,357,446,535,624,713,802;1,2,3,4,5,6,7,8,9,10})","v":1},296,984,536,271,2087,"Northern Ireland",2087,null,null,null,null,null,null,null,"Crossgar_2"]
["95GG40S1","Shankill_1","N09000003","Belfast",49,44,26,7,654,561,114,28,"Urban",332202,374629,{"$error":"#N/A"},"N06000004","Belfast West",{"$f":"LOOKUP(OFFSET($D307,0,$B$12),{0,179,357,535,713;1,2,3,4,5})","v":1},{"$f":"LOOKUP(OFFSET($D307,0,$B$12),{0,90,179,268,357,446,535,624,713,802;1,2,3,4,5,6,7,8,9,10})","v":1},558,643,474,270,1945,"Northern Ireland",1945,null,null,null,null,null,null,null,"Crossmaglen"]
["95GG40S2","Shankill_2","N09000003","Belfast",115,20,27,4,776,116,3,18,"Urban",333051,374887,{"$error":"#N/A"},"N06000004","Belfast West",{"$f":"LOOKUP(OFFSET($D308,0,$B$12),{0,179,357,535,713;1,2,3,4,5})","v":1},{"$f":"LOOKUP(OFFSET($D308,0,$B$12),{0,90,179,268,357,446,535,624,713,802;1,2,3,4,5,6,7,8,9,10})","v":1},445,706,626,490,2268,"Northern Ireland",2268,null,null,null,null,null,null,null,"Crumlin_1_Antrim"]
["95GG41S1","Stormont_1","N09000003","Belfast",821,827,881,890,334,566,877,866,"Urban",339019,375464,{"$error":"#N/A"},"N06000001","Belfast East",{"$f":"LOOKUP(OFFSET($D309,0,$B$12),{0,179,357,535,713;1,2,3,4,5})","v":5},{"$f":"LOOKUP(OFFSET($D309,0,$B$12),{0,90,179,268,357,446,535,624,713,802;1,2,3,4,5,6,7,8,9,10})","v":10},329,385,688,546,1948,"Northern Ireland",1948,null,null,null,null,null,null,null,"Crumlin_1_Belfast"]
["95GG41S2","Stormont_2","N09000003","Belfast",876,876,883,887,652,497,885,889,"Urban",339290,374507,{"$error":"#N/A"},"N06000001","Belfast East",{"$f":"LOOKUP(OFFSET($D310,0,$B$12),{0,179,357,535,713;1,2,3,4,5})","v":5},{"$f":"LOOKUP(OFFSET($D310,0,$B$12),{0,90,179,268,357,446,535,624,713,802;1,2,3,4,5,6,7,8,9,10})","v":10},333,358,564,354,1608,"Northern Ireland",1608,null,null,null,null,null,null,null,"Crumlin_2_Antrim"]
["95GG41S3","Stormont_3","N09000003","Belfast",879,773,741,832,750,471,832,876,"Urban",338405,374317,{"$error":"#N/A"},"N06000001","Belfast East",{"$f":"LOOKUP(OFFSET($D311,0,$B$12),{0,179,357,535,713;1,2,3,4,5})","v":5},{"$f":"LOOKUP(OFFSET($D311,0,$B$12),{0,90,179,268,357,446,535,624,713,802;1,2,3,4,5,6,7,8,9,10})","v":10},418,562,680,423,2083,"Northern Ireland",2083,null,null,null,null,null,null,null,"Crumlin_2_Belfast"]
["95GG42S1","Stranmillis_1","N09000003","Belfast",832,882,888,880,507,709,866,887,"Urban",333321,370605,{"$error":"#N/A"},"N06000003","Belfast South",{"$f":"LOOKUP(OFFSET($D312,0,$B$12),{0,179,357,535,713;1,2,3,4,5})","v":5},{"$f":"LOOKUP(OFFSET($D312,0,$B$12),{0,90,179,268,357,446,535,624,713,802;1,2,3,4,5,6,7,8,9,10})","v":10},364,528,655,353,1901,"Northern Ireland",1901,null,null,null,null,null,null,null,"Cullybackey"]
["95GG42S2","Stranmillis_2","N09000003","Belfast",890,890,882,882,734,273,856,888,"Urban",333251,371683,{"$error":"#N/A"},"N06000003","Belfast South",{"$f":"LOOKUP(OFFSET($D313,0,$B$12),{0,179,357,535,713;1,2,3,4,5})","v":5},{"$f":"LOOKUP(OFFSET($D313,0,$B$12),{0,90,179,268,357,446,535,624,713,802;1,2,3,4,5,6,7,8,9,10})","v":10},100,1545,138,107,1890,"Northern Ireland",1890,null,null,null,null,null,null,null,"Culmore_1"]
["95GG42S3","Stranmillis_3","N09000003","Belfast",789,889,887,889,836,45,440,832,"Urban",333567,371799,{"$error":"#N/A"},"N06000003","Belfast South",{"$f":"LOOKUP(OFFSET($D314,0,$B$12),{0,179,357,535,713;1,2,3,4,5})","v":5},{"$f":"LOOKUP(OFFSET($D314,0,$B$12),{0,90,179,268,357,446,535,624,713,802;1,2,3,4,5,6,7,8,9,10})","v":10},244,1602,364,174,2384,"Northern Ireland",2384,null,null,null,null,null,null,null,"Culmore_2"]
["95GG42S4","Stranmillis_4","N09000003","Belfast",808,885,889,877,532,598,579,879,"Urban",333716,371077,{"$error":"#N/A"},"N06000003","Belfast South",{"$f":"LOOKUP(OFFSET($D315,0,$B$12),{0,179,357,535,713;1,2,3,4,5})","v":5},{"$f":"LOOKUP(OFFSET($D315,0,$B$12),{0,90,179,268,357,446,535,624,713,802;1,2,3,4,5,6,7,8,9,10})","v":10},366,940,651,321,2279,"Northern Ireland",2279,null,null,null,null,null,null,null,"Culmore_3"]
["95GG43S1","Sydenham_1","N09000003","Belfast",690,195,149,171,474,510,599,318,"Urban",337319,375365,{"$error":"#N/A"},"N06000001","Belfast East",{"$f":"LOOKUP(OFFSET($D316,0,$B$12),{0,179,357,535,713;1,2,3,4,5})","v":2},{"$f":"LOOKUP(OFFSET($D316,0,$B$12),{0,90,179,268,357,446,535,624,713,802;1,2,3,4,5,6,7,8,9,10})","v":4},289,577,455,311,1632,"Northern Ireland",1632,null,null,null,null,null,null,null,"Culmore_4"]
["95GG43S2","Sydenham_2","N09000003","Belfast",709,655,427,287,854,173,510,627,"Urban",337190,375160,{"$error":"#N/A"},"N06000001","Belfast East",{"$f":"LOOKUP(OFFSET($D317,0,$B$12),{0,179,357,535,713;1,2,3,4,5})","v":4},{"$f":"LOOKUP(OFFSET($D317,0,$B$12),{0,90,179,268,357,446,535,624,713,802;1,2,3,4,5,6,7,8,9,10})","v":8},287,573,517,330,1707,"Northern Ireland",1707,null,null,null,null,null,null,null,"Culmore_5"]
["95GG43S3","Sydenham_3","N09000003","Belfast",633,453,309,232,768,108,252,456,"Urban",336896,374872,{"$error":"#N/A"},"N06000001","Belfast East",{"$f":"LOOKUP(OFFSET($D318,0,$B$12),{0,179,357,535,713;1,2,3,4,5})","v":3},{"$f":"LOOKUP(OFFSET($D318,0,$B$12),{0,90,179,268,357,446,535,624,713,802;1,2,3,4,5,6,7,8,9,10})","v":6},282,678,486,259,1704,"Northern Ireland",1704,null,null,null,null,null,null,null,"Cultra"]
["95GG44S1","The Mount_1","N09000003","Belfast",282,134,79,8,791,152,17,80,"Urban",335778,373739,{"$error":"#N/A"},"N06000001","Belfast East",{"$f":"LOOKUP(OFFSET($D319,0,$B$12),{0,179,357,535,713;1,2,3,4,5})","v":1},{"$f":"LOOKUP(OFFSET($D319,0,$B$12),{0,90,179,268,357,446,535,624,713,802;1,2,3,4,5,6,7,8,9,10})","v":1},654,1343,803,285,3086,"Northern Ireland",3086,null,null,null,null,null,null,null,"Daisy Hill_1"]
["95GG44S2","The Mount_2","N09000003","Belfast",145,138,88,6,841,61,54,64,"Urban",335980,373361,{"$error":"#N/A"},"N06000001","Belfast East",{"$f":"LOOKUP(OFFSET($D320,0,$B$12),{0,179,357,535,713;1,2,3,4,5})","v":1},{"$f":"LOOKUP(OFFSET($D320,0,$B$12),{0,90,179,268,357,446,535,624,713,802;1,2,3,4,5,6,7,8,9,10})","v":1},659,1245,764,340,3008,"Northern Ireland",3008,null,null,null,null,null,null,null,"Daisy Hill_2"]
["95GG45S1","Upper Malone_1","N09000003","Belfast",866,843,870,878,415,200,532,843,"Urban",331796,369350,{"$error":"#N/A"},"N06000003","Belfast South",{"$f":"LOOKUP(OFFSET($D321,0,$B$12),{0,179,357,535,713;1,2,3,4,5})","v":5},{"$f":"LOOKUP(OFFSET($D321,0,$B$12),{0,90,179,268,357,446,535,624,713,802;1,2,3,4,5,6,7,8,9,10})","v":10},247,351,548,489,1634,"Northern Ireland",1634,null,null,null,null,null,null,null,"Dalriada"]
["95GG45S2","Upper Malone_2","N09000003","Belfast",477,116,95,51,646,208,443,159,"Urban",331351,369661,{"$error":"#N/A"},"N06000003","Belfast South",{"$f":"LOOKUP(OFFSET($D322,0,$B$12),{0,179,357,535,713;1,2,3,4,5})","v":1},{"$f":"LOOKUP(OFFSET($D322,0,$B$12),{0,90,179,268,357,446,535,624,713,802;1,2,3,4,5,6,7,8,9,10})","v":2},372,529,499,219,1620,"Northern Ireland",1620,null,null,null,null,null,null,null,"Demesne_1"]
["95GG45S3","Upper Malone_3","N09000003","Belfast",735,538,529,708,673,542,470,720,"Urban",331144,369300,{"$error":"#N/A"},"N06000003","Belfast South",{"$f":"LOOKUP(OFFSET($D323,0,$B$12),{0,179,357,535,713;1,2,3,4,5})","v":5},{"$f":"LOOKUP(OFFSET($D323,0,$B$12),{0,90,179,268,357,446,535,624,713,802;1,2,3,4,5,6,7,8,9,10})","v":9},338,527,494,295,1654,"Northern Ireland",1654,null,null,null,null,null,null,null,"Demesne_2"]
["95GG46S1","Upper Springfield_1","N09000003","Belfast",538,34,25,65,701,202,116,82,"Urban",329755,373397,{"$error":"#N/A"},"N06000004","Belfast West",{"$f":"LOOKUP(OFFSET($D324,0,$B$12),{0,179,357,535,713;1,2,3,4,5})","v":1},{"$f":"LOOKUP(OFFSET($D324,0,$B$12),{0,90,179,268,357,446,535,624,713,802;1,2,3,4,5,6,7,8,9,10})","v":1},365,556,543,215,1679,"Northern Ireland",1679,null,null,null,null,null,null,null,"Dergmoney"]
["95GG46S2","Upper Springfield_2","N09000003","Belfast",605,39,29,77,498,25,141,77,"Urban",330196,373956,{"$error":"#N/A"},"N06000004","Belfast West",{"$f":"LOOKUP(OFFSET($D325,0,$B$12),{0,179,357,535,713;1,2,3,4,5})","v":1},{"$f":"LOOKUP(OFFSET($D325,0,$B$12),{0,90,179,268,357,446,535,624,713,802;1,2,3,4,5,6,7,8,9,10})","v":1},421,565,498,282,1767,"Northern Ireland",1767,null,null,null,null,null,null,null,"Derryaghy_1"]
["95GG46S3","Upper Springfield_3","N09000003","Belfast",442,21,21,23,822,48,130,48,"Urban",330050,373110,{"$error":"#N/A"},"N06000004","Belfast West",{"$f":"LOOKUP(OFFSET($D326,0,$B$12),{0,179,357,535,713;1,2,3,4,5})","v":1},{"$f":"LOOKUP(OFFSET($D326,0,$B$12),{0,90,179,268,357,446,535,624,713,802;1,2,3,4,5,6,7,8,9,10})","v":1},397,535,503,217,1652,"Northern Ireland",1652,null,null,null,null,null,null,null,"Derryaghy_2"]
["95GG47S1","Water Works_1","N09000003","Belfast",89,18,8,26,767,46,35,15,"Urban",333188,375957,{"$error":"#N/A"},"N06000002","Belfast North",{"$f":"LOOKUP(OFFSET($D327,0,$B$12),{0,179,357,535,713;1,2,3,4,5})","v":1},{"$f":"LOOKUP(OFFSET($D327,0,$B$12),{0,90,179,268,357,446,535,624,713,802;1,2,3,4,5,6,7,8,9,10})","v":1},646,955,735,264,2600,"Northern Ireland",2600,null,null,null,null,null,null,null,"Derryaghy_3"]
["95GG47S2","Water Works_2","N09000003","Belfast",23,2,4,63,846,341,21,2,"Urban",332798,376187,{"$error":"#N/A"},"N06000002","Belfast North",{"$f":"LOOKUP(OFFSET($D328,0,$B$12),{0,179,357,535,713;1,2,3,4,5})","v":1},{"$f":"LOOKUP(OFFSET($D328,0,$B$12),{0,90,179,268,357,446,535,624,713,802;1,2,3,4,5,6,7,8,9,10})","v":1},384,564,530,233,1711,"Northern Ireland",1711,null,null,null,null,null,null,null,"Derryboy_1"]
["95GG47S3","Water Works_3","N09000003","Belfast",133,50,72,123,884,7,5,56,"Urban",333267,376458,{"$error":"#N/A"},"N06000002","Belfast North",{"$f":"LOOKUP(OFFSET($D329,0,$B$12),{0,179,357,535,713;1,2,3,4,5})","v":1},{"$f":"LOOKUP(OFFSET($D329,0,$B$12),{0,90,179,268,357,446,535,624,713,802;1,2,3,4,5,6,7,8,9,10})","v":1},499,694,604,217,2013,"Northern Ireland",2013,null,null,null,null,null,null,null,"Derryboy_2"]
["95GG48S1","Whiterock_1","N09000003","Belfast",132,86,49,154,883,19,46,74,"Urban",331116,373320,{"$error":"#N/A"},"N06000004","Belfast West",{"$f":"LOOKUP(OFFSET($D330,0,$B$12),{0,179,357,535,713;1,2,3,4,5})","v":1},{"$f":"LOOKUP(OFFSET($D330,0,$B$12),{0,90,179,268,357,446,535,624,713,802;1,2,3,4,5,6,7,8,9,10})","v":1},339,522,440,207,1507,"Northern Ireland",1507,null,null,null,null,null,null,null,"Derrygonnelly"]
["95GG48S2","Whiterock_2","N09000003","Belfast",306,8,1,5,731,130,227,23,"Urban",330798,373714,{"$error":"#N/A"},"N06000004","Belfast West",{"$f":"LOOKUP(OFFSET($D331,0,$B$12),{0,179,357,535,713;1,2,3,4,5})","v":1},{"$f":"LOOKUP(OFFSET($D331,0,$B$12),{0,90,179,268,357,446,535,624,713,802;1,2,3,4,5,6,7,8,9,10})","v":1},677,832,635,250,2394,"Northern Ireland",2394,null,null,null,null,null,null,null,"Derryleckagh_1"]
["95GG48S3","Whiterock_3","N09000003","Belfast",322,17,5,29,872,20,146,35,"Urban",330391,373709,{"$error":"#N/A"},"N06000004","Belfast West",{"$f":"LOOKUP(OFFSET($D332,0,$B$12),{0,179,357,535,713;1,2,3,4,5})","v":1},{"$f":"LOOKUP(OFFSET($D332,0,$B$12),{0,90,179,268,357,446,535,624,713,802;1,2,3,4,5,6,7,8,9,10})","v":1},432,543,490,176,1640,"Northern Ireland",1640,null,null,null,null,null,null,null,"Derryleckagh_2"]
["95GG49S1","Windsor_1","N09000003","Belfast",802,859,804,847,876,94,298,822,"Urban",332587,371803,{"$error":"#N/A"},"N06000003","Belfast South",{"$f":"LOOKUP(OFFSET($D333,0,$B$12),{0,179,357,535,713;1,2,3,4,5})","v":5},{"$f":"LOOKUP(OFFSET($D333,0,$B$12),{0,90,179,268,357,446,535,624,713,802;1,2,3,4,5,6,7,8,9,10})","v":10},213,825,441,235,1714,"Northern Ireland",1714,null,null,null,null,null,null,null,"Derrylin"]
["95GG49S2","Windsor_2","N09000003","Belfast",788,868,780,796,887,44,272,790,"Urban",332857,372138,{"$error":"#N/A"},"N06000003","Belfast South",{"$f":"LOOKUP(OFFSET($D334,0,$B$12),{0,179,357,535,713;1,2,3,4,5})","v":5},{"$f":"LOOKUP(OFFSET($D334,0,$B$12),{0,90,179,268,357,446,535,624,713,802;1,2,3,4,5,6,7,8,9,10})","v":9},150,1642,242,132,2166,"Northern Ireland",2166,null,null,null,null,null,null,null,"Derrymore_1"]
["95GG49S3","Windsor_3","N09000003","Belfast",342,806,592,409,805,3,145,482,"Urban",332585,372429,{"$error":"#N/A"},"N06000003","Belfast South",{"$f":"LOOKUP(OFFSET($D335,0,$B$12),{0,179,357,535,713;1,2,3,4,5})","v":3},{"$f":"LOOKUP(OFFSET($D335,0,$B$12),{0,90,179,268,357,446,535,624,713,802;1,2,3,4,5,6,7,8,9,10})","v":6},227,1568,201,78,2074,"Northern Ireland",2074,null,null,null,null,null,null,null,"Derrymore_2"]
["95GG49S4","Windsor_4","N09000003","Belfast",693,832,506,359,871,5,73,556,"Urban",332778,372709,{"$error":"#N/A"},"N06000003","Belfast South",{"$f":"LOOKUP(OFFSET($D336,0,$B$12),{0,179,357,535,713;1,2,3,4,5})","v":4},{"$f":"LOOKUP(OFFSET($D336,0,$B$12),{0,90,179,268,357,446,535,624,713,802;1,2,3,4,5,6,7,8,9,10})","v":7},155,1538,245,134,2071,"Northern Ireland",2071,null,null,null,null,null,null,null,"Derrynoose"]
["95GG50S1","Woodstock_1","N09000003","Belfast",204,279,167,88,823,13,111,155,"Urban",335602,373042,{"$error":"#N/A"},"N06000003","Belfast South",{"$f":"LOOKUP(OFFSET($D337,0,$B$12),{0,179,357,535,713;1,2,3,4,5})","v":1},{"$f":"LOOKUP(OFFSET($D337,0,$B$12),{0,90,179,268,357,446,535,624,713,802;1,2,3,4,5,6,7,8,9,10})","v":2},296,652,482,140,1571,"Northern Ireland",1571,null,null,null,null,null,null,null,"Derrytrasna_1"]
["95GG50S2","Woodstock_2","N09000003","Belfast",265,154,76,52,879,303,86,128,"Urban",335324,373486,{"$error":"#N/A"},"N06000003","Belfast South",{"$f":"LOOKUP(OFFSET($D338,0,$B$12),{0,179,357,535,713;1,2,3,4,5})","v":1},{"$f":"LOOKUP(OFFSET($D338,0,$B$12),{0,90,179,268,357,446,535,624,713,802;1,2,3,4,5,6,7,8,9,10})","v":2},412,921,620,248,2200,"Northern Ireland",2200,null,null,null,null,null,null,null,"Derrytrasna_2"]
["95GG50S3","Woodstock_3","N09000003","Belfast",160,194,138,28,886,17,66,96,"Urban",335209,373339,{"$error":"#N/A"},"N06000003","Belfast South",{"$f":"LOOKUP(OFFSET($D339,0,$B$12),{0,179,357,535,713;1,2,3,4,5})","v":1},{"$f":"LOOKUP(OFFSET($D339,0,$B$12),{0,90,179,268,357,446,535,624,713,802;1,2,3,4,5,6,7,8,9,10})","v":2},370,830,481,226,1907,"Northern Ireland",1907,null,null,null,null,null,null,null,"Dervock"]
["95GG51S1","Woodvale_1","N09000003","Belfast",7,45,47,2,610,368,37,8,"Urban",331683,374802,{"$error":"#N/A"},"N06000002","Belfast North",{"$f":"LOOKUP(OFFSET($D340,0,$B$12),{0,179,357,535,713;1,2,3,4,5})","v":1},{"$f":"LOOKUP(OFFSET($D340,0,$B$12),{0,90,179,268,357,446,535,624,713,802;1,2,3,4,5,6,7,8,9,10})","v":1},264,422,374,219,1279,"Northern Ireland",1279,null,null,null,null,null,null,null,"Devenish"]
["95GG51S2","Woodvale_2","N09000003","Belfast",27,28,56,3,741,118,85,12,"Urban",331742,375291,{"$error":"#N/A"},"N06000002","Belfast North",{"$f":"LOOKUP(OFFSET($D341,0,$B$12),{0,179,357,535,713;1,2,3,4,5})","v":1},{"$f":"LOOKUP(OFFSET($D341,0,$B$12),{0,90,179,268,357,446,535,624,713,802;1,2,3,4,5,6,7,8,9,10})","v":1},235,404,416,259,1315,"Northern Ireland",1315,null,null,null,null,null,null,null,"Doagh_1"]
["95GG51S3","Woodvale_3","N09000003","Belfast",12,41,53,12,809,132,177,17,"Urban",331779,375564,{"$error":"#N/A"},"N06000002","Belfast North",{"$f":"LOOKUP(OFFSET($D342,0,$B$12),{0,179,357,535,713;1,2,3,4,5})","v":1},{"$f":"LOOKUP(OFFSET($D342,0,$B$12),{0,90,179,268,357,446,535,624,713,802;1,2,3,4,5,6,7,8,9,10})","v":1},246,428,454,289,1417,"Northern Ireland",1417,null,null,null,null,null,null,null,"Doagh_2"]
["95HH01W1","Blackhead","N09000008","Mid and East Antrim",606,505,594,408,297,848,486,605,"Rural",347479,392511,{"$error":"#N/A"},"N06000005","East Antrim",{"$f":"LOOKUP(OFFSET($D343,0,$B$12),{0,179,357,535,713;1,2,3,4,5})","v":4},{"$f":"LOOKUP(OFFSET($D343,0,$B$12),{0,90,179,268,357,446,535,624,713,802;1,2,3,4,5,6,7,8,9,10})","v":7},356,446,715,539,2056,"Northern Ireland",2056,null,null,null,null,null,null,null,"Donagh"]
["95HH02S1","Bluefield_1","N09000008","Mid and East Antrim",805,754,727,486,320,629,831,766,"Urban",342277,388867,{"$error":"#N/A"},"N06000005","East Antrim",{"$f":"LOOKUP(OFFSET($D344,0,$B$12),{0,179,357,535,713;1,2,3,4,5})","v":5},{"$f":"LOOKUP(OFFSET($D344,0,$B$12),{0,90,179,268,357,446,535,624,713,802;1,2,3,4,5,6,7,8,9,10})","v":9},240,332,442,261,1275,"Northern Ireland",1275,null,null,null,null,null,null,null,"Donaghadee North_1"]
["95HH02S2","Bluefield_2","N09000008","Mid and East Antrim",741,755,746,771,321,865,825,810,"Urban",342054,389932,{"$error":"#N/A"},"N06000005","East Antrim",{"$f":"LOOKUP(OFFSET($D345,0,$B$12),{0,179,357,535,713;1,2,3,4,5})","v":5},{"$f":"LOOKUP(OFFSET($D345,0,$B$12),{0,90,179,268,357,446,535,624,713,802;1,2,3,4,5,6,7,8,9,10})","v":10},302,460,669,176,1606,"Northern Ireland",1606,null,null,null,null,null,null,null,"Donaghadee North_2"]
["95HH03W1","Boneybefore","N09000008","Mid and East Antrim",817,701,731,587,465,632,613,791,"Urban",342768,388603,{"$error":"#N/A"},"N06000005","East Antrim",{"$f":"LOOKUP(OFFSET($D346,0,$B$12),{0,179,357,535,713;1,2,3,4,5})","v":5},{"$f":"LOOKUP(OFFSET($D346,0,$B$12),{0,90,179,268,357,446,535,624,713,802;1,2,3,4,5,6,7,8,9,10})","v":9},232,325,583,516,1655,"Northern Ireland",1655,null,null,null,null,null,null,null,"Donaghadee South_1"]
["95HH04S1","Burleigh Hill_1","N09000008","Mid and East Antrim",861,732,561,705,336,429,816,774,"Urban",340024,388702,{"$error":"#N/A"},"N06000005","East Antrim",{"$f":"LOOKUP(OFFSET($D347,0,$B$12),{0,179,357,535,713;1,2,3,4,5})","v":5},{"$f":"LOOKUP(OFFSET($D347,0,$B$12),{0,90,179,268,357,446,535,624,713,802;1,2,3,4,5,6,7,8,9,10})","v":9},247,452,638,267,1605,"Northern Ireland",1605,null,null,null,null,null,null,null,"Donaghadee South_2"]
["95HH04S2","Burleigh Hill_2","N09000008","Mid and East Antrim",889,710,659,782,394,874,696,829,"Urban",340301,389247,{"$error":"#N/A"},"N06000005","East Antrim",{"$f":"LOOKUP(OFFSET($D348,0,$B$12),{0,179,357,535,713;1,2,3,4,5})","v":5},{"$f":"LOOKUP(OFFSET($D348,0,$B$12),{0,90,179,268,357,446,535,624,713,802;1,2,3,4,5,6,7,8,9,10})","v":10},156,309,522,287,1275,"Northern Ireland",1275,null,null,null,null,null,null,null,"Donaghcloney_1"]
["95HH05W1","Clipperstown","N09000008","Mid and East Antrim",448,239,190,159,511,679,223,286,"Urban",340391,388064,{"$error":"#N/A"},"N06000005","East Antrim",{"$f":"LOOKUP(OFFSET($D349,0,$B$12),{0,179,357,535,713;1,2,3,4,5})","v":2},{"$f":"LOOKUP(OFFSET($D349,0,$B$12),{0,90,179,268,357,446,535,624,713,802;1,2,3,4,5,6,7,8,9,10})","v":4},533,716,625,247,2121,"Northern Ireland",2121,null,null,null,null,null,null,null,"Donaghcloney_2"]
["95HH06S1","Eden_1","N09000008","Mid and East Antrim",767,802,750,585,239,518,616,752,"Mixed urban/rural",342602,390394,{"$error":"#N/A"},"N06000005","East Antrim",{"$f":"LOOKUP(OFFSET($D350,0,$B$12),{0,179,357,535,713;1,2,3,4,5})","v":5},{"$f":"LOOKUP(OFFSET($D350,0,$B$12),{0,90,179,268,357,446,535,624,713,802;1,2,3,4,5,6,7,8,9,10})","v":9},483,708,929,192,2313,"Northern Ireland",2313,null,null,null,null,null,null,null,"Donaghmore"]
["95HH06S2","Eden_2","N09000008","Mid and East Antrim",544,566,477,480,369,784,550,617,"Urban",342877,389262,{"$error":"#N/A"},"N06000005","East Antrim",{"$f":"LOOKUP(OFFSET($D351,0,$B$12),{0,179,357,535,713;1,2,3,4,5})","v":4},{"$f":"LOOKUP(OFFSET($D351,0,$B$12),{0,90,179,268,357,446,535,624,713,802;1,2,3,4,5,6,7,8,9,10})","v":7},602,755,939,285,2581,"Northern Ireland",2581,null,null,null,null,null,null,null,"Donaghmore_1"]
["95HH07W1","Gortalee","N09000008","Mid and East Antrim",298,243,230,157,608,781,403,276,"Urban",337249,385174,{"$error":"#N/A"},"N06000005","East Antrim",{"$f":"LOOKUP(OFFSET($D352,0,$B$12),{0,179,357,535,713;1,2,3,4,5})","v":2},{"$f":"LOOKUP(OFFSET($D352,0,$B$12),{0,90,179,268,357,446,535,624,713,802;1,2,3,4,5,6,7,8,9,10})","v":4},295,545,509,260,1609,"Northern Ireland",1609,null,null,null,null,null,null,null,"Donaghmore_2"]
["95HH08W1","Greenisland","N09000008","Mid and East Antrim",812,758,684,522,391,773,639,783,"Urban",338328,385587,{"$error":"#N/A"},"N06000005","East Antrim",{"$f":"LOOKUP(OFFSET($D353,0,$B$12),{0,179,357,535,713;1,2,3,4,5})","v":5},{"$f":"LOOKUP(OFFSET($D353,0,$B$12),{0,90,179,268,357,446,535,624,713,802;1,2,3,4,5,6,7,8,9,10})","v":9},466,820,925,523,2734,"Northern Ireland",2734,null,null,null,null,null,null,null,"Donard_1"]
["95HH09W1","Killycrot","N09000008","Mid and East Antrim",435,172,221,148,709,633,110,252,"Urban",340898,387323,{"$f":"IF(B354=$F$27,O354,NA())","v":{"$error":"#N/A"}},"N06000005","East Antrim",{"$f":"LOOKUP(OFFSET($D354,0,$B$12),{0,179,357,535,713;1,2,3,4,5})","v":2},{"$f":"LOOKUP(OFFSET($D354,0,$B$12),{0,90,179,268,357,446,535,624,713,802;1,2,3,4,5,6,7,8,9,10})","v":3},381,777,930,668,2757,"Northern Ireland",{"$f":"CHOOSE($K$5,$Y354,IF($D354=$B$27,$Y354,\"\"),IF($R354=$B$27,$Y354,\"\"))","v":2757},null,null,null,null,null,null,null,"Donard_2"]
["95HH10W1","Knockagh","N09000008","Mid and East Antrim",862,849,788,839,353,845,592,865,"Urban",336874,385687,{"$error":"#N/A"},"N06000005","East Antrim",{"$f":"LOOKUP(OFFSET($D355,0,$B$12),{0,179,357,535,713;1,2,3,4,5})","v":5},{"$f":"LOOKUP(OFFSET($D355,0,$B$12),{0,90,179,268,357,446,535,624,713,802;1,2,3,4,5,6,7,8,9,10})","v":10},538,687,981,432,2639,"Northern Ireland",2639,null,null,null,null,null,null,null,"Downs"]
["95HH11W1","Love Lane","N09000008","Mid and East Antrim",553,95,134,54,594,824,157,173,"Urban",341277,388812,{"$error":"#N/A"},"N06000005","East Antrim",{"$f":"LOOKUP(OFFSET($D356,0,$B$12),{0,179,357,535,713;1,2,3,4,5})","v":1},{"$f":"LOOKUP(OFFSET($D356,0,$B$12),{0,90,179,268,357,446,535,624,713,802;1,2,3,4,5,6,7,8,9,10})","v":2},272,416,413,401,1501,"Northern Ireland",1501,null,null,null,null,null,null,null,"Downshire"]
["95HH12W1","Milebush","N09000008","Mid and East Antrim",718,380,413,253,490,664,610,536,"Urban",341065,389449,{"$error":"#N/A"},"N06000005","East Antrim",{"$f":"LOOKUP(OFFSET($D357,0,$B$12),{0,179,357,535,713;1,2,3,4,5})","v":4},{"$f":"LOOKUP(OFFSET($D357,0,$B$12),{0,90,179,268,357,446,535,624,713,802;1,2,3,4,5,6,7,8,9,10})","v":7},264,384,498,324,1469,"Northern Ireland",1469,null,null,null,null,null,null,null,"Draperstown"]
["95HH13W1","Northland","N09000008","Mid and East Antrim",50,135,98,13,686,707,365,65,"Urban",340759,388357,{"$error":"#N/A"},"N06000005","East Antrim",{"$f":"LOOKUP(OFFSET($D358,0,$B$12),{0,179,357,535,713;1,2,3,4,5})","v":1},{"$f":"LOOKUP(OFFSET($D358,0,$B$12),{0,90,179,268,357,446,535,624,713,802;1,2,3,4,5,6,7,8,9,10})","v":1},393,516,401,148,1458,"Northern Ireland",1458,null,null,null,null,null,null,null,"Dromara_1"]
["95HH14W1","Sunnylands","N09000008","Mid and East Antrim",454,171,163,83,810,699,221,230,"Urban",341080,388121,{"$error":"#N/A"},"N06000005","East Antrim",{"$f":"LOOKUP(OFFSET($D359,0,$B$12),{0,179,357,535,713;1,2,3,4,5})","v":2},{"$f":"LOOKUP(OFFSET($D359,0,$B$12),{0,90,179,268,357,446,535,624,713,802;1,2,3,4,5,6,7,8,9,10})","v":3},264,421,462,353,1500,"Northern Ireland",1500,null,null,null,null,null,null,null,"Dromara_2"]
["95HH15W1","Victoria_Carrickfergus","N09000008","Mid and East Antrim",687,547,392,375,438,888,412,609,"Urban",341947,388587,{"$error":"#N/A"},"N06000005","East Antrim",{"$f":"LOOKUP(OFFSET($D360,0,$B$12),{0,179,357,535,713;1,2,3,4,5})","v":4},{"$f":"LOOKUP(OFFSET($D360,0,$B$12),{0,90,179,268,357,446,535,624,713,802;1,2,3,4,5,6,7,8,9,10})","v":7},407,779,909,431,2527,"Northern Ireland",2527,null,null,null,null,null,null,null,"Dromore"]
["95HH16W1","Whitehead","N09000008","Mid and East Antrim",678,601,789,713,303,586,279,699,"Rural",347048,391981,{"$error":"#N/A"},"N06000005","East Antrim",{"$f":"LOOKUP(OFFSET($D361,0,$B$12),{0,179,357,535,713;1,2,3,4,5})","v":4},{"$f":"LOOKUP(OFFSET($D361,0,$B$12),{0,90,179,268,357,446,535,624,713,802;1,2,3,4,5,6,7,8,9,10})","v":8},357,501,766,494,2117,"Northern Ireland",2117,null,null,null,null,null,null,null,"Dromore North"]
["95HH17W1","Woodburn","N09000008","Mid and East Antrim",529,746,685,518,198,548,499,644,"Mixed urban/rural",339066,389514,{"$error":"#N/A"},"N06000005","East Antrim",{"$f":"LOOKUP(OFFSET($D362,0,$B$12),{0,179,357,535,713;1,2,3,4,5})","v":4},{"$f":"LOOKUP(OFFSET($D362,0,$B$12),{0,90,179,268,357,446,535,624,713,802;1,2,3,4,5,6,7,8,9,10})","v":8},439,679,914,391,2423,"Northern Ireland",2423,null,null,null,null,null,null,null,"Dromore South_1"]
["95II01S1","Ballyhanwood_1","N09000007","Lisburn and Castlereagh",720,753,670,723,373,573,743,784,"Urban",341834,373075,{"$error":"#N/A"},"N06000001","Belfast East",{"$f":"LOOKUP(OFFSET($D363,0,$B$12),{0,179,357,535,713;1,2,3,4,5})","v":5},{"$f":"LOOKUP(OFFSET($D363,0,$B$12),{0,90,179,268,357,446,535,624,713,802;1,2,3,4,5,6,7,8,9,10})","v":9},254,454,577,342,1627,"Northern Ireland",1627,null,null,null,null,null,null,null,"Dromore South_2"]
["95II01S2","Ballyhanwood_2","N09000007","Lisburn and Castlereagh",822,836,829,869,274,519,551,827,"Mixed urban/rural",341165,372564,{"$error":"#N/A"},"N06000001","Belfast East",{"$f":"LOOKUP(OFFSET($D364,0,$B$12),{0,179,357,535,713;1,2,3,4,5})","v":5},{"$f":"LOOKUP(OFFSET($D364,0,$B$12),{0,90,179,268,357,446,535,624,713,802;1,2,3,4,5,6,7,8,9,10})","v":10},209,331,633,398,1571,"Northern Ireland",1571,null,null,null,null,null,null,null,"Drumalane_1"]
["95II02S1","Beechill_1","N09000007","Lisburn and Castlereagh",859,787,761,858,286,872,860,853,"Urban",335029,368327,{"$error":"#N/A"},"N06000003","Belfast South",{"$f":"LOOKUP(OFFSET($D365,0,$B$12),{0,179,357,535,713;1,2,3,4,5})","v":5},{"$f":"LOOKUP(OFFSET($D365,0,$B$12),{0,90,179,268,357,446,535,624,713,802;1,2,3,4,5,6,7,8,9,10})","v":10},343,477,657,253,1729,"Northern Ireland",1729,null,null,null,null,null,null,null,"Drumalane_2"]
["95II02S2","Beechill_2","N09000007","Lisburn and Castlereagh",816,552,451,758,499,831,548,733,"Urban",334665,368763,{"$error":"#N/A"},"N06000003","Belfast South",{"$f":"LOOKUP(OFFSET($D366,0,$B$12),{0,179,357,535,713;1,2,3,4,5})","v":5},{"$f":"LOOKUP(OFFSET($D366,0,$B$12),{0,90,179,268,357,446,535,624,713,802;1,2,3,4,5,6,7,8,9,10})","v":9},339,503,643,229,1715,"Northern Ireland",1715,null,null,null,null,null,null,null,"Drumanaway"]
["95II02S3","Beechill_3","N09000003","Belfast",694,312,248,642,593,732,465,549,"Urban",334305,368670,{"$error":"#N/A"},"N06000003","Belfast South",{"$f":"LOOKUP(OFFSET($D367,0,$B$12),{0,179,357,535,713;1,2,3,4,5})","v":4},{"$f":"LOOKUP(OFFSET($D367,0,$B$12),{0,90,179,268,357,446,535,624,713,802;1,2,3,4,5,6,7,8,9,10})","v":7},222,449,555,327,1553,"Northern Ireland",1553,null,null,null,null,null,null,null,"Drumaness_1"]
["95II03S1","Cairnshill_1","N09000007","Lisburn and Castlereagh",872,869,863,854,340,885,884,880,"Urban",336476,368937,{"$error":"#N/A"},"N06000003","Belfast South",{"$f":"LOOKUP(OFFSET($D368,0,$B$12),{0,179,357,535,713;1,2,3,4,5})","v":5},{"$f":"LOOKUP(OFFSET($D368,0,$B$12),{0,90,179,268,357,446,535,624,713,802;1,2,3,4,5,6,7,8,9,10})","v":10},468,697,757,129,2051,"Northern Ireland",2051,null,null,null,null,null,null,null,"Drumaness_2"]
["95II03S2","Cairnshill_2","N09000007","Lisburn and Castlereagh",880,872,833,717,566,174,577,845,"Urban",336109,369281,{"$error":"#N/A"},"N06000003","Belfast South",{"$f":"LOOKUP(OFFSET($D369,0,$B$12),{0,179,357,535,713;1,2,3,4,5})","v":5},{"$f":"LOOKUP(OFFSET($D369,0,$B$12),{0,90,179,268,357,446,535,624,713,802;1,2,3,4,5,6,7,8,9,10})","v":10},296,590,572,320,1778,"Northern Ireland",1778,null,null,null,null,null,null,null,"Drumbo_1"]
["95II04S1","Carrowreagh_1","N09000007","Lisburn and Castlereagh",869,835,774,700,407,884,674,860,"Urban",342915,374170,{"$error":"#N/A"},"N06000001","Belfast East",{"$f":"LOOKUP(OFFSET($D370,0,$B$12),{0,179,357,535,713;1,2,3,4,5})","v":5},{"$f":"LOOKUP(OFFSET($D370,0,$B$12),{0,90,179,268,357,446,535,624,713,802;1,2,3,4,5,6,7,8,9,10})","v":10},626,1124,1017,352,3119,"Northern Ireland",3119,null,null,null,null,null,null,null,"Drumbo_2"]
["95II04S2","Carrowreagh_2","N09000007","Lisburn and Castlereagh",561,435,305,225,664,726,697,511,"Urban",343205,373689,{"$error":"#N/A"},"N06000001","Belfast East",{"$f":"LOOKUP(OFFSET($D371,0,$B$12),{0,179,357,535,713;1,2,3,4,5})","v":3},{"$f":"LOOKUP(OFFSET($D371,0,$B$12),{0,90,179,268,357,446,535,624,713,802;1,2,3,4,5,6,7,8,9,10})","v":6},449,726,659,323,2157,"Northern Ireland",2157,null,null,null,null,null,null,null,"Drumgask_1"]
["95II05S1","Carryduff East_1","N09000007","Lisburn and Castlereagh",843,763,756,825,378,288,734,814,"Urban",336794,366330,{"$error":"#N/A"},"N06000003","Belfast South",{"$f":"LOOKUP(OFFSET($D372,0,$B$12),{0,179,357,535,713;1,2,3,4,5})","v":5},{"$f":"LOOKUP(OFFSET($D372,0,$B$12),{0,90,179,268,357,446,535,624,713,802;1,2,3,4,5,6,7,8,9,10})","v":10},282,496,570,283,1630,"Northern Ireland",1630,null,null,null,null,null,null,null,"Drumgask_2"]
["95II05S2","Carryduff East_2","N09000007","Lisburn and Castlereagh",732,515,480,734,627,689,698,725,"Urban",336882,364910,{"$error":"#N/A"},"N06000003","Belfast South",{"$f":"LOOKUP(OFFSET($D373,0,$B$12),{0,179,357,535,713;1,2,3,4,5})","v":5},{"$f":"LOOKUP(OFFSET($D373,0,$B$12),{0,90,179,268,357,446,535,624,713,802;1,2,3,4,5,6,7,8,9,10})","v":9},441,522,567,416,1946,"Northern Ireland",1946,null,null,null,null,null,null,null,"Drumglass"]
["95II06S1","Carryduff West_1","N09000007","Lisburn and Castlereagh",863,826,798,874,305,498,753,851,"Mixed urban/rural",336266,364936,{"$error":"#N/A"},"N06000003","Belfast South",{"$f":"LOOKUP(OFFSET($D374,0,$B$12),{0,179,357,535,713;1,2,3,4,5})","v":5},{"$f":"LOOKUP(OFFSET($D374,0,$B$12),{0,90,179,268,357,446,535,624,713,802;1,2,3,4,5,6,7,8,9,10})","v":10},320,432,560,239,1550,"Northern Ireland",1550,null,null,null,null,null,null,null,"Drumgor_1"]
["95II06S2","Carryduff West_2","N09000007","Lisburn and Castlereagh",848,808,791,768,604,714,647,872,"Urban",336441,364829,{"$error":"#N/A"},"N06000003","Belfast South",{"$f":"LOOKUP(OFFSET($D375,0,$B$12),{0,179,357,535,713;1,2,3,4,5})","v":5},{"$f":"LOOKUP(OFFSET($D375,0,$B$12),{0,90,179,268,357,446,535,624,713,802;1,2,3,4,5,6,7,8,9,10})","v":10},405,616,596,292,1910,"Northern Ireland",1910,null,null,null,null,null,null,null,"Drumgor_2"]
["95II07W1","Cregagh","N09000003","Belfast",666,188,131,80,812,228,283,241,"Urban",335854,371641,{"$error":"#N/A"},"N06000001","Belfast East",{"$f":"LOOKUP(OFFSET($D376,0,$B$12),{0,179,357,535,713;1,2,3,4,5})","v":2},{"$f":"LOOKUP(OFFSET($D376,0,$B$12),{0,90,179,268,357,446,535,624,713,802;1,2,3,4,5,6,7,8,9,10})","v":3},459,711,660,369,2198,"Northern Ireland",2198,null,null,null,null,null,null,null,"Drumgullion_1"]
["95II08W1","Downshire","N09000003","Belfast",703,570,475,473,860,394,477,687,"Urban",336360,371661,{"$error":"#N/A"},"N06000001","Belfast East",{"$f":"LOOKUP(OFFSET($D377,0,$B$12),{0,179,357,535,713;1,2,3,4,5})","v":4},{"$f":"LOOKUP(OFFSET($D377,0,$B$12),{0,90,179,268,357,446,535,624,713,802;1,2,3,4,5,6,7,8,9,10})","v":8},472,776,828,398,2474,"Northern Ireland",2474,null,null,null,null,null,null,null,"Drumgullion_2"]
["95II09S1","Dundonald_1","N09000007","Lisburn and Castlereagh",768,720,679,747,505,860,504,807,"Urban",341533,373907,{"$error":"#N/A"},"N06000001","Belfast East",{"$f":"LOOKUP(OFFSET($D378,0,$B$12),{0,179,357,535,713;1,2,3,4,5})","v":5},{"$f":"LOOKUP(OFFSET($D378,0,$B$12),{0,90,179,268,357,446,535,624,713,802;1,2,3,4,5,6,7,8,9,10})","v":10},333,573,757,367,2031,"Northern Ireland",2031,null,null,null,null,null,null,null,"Drumnakilly"]
["95II09S2","Dundonald_2","N09000007","Lisburn and Castlereagh",844,729,583,655,657,867,864,838,"Urban",342137,374441,{"$error":"#N/A"},"N06000001","Belfast East",{"$f":"LOOKUP(OFFSET($D379,0,$B$12),{0,179,357,535,713;1,2,3,4,5})","v":5},{"$f":"LOOKUP(OFFSET($D379,0,$B$12),{0,90,179,268,357,446,535,624,713,802;1,2,3,4,5,6,7,8,9,10})","v":10},267,430,530,196,1424,"Northern Ireland",1424,null,null,null,null,null,null,null,"Drumnamoe_1"]
["95II10W1","Enler","N09000007","Lisburn and Castlereagh",629,322,180,130,658,832,354,371,"Urban",342676,373278,{"$error":"#N/A"},"N06000001","Belfast East",{"$f":"LOOKUP(OFFSET($D380,0,$B$12),{0,179,357,535,713;1,2,3,4,5})","v":3},{"$f":"LOOKUP(OFFSET($D380,0,$B$12),{0,90,179,268,357,446,535,624,713,802;1,2,3,4,5,6,7,8,9,10})","v":5},516,798,814,444,2573,"Northern Ireland",2573,null,null,null,null,null,null,null,"Drumnamoe_2"]
["95II11W1","Galwally","N09000007","Lisburn and Castlereagh",886,812,800,834,671,833,569,883,"Urban",335950,369880,{"$error":"#N/A"},"N06000003","Belfast South",{"$f":"LOOKUP(OFFSET($D381,0,$B$12),{0,179,357,535,713;1,2,3,4,5})","v":5},{"$f":"LOOKUP(OFFSET($D381,0,$B$12),{0,90,179,268,357,446,535,624,713,802;1,2,3,4,5,6,7,8,9,10})","v":10},447,672,923,500,2542,"Northern Ireland",2542,null,null,null,null,null,null,null,"Drumquin"]
["95II12W1","Gilnahirk","N09000003","Belfast",878,840,802,829,828,210,818,877,"Urban",339549,372957,{"$error":"#N/A"},"N06000001","Belfast East",{"$f":"LOOKUP(OFFSET($D382,0,$B$12),{0,179,357,535,713;1,2,3,4,5})","v":5},{"$f":"LOOKUP(OFFSET($D382,0,$B$12),{0,90,179,268,357,446,535,624,713,802;1,2,3,4,5,6,7,8,9,10})","v":10},468,629,872,525,2494,"Northern Ireland",2494,null,null,null,null,null,null,null,"Drumragh"]
["95II13W1","Graham's Bridge","N09000007","Lisburn and Castlereagh",428,367,260,197,838,678,399,410,"Urban",342264,373739,{"$error":"#N/A"},"N06000001","Belfast East",{"$f":"LOOKUP(OFFSET($D383,0,$B$12),{0,179,357,535,713;1,2,3,4,5})","v":3},{"$f":"LOOKUP(OFFSET($D383,0,$B$12),{0,90,179,268,357,446,535,624,713,802;1,2,3,4,5,6,7,8,9,10})","v":5},503,764,890,559,2716,"Northern Ireland",2716,null,null,null,null,null,null,null,"Dufferin"]
["95II14W1","Hillfoot","N09000003","Belfast",836,863,842,857,591,613,835,884,"Urban",336698,371181,{"$error":"#N/A"},"N06000003","Belfast South",{"$f":"LOOKUP(OFFSET($D384,0,$B$12),{0,179,357,535,713;1,2,3,4,5})","v":5},{"$f":"LOOKUP(OFFSET($D384,0,$B$12),{0,90,179,268,357,446,535,624,713,802;1,2,3,4,5,6,7,8,9,10})","v":10},429,659,844,611,2542,"Northern Ireland",2542,null,null,null,null,null,null,null,"Dunanney"]
["95II15S1","Knockbracken_1","N09000007","Lisburn and Castlereagh",852,880,876,863,435,520,542,870,"Urban",336072,368499,{"$error":"#N/A"},"N06000003","Belfast South",{"$f":"LOOKUP(OFFSET($D385,0,$B$12),{0,179,357,535,713;1,2,3,4,5})","v":5},{"$f":"LOOKUP(OFFSET($D385,0,$B$12),{0,90,179,268,357,446,535,624,713,802;1,2,3,4,5,6,7,8,9,10})","v":10},432,595,686,173,1886,"Northern Ireland",1886,null,null,null,null,null,null,null,"Duncairn_1"]
["95II15S2","Knockbracken_2","N09000007","Lisburn and Castlereagh",771,841,838,842,605,473,664,867,"Urban",335682,369060,{"$error":"#N/A"},"N06000003","Belfast South",{"$f":"LOOKUP(OFFSET($D386,0,$B$12),{0,179,357,535,713;1,2,3,4,5})","v":5},{"$f":"LOOKUP(OFFSET($D386,0,$B$12),{0,90,179,268,357,446,535,624,713,802;1,2,3,4,5,6,7,8,9,10})","v":10},265,344,461,421,1490,"Northern Ireland",1490,null,null,null,null,null,null,null,"Duncairn_2"]
["95II16W1","Lisnasharragh","N09000003","Belfast",871,448,360,248,717,749,749,615,"Urban",336994,371842,{"$error":"#N/A"},"N06000001","Belfast East",{"$f":"LOOKUP(OFFSET($D387,0,$B$12),{0,179,357,535,713;1,2,3,4,5})","v":4},{"$f":"LOOKUP(OFFSET($D387,0,$B$12),{0,90,179,268,357,446,535,624,713,802;1,2,3,4,5,6,7,8,9,10})","v":7},432,615,696,399,2143,"Northern Ireland",2143,null,null,null,null,null,null,null,"Dunclug"]
["95II17W1","Lower Braniel","N09000003","Belfast",697,429,416,483,745,755,511,641,"Urban",338002,371989,{"$error":"#N/A"},"N06000001","Belfast East",{"$f":"LOOKUP(OFFSET($D388,0,$B$12),{0,179,357,535,713;1,2,3,4,5})","v":4},{"$f":"LOOKUP(OFFSET($D388,0,$B$12),{0,90,179,268,357,446,535,624,713,802;1,2,3,4,5,6,7,8,9,10})","v":8},386,722,854,516,2478,"Northern Ireland",2478,null,null,null,null,null,null,null,"Dundonald_1"]
["95II18W1","Minnowburn","N09000003","Belfast",698,225,153,106,514,640,285,293,"Urban",333531,368688,{"$error":"#N/A"},"N06000003","Belfast South",{"$f":"LOOKUP(OFFSET($D389,0,$B$12),{0,179,357,535,713;1,2,3,4,5})","v":2},{"$f":"LOOKUP(OFFSET($D389,0,$B$12),{0,90,179,268,357,446,535,624,713,802;1,2,3,4,5,6,7,8,9,10})","v":4},395,706,630,479,2209,"Northern Ireland",2209,null,null,null,null,null,null,null,"Dundonald_2"]
["95II19S1","Moneyreagh_1","N09000007","Lisburn and Castlereagh",800,846,871,836,172,751,883,821,"Mixed urban/rural",338403,365603,{"$error":"#N/A"},"N06000016","Strangford",{"$f":"LOOKUP(OFFSET($D390,0,$B$12),{0,179,357,535,713;1,2,3,4,5})","v":5},{"$f":"LOOKUP(OFFSET($D390,0,$B$12),{0,90,179,268,357,446,535,624,713,802;1,2,3,4,5,6,7,8,9,10})","v":10},316,483,736,311,1847,"Northern Ireland",1847,null,null,null,null,null,null,null,"Dundooan_1"]
["95II19S2","Moneyreagh_2","N09000007","Lisburn and Castlereagh",829,664,614,703,268,465,699,740,"Rural",340406,367678,{"$error":"#N/A"},"N06000016","Strangford",{"$f":"LOOKUP(OFFSET($D391,0,$B$12),{0,179,357,535,713;1,2,3,4,5})","v":5},{"$f":"LOOKUP(OFFSET($D391,0,$B$12),{0,90,179,268,357,446,535,624,713,802;1,2,3,4,5,6,7,8,9,10})","v":9},308,497,730,370,1905,"Northern Ireland",1905,null,null,null,null,null,null,null,"Dundooan_2"]
["95II20W1","Newtownbreda","N09000007","Lisburn and Castlereagh",827,695,665,726,759,420,520,815,"Urban",335196,369518,{"$error":"#N/A"},"N06000003","Belfast South",{"$f":"LOOKUP(OFFSET($D392,0,$B$12),{0,179,357,535,713;1,2,3,4,5})","v":5},{"$f":"LOOKUP(OFFSET($D392,0,$B$12),{0,90,179,268,357,446,535,624,713,802;1,2,3,4,5,6,7,8,9,10})","v":10},504,845,862,494,2706,"Northern Ireland",2706,null,null,null,null,null,null,null,"Dundrum"]
["95II21W1","Tullycarnet","N09000003","Belfast",433,191,182,74,783,753,518,248,"Urban",340295,373188,{"$error":"#N/A"},"N06000001","Belfast East",{"$f":"LOOKUP(OFFSET($D393,0,$B$12),{0,179,357,535,713;1,2,3,4,5})","v":2},{"$f":"LOOKUP(OFFSET($D393,0,$B$12),{0,90,179,268,357,446,535,624,713,802;1,2,3,4,5,6,7,8,9,10})","v":3},587,779,683,364,2413,"Northern Ireland",2413,null,null,null,null,null,null,null,"Dungiven"]
["95II22W1","Upper Braniel","N09000003","Belfast",622,560,443,466,469,403,475,614,"Urban",338670,372002,{"$error":"#N/A"},"N06000001","Belfast East",{"$f":"LOOKUP(OFFSET($D394,0,$B$12),{0,179,357,535,713;1,2,3,4,5})","v":4},{"$f":"LOOKUP(OFFSET($D394,0,$B$12),{0,90,179,268,357,446,535,624,713,802;1,2,3,4,5,6,7,8,9,10})","v":7},429,647,785,467,2328,"Northern Ireland",2328,null,null,null,null,null,null,null,"Dunloy"]
["95II23W1","Wynchurch","N09000003","Belfast",834,727,637,679,861,522,605,836,"Urban",335808,371145,{"$error":"#N/A"},"N06000003","Belfast South",{"$f":"LOOKUP(OFFSET($D395,0,$B$12),{0,179,357,535,713;1,2,3,4,5})","v":5},{"$f":"LOOKUP(OFFSET($D395,0,$B$12),{0,90,179,268,357,446,535,624,713,802;1,2,3,4,5,6,7,8,9,10})","v":10},435,693,786,382,2296,"Northern Ireland",2296,null,null,null,null,null,null,null,"Dunluce"]
["95JJ01W1","Agivey","N09000004","Causeway Coast and Glens",362,681,768,676,117,186,679,550,"Rural",288129,421921,{"$error":"#N/A"},"N06000006","East Londonderry",{"$f":"LOOKUP(OFFSET($D396,0,$B$12),{0,179,357,535,713;1,2,3,4,5})","v":4},{"$f":"LOOKUP(OFFSET($D396,0,$B$12),{0,90,179,268,357,446,535,624,713,802;1,2,3,4,5,6,7,8,9,10})","v":7},469,630,960,453,2513,"Northern Ireland",2513,null,null,null,null,null,null,null,"Dunminning"]
["95JJ02W1","Atlantic","N09000004","Causeway Coast and Glens",124,216,451,305,419,752,72,213,"Urban",283302,438827,{"$error":"#N/A"},"N06000006","East Londonderry",{"$f":"LOOKUP(OFFSET($D397,0,$B$12),{0,179,357,535,713;1,2,3,4,5})","v":2},{"$f":"LOOKUP(OFFSET($D397,0,$B$12),{0,90,179,268,357,446,535,624,713,802;1,2,3,4,5,6,7,8,9,10})","v":3},394,598,820,535,2347,"Northern Ireland",2347,null,null,null,null,null,null,null,"Dunmore"]
["95JJ03S1","Ballysally_1","N09000004","Causeway Coast and Glens",6,38,94,114,544,324,93,31,"Urban",285358,434528,{"$error":"#N/A"},"N06000006","East Londonderry",{"$f":"LOOKUP(OFFSET($D398,0,$B$12),{0,179,357,535,713;1,2,3,4,5})","v":1},{"$f":"LOOKUP(OFFSET($D398,0,$B$12),{0,90,179,268,357,446,535,624,713,802;1,2,3,4,5,6,7,8,9,10})","v":1},402,449,426,163,1440,"Northern Ireland",1440,null,null,null,null,null,null,null,"Dunmurry_1"]
["95JJ03S2","Ballysally_2","N09000004","Causeway Coast and Glens",176,156,193,103,480,565,236,160,"Urban",285628,433923,{"$error":"#N/A"},"N06000006","East Londonderry",{"$f":"LOOKUP(OFFSET($D399,0,$B$12),{0,179,357,535,713;1,2,3,4,5})","v":1},{"$f":"LOOKUP(OFFSET($D399,0,$B$12),{0,90,179,268,357,446,535,624,713,802;1,2,3,4,5,6,7,8,9,10})","v":2},293,344,389,96,1121,"Northern Ireland",1121,null,null,null,null,null,null,null,"Dunmurry_2"]
["95JJ04S1","Castlerock_1","N09000004","Causeway Coast and Glens",187,518,734,320,177,380,476,373,"Rural",276888,434074,{"$error":"#N/A"},"N06000006","East Londonderry",{"$f":"LOOKUP(OFFSET($D400,0,$B$12),{0,179,357,535,713;1,2,3,4,5})","v":3},{"$f":"LOOKUP(OFFSET($D400,0,$B$12),{0,90,179,268,357,446,535,624,713,802;1,2,3,4,5,6,7,8,9,10})","v":5},309,388,547,307,1550,"Northern Ireland",1550,null,null,null,null,null,null,null,"Dunnamanagh"]
["95JJ04S2","Castlerock_2","N09000004","Causeway Coast and Glens",175,561,715,470,267,708,581,450,"Rural",277509,435347,{"$error":"#N/A"},"N06000006","East Londonderry",{"$f":"LOOKUP(OFFSET($D401,0,$B$12),{0,179,357,535,713;1,2,3,4,5})","v":3},{"$f":"LOOKUP(OFFSET($D401,0,$B$12),{0,90,179,268,357,446,535,624,713,802;1,2,3,4,5,6,7,8,9,10})","v":6},239,404,562,369,1575,"Northern Ireland",1575,null,null,null,null,null,null,null,"Dunnamore"]
["95JJ05W1","Central_Coleraine","N09000004","Causeway Coast and Glens",106,189,222,226,831,26,36,137,"Urban",285189,432701,{"$error":"#N/A"},"N06000006","East Londonderry",{"$f":"LOOKUP(OFFSET($D402,0,$B$12),{0,179,357,535,713;1,2,3,4,5})","v":1},{"$f":"LOOKUP(OFFSET($D402,0,$B$12),{0,90,179,268,357,446,535,624,713,802;1,2,3,4,5,6,7,8,9,10})","v":2},279,809,575,445,2109,"Northern Ireland",2109,null,null,null,null,null,null,null,"East"]
["95JJ06W1","Churchland","N09000004","Causeway Coast and Glens",200,139,171,149,626,530,152,172,"Urban",284147,431998,{"$error":"#N/A"},"N06000006","East Londonderry",{"$f":"LOOKUP(OFFSET($D403,0,$B$12),{0,179,357,535,713;1,2,3,4,5})","v":1},{"$f":"LOOKUP(OFFSET($D403,0,$B$12),{0,90,179,268,357,446,535,624,713,802;1,2,3,4,5,6,7,8,9,10})","v":2},561,807,807,353,2528,"Northern Ireland",2528,null,null,null,null,null,null,null,"Ebrington_1"]
["95JJ07W1","Cross Glebe","N09000004","Causeway Coast and Glens",142,136,184,139,521,722,336,157,"Urban",286190,432896,{"$error":"#N/A"},"N06000006","East Londonderry",{"$f":"LOOKUP(OFFSET($D404,0,$B$12),{0,179,357,535,713;1,2,3,4,5})","v":1},{"$f":"LOOKUP(OFFSET($D404,0,$B$12),{0,90,179,268,357,446,535,624,713,802;1,2,3,4,5,6,7,8,9,10})","v":2},682,910,802,416,2809,"Northern Ireland",2809,null,null,null,null,null,null,null,"Ebrington_2"]
["95JJ08S1","Dundooan_1","N09000004","Causeway Coast and Glens",405,335,474,345,205,62,305,337,"Rural",287319,433720,{"$error":"#N/A"},"N06000006","East Londonderry",{"$f":"LOOKUP(OFFSET($D405,0,$B$12),{0,179,357,535,713;1,2,3,4,5})","v":2},{"$f":"LOOKUP(OFFSET($D405,0,$B$12),{0,90,179,268,357,446,535,624,713,802;1,2,3,4,5,6,7,8,9,10})","v":4},219,302,526,365,1411,"Northern Ireland",1411,null,null,null,null,null,null,null,"Eden_1"]
["95JJ08S2","Dundooan_2","N09000004","Causeway Coast and Glens",659,830,834,752,315,859,501,793,"Mixed urban/rural",282809,436973,{"$error":"#N/A"},"N06000006","East Londonderry",{"$f":"LOOKUP(OFFSET($D406,0,$B$12),{0,179,357,535,713;1,2,3,4,5})","v":5},{"$f":"LOOKUP(OFFSET($D406,0,$B$12),{0,90,179,268,357,446,535,624,713,802;1,2,3,4,5,6,7,8,9,10})","v":9},353,711,582,250,1896,"Northern Ireland",1896,null,null,null,null,null,null,null,"Eden_2"]
["95JJ09W1","Dunluce","N09000004","Causeway Coast and Glens",326,637,830,670,163,225,549,547,"Rural",291962,438594,{"$error":"#N/A"},"N06000006","East Londonderry",{"$f":"LOOKUP(OFFSET($D407,0,$B$12),{0,179,357,535,713;1,2,3,4,5})","v":4},{"$f":"LOOKUP(OFFSET($D407,0,$B$12),{0,90,179,268,357,446,535,624,713,802;1,2,3,4,5,6,7,8,9,10})","v":7},282,425,733,575,2016,"Northern Ireland",2016,null,null,null,null,null,null,null,"Edenderry"]
["95JJ10W1","Garvagh","N09000004","Causeway Coast and Glens",71,432,559,467,189,724,623,272,"Rural",284038,414314,{"$error":"#N/A"},"N06000006","East Londonderry",{"$f":"LOOKUP(OFFSET($D408,0,$B$12),{0,179,357,535,713;1,2,3,4,5})","v":2},{"$f":"LOOKUP(OFFSET($D408,0,$B$12),{0,90,179,268,357,446,535,624,713,802;1,2,3,4,5,6,7,8,9,10})","v":4},679,793,907,482,2860,"Northern Ireland",2860,null,null,null,null,null,null,null,"Edenderry_1"]
["95JJ11S1","Hopefield_1","N09000004","Causeway Coast and Glens",486,504,673,555,343,853,534,626,"Urban",286256,439288,{"$error":"#N/A"},"N06000006","East Londonderry",{"$f":"LOOKUP(OFFSET($D409,0,$B$12),{0,179,357,535,713;1,2,3,4,5})","v":4},{"$f":"LOOKUP(OFFSET($D409,0,$B$12),{0,90,179,268,357,446,535,624,713,802;1,2,3,4,5,6,7,8,9,10})","v":8},339,431,686,364,1819,"Northern Ireland",1819,null,null,null,null,null,null,null,"Edenderry_2"]
["95JJ11S2","Hopefield_2","N09000004","Causeway Coast and Glens",317,717,752,530,374,540,368,593,"Urban",285876,439220,{"$error":"#N/A"},"N06000006","East Londonderry",{"$f":"LOOKUP(OFFSET($D410,0,$B$12),{0,179,357,535,713;1,2,3,4,5})","v":4},{"$f":"LOOKUP(OFFSET($D410,0,$B$12),{0,90,179,268,357,446,535,624,713,802;1,2,3,4,5,6,7,8,9,10})","v":7},381,481,701,392,1955,"Northern Ireland",1955,null,null,null,null,null,null,null,"Eglinton_1"]
["95JJ12W1","Kilrea","N09000004","Causeway Coast and Glens",227,379,503,535,245,764,557,407,"Rural",291660,412447,{"$error":"#N/A"},"N06000006","East Londonderry",{"$f":"LOOKUP(OFFSET($D411,0,$B$12),{0,179,357,535,713;1,2,3,4,5})","v":3},{"$f":"LOOKUP(OFFSET($D411,0,$B$12),{0,90,179,268,357,446,535,624,713,802;1,2,3,4,5,6,7,8,9,10})","v":5},683,887,864,416,2850,"Northern Ireland",2850,null,null,null,null,null,null,null,"Eglinton_2"]
["95JJ13S1","Knocklynn_1","N09000004","Causeway Coast and Glens",294,484,674,501,364,820,762,542,"Urban",286748,430688,{"$error":"#N/A"},"N06000006","East Londonderry",{"$f":"LOOKUP(OFFSET($D412,0,$B$12),{0,179,357,535,713;1,2,3,4,5})","v":4},{"$f":"LOOKUP(OFFSET($D412,0,$B$12),{0,90,179,268,357,446,535,624,713,802;1,2,3,4,5,6,7,8,9,10})","v":7},528,651,808,228,2215,"Northern Ireland",2215,null,null,null,null,null,null,null,"Enagh_1_Derry"]
["95JJ13S2","Knocklynn_2","N09000004","Causeway Coast and Glens",409,580,753,646,393,842,849,665,"Urban",285938,430607,{"$error":"#N/A"},"N06000006","East Londonderry",{"$f":"LOOKUP(OFFSET($D413,0,$B$12),{0,179,357,535,713;1,2,3,4,5})","v":4},{"$f":"LOOKUP(OFFSET($D413,0,$B$12),{0,90,179,268,357,446,535,624,713,802;1,2,3,4,5,6,7,8,9,10})","v":8},274,429,641,331,1674,"Northern Ireland",1674,null,null,null,null,null,null,null,"Enagh_1_Limavady"]
["95JJ14W1","Macosquin","N09000004","Causeway Coast and Glens",339,440,662,547,145,345,471,458,"Rural",281470,429501,{"$error":"#N/A"},"N06000006","East Londonderry",{"$f":"LOOKUP(OFFSET($D414,0,$B$12),{0,179,357,535,713;1,2,3,4,5})","v":3},{"$f":"LOOKUP(OFFSET($D414,0,$B$12),{0,90,179,268,357,446,535,624,713,802;1,2,3,4,5,6,7,8,9,10})","v":6},503,565,868,427,2363,"Northern Ireland",2363,null,null,null,null,null,null,null,"Enagh_2_Derry"]
["95JJ15W1","Mount Sandel","N09000004","Causeway Coast and Glens",354,376,546,374,753,415,229,471,"Urban",285502,431645,{"$error":"#N/A"},"N06000006","East Londonderry",{"$f":"LOOKUP(OFFSET($D415,0,$B$12),{0,179,357,535,713;1,2,3,4,5})","v":3},{"$f":"LOOKUP(OFFSET($D415,0,$B$12),{0,90,179,268,357,446,535,624,713,802;1,2,3,4,5,6,7,8,9,10})","v":6},300,560,553,560,1973,"Northern Ireland",1973,null,null,null,null,null,null,null,"Enagh_2_Limavady"]
["95JJ16W1","Portstewart","N09000004","Causeway Coast and Glens",170,210,353,445,672,715,40,253,"Urban",281956,437959,{"$error":"#N/A"},"N06000006","East Londonderry",{"$f":"LOOKUP(OFFSET($D416,0,$B$12),{0,179,357,535,713;1,2,3,4,5})","v":2},{"$f":"LOOKUP(OFFSET($D416,0,$B$12),{0,90,179,268,357,446,535,624,713,802;1,2,3,4,5,6,7,8,9,10})","v":3},247,451,533,440,1670,"Northern Ireland",1670,null,null,null,null,null,null,null,"Enler"]
["95JJ17W1","Ringsend","N09000004","Causeway Coast and Glens",177,495,697,556,51,222,870,341,"Rural",282277,419876,{"$error":"#N/A"},"N06000006","East Londonderry",{"$f":"LOOKUP(OFFSET($D417,0,$B$12),{0,179,357,535,713;1,2,3,4,5})","v":2},{"$f":"LOOKUP(OFFSET($D417,0,$B$12),{0,90,179,268,357,446,535,624,713,802;1,2,3,4,5,6,7,8,9,10})","v":4},539,647,874,441,2501,"Northern Ireland",2501,null,null,null,null,null,null,null,"Erne"]
["95JJ18W1","Royal Portrush","N09000004","Causeway Coast and Glens",32,140,342,348,405,397,18,105,"Urban",286172,440297,{"$f":"IF(B418=$F$27,O418,NA())","v":{"$error":"#N/A"}},"N06000006","East Londonderry",{"$f":"LOOKUP(OFFSET($D418,0,$B$12),{0,179,357,535,713;1,2,3,4,5})","v":1},{"$f":"LOOKUP(OFFSET($D418,0,$B$12),{0,90,179,268,357,446,535,624,713,802;1,2,3,4,5,6,7,8,9,10})","v":2},289,466,719,489,1964,"Northern Ireland",{"$f":"CHOOSE($K$5,$Y418,IF($D418=$B$27,$Y418,\"\"),IF($R418=$B$27,$Y418,\"\"))","v":1964},null,null,null,null,null,null,null,"Fair Green"]
["95JJ19S1","Strand_1_Coleraine","N09000004","Causeway Coast and Glens",825,873,866,840,576,113,505,835,"Urban",281869,437034,{"$error":"#N/A"},"N06000006","East Londonderry",{"$f":"LOOKUP(OFFSET($D419,0,$B$12),{0,179,357,535,713;1,2,3,4,5})","v":5},{"$f":"LOOKUP(OFFSET($D419,0,$B$12),{0,90,179,268,357,446,535,624,713,802;1,2,3,4,5,6,7,8,9,10})","v":10},228,533,468,456,1685,"Northern Ireland",1685,null,null,null,null,null,null,null,"Fairhill"]
["95JJ19S2","Strand_2_Coleraine","N09000004","Causeway Coast and Glens",823,870,784,848,567,762,232,861,"Urban",282229,437335,{"$error":"#N/A"},"N06000006","East Londonderry",{"$f":"LOOKUP(OFFSET($D420,0,$B$12),{0,179,357,535,713;1,2,3,4,5})","v":5},{"$f":"LOOKUP(OFFSET($D420,0,$B$12),{0,90,179,268,357,446,535,624,713,802;1,2,3,4,5,6,7,8,9,10})","v":10},130,771,275,221,1396,"Northern Ireland",1396,null,null,null,null,null,null,null,"Fairy Water"]
["95JJ20S1","The Cuts_1","N09000004","Causeway Coast and Glens",327,628,708,528,392,863,405,592,"Mixed urban/rural",284384,430555,{"$error":"#N/A"},"N06000006","East Londonderry",{"$f":"LOOKUP(OFFSET($D421,0,$B$12),{0,179,357,535,713;1,2,3,4,5})","v":4},{"$f":"LOOKUP(OFFSET($D421,0,$B$12),{0,90,179,268,357,446,535,624,713,802;1,2,3,4,5,6,7,8,9,10})","v":7},510,660,781,314,2265,"Northern Ireland",2265,null,null,null,null,null,null,null,"Falls Park_1"]
["95JJ20S2","The Cuts_2","N09000004","Causeway Coast and Glens",494,422,513,344,583,673,366,539,"Urban",283960,431309,{"$error":"#N/A"},"N06000006","East Londonderry",{"$f":"LOOKUP(OFFSET($D422,0,$B$12),{0,179,357,535,713;1,2,3,4,5})","v":4},{"$f":"LOOKUP(OFFSET($D422,0,$B$12),{0,90,179,268,357,446,535,624,713,802;1,2,3,4,5,6,7,8,9,10})","v":7},278,460,708,376,1821,"Northern Ireland",1821,null,null,null,null,null,null,null,"Falls Park_2"]
["95JJ21W1","University","N09000004","Causeway Coast and Glens",383,391,345,188,464,800,406,398,"Urban",284957,433955,{"$error":"#N/A"},"N06000006","East Londonderry",{"$f":"LOOKUP(OFFSET($D423,0,$B$12),{0,179,357,535,713;1,2,3,4,5})","v":3},{"$f":"LOOKUP(OFFSET($D423,0,$B$12),{0,90,179,268,357,446,535,624,713,802;1,2,3,4,5,6,7,8,9,10})","v":5},368,1078,762,430,2638,"Northern Ireland",2638,null,null,null,null,null,null,null,"Falls Park_3"]
["95JJ22W1","Waterside","N09000004","Causeway Coast and Glens",416,693,813,773,554,567,426,708,"Urban",283863,433062,{"$error":"#N/A"},"N06000006","East Londonderry",{"$f":"LOOKUP(OFFSET($D424,0,$B$12),{0,179,357,535,713;1,2,3,4,5})","v":4},{"$f":"LOOKUP(OFFSET($D424,0,$B$12),{0,90,179,268,357,446,535,624,713,802;1,2,3,4,5,6,7,8,9,10})","v":8},493,600,937,634,2664,"Northern Ireland",2664,null,null,null,null,null,null,null,"Falls_1"]
["95KK01W1","Ardboe","N09000009","Mid Ulster",237,238,178,258,79,636,882,206,"Rural",294294,377842,{"$error":"#N/A"},"N06000010","Mid Ulster",{"$f":"LOOKUP(OFFSET($D425,0,$B$12),{0,179,357,535,713;1,2,3,4,5})","v":2},{"$f":"LOOKUP(OFFSET($D425,0,$B$12),{0,90,179,268,357,446,535,624,713,802;1,2,3,4,5,6,7,8,9,10})","v":3},646,831,822,352,2651,"Northern Ireland",2651,null,null,null,null,null,null,null,"Falls_2"]
["95KK02W1","Coagh","N09000009","Mid Ulster",566,491,308,413,181,456,724,492,"Rural",287409,378409,{"$error":"#N/A"},"N06000010","Mid Ulster",{"$f":"LOOKUP(OFFSET($D426,0,$B$12),{0,179,357,535,713;1,2,3,4,5})","v":3},{"$f":"LOOKUP(OFFSET($D426,0,$B$12),{0,90,179,268,357,446,535,624,713,802;1,2,3,4,5,6,7,8,9,10})","v":6},417,630,630,380,2057,"Northern Ireland",2057,null,null,null,null,null,null,null,"Falls_3"]
["95KK03W1","Dunnamore","N09000009","Mid Ulster",222,441,425,590,6,463,740,271,"Rural",269484,379896,{"$error":"#N/A"},"N06000010","Mid Ulster",{"$f":"LOOKUP(OFFSET($D427,0,$B$12),{0,179,357,535,713;1,2,3,4,5})","v":2},{"$f":"LOOKUP(OFFSET($D427,0,$B$12),{0,90,179,268,357,446,535,624,713,802;1,2,3,4,5,6,7,8,9,10})","v":4},665,791,708,329,2492,"Northern Ireland",2492,null,null,null,null,null,null,null,"Farranshane"]
["95KK04W1","Gortalowry","N09000009","Mid Ulster",665,292,238,296,444,483,203,404,"Urban",280618,377230,{"$error":"#N/A"},"N06000010","Mid Ulster",{"$f":"LOOKUP(OFFSET($D428,0,$B$12),{0,179,357,535,713;1,2,3,4,5})","v":3},{"$f":"LOOKUP(OFFSET($D428,0,$B$12),{0,90,179,268,357,446,535,624,713,802;1,2,3,4,5,6,7,8,9,10})","v":5},631,1011,830,282,2754,"Northern Ireland",2754,null,null,null,null,null,null,null,"Fathom"]
["95KK05W1","Killycolpy","N09000009","Mid Ulster",267,388,378,306,80,430,859,314,"Rural",292567,373941,{"$error":"#N/A"},"N06000010","Mid Ulster",{"$f":"LOOKUP(OFFSET($D429,0,$B$12),{0,179,357,535,713;1,2,3,4,5})","v":2},{"$f":"LOOKUP(OFFSET($D429,0,$B$12),{0,90,179,268,357,446,535,624,713,802;1,2,3,4,5,6,7,8,9,10})","v":4},644,943,817,336,2741,"Northern Ireland",2741,null,null,null,null,null,null,null,"Feeny"]
["95KK06W1","Killymoon","N09000009","Mid Ulster",361,217,192,191,549,283,276,254,"Urban",281557,377213,{"$error":"#N/A"},"N06000010","Mid Ulster",{"$f":"LOOKUP(OFFSET($D430,0,$B$12),{0,179,357,535,713;1,2,3,4,5})","v":2},{"$f":"LOOKUP(OFFSET($D430,0,$B$12),{0,90,179,268,357,446,535,624,713,802;1,2,3,4,5,6,7,8,9,10})","v":3},351,626,548,297,1821,"Northern Ireland",1821,null,null,null,null,null,null,null,"Finaghy_1"]
["95KK07W1","Lissan","N09000009","Mid Ulster",562,521,526,512,10,524,791,434,"Rural",279729,382977,{"$error":"#N/A"},"N06000010","Mid Ulster",{"$f":"LOOKUP(OFFSET($D431,0,$B$12),{0,179,357,535,713;1,2,3,4,5})","v":3},{"$f":"LOOKUP(OFFSET($D431,0,$B$12),{0,90,179,268,357,446,535,624,713,802;1,2,3,4,5,6,7,8,9,10})","v":5},432,618,702,361,2113,"Northern Ireland",2113,null,null,null,null,null,null,null,"Finaghy_2"]
["95KK08W1","Moneymore","N09000009","Mid Ulster",296,479,369,382,238,757,345,406,"Rural",285735,383203,{"$error":"#N/A"},"N06000010","Mid Ulster",{"$f":"LOOKUP(OFFSET($D432,0,$B$12),{0,179,357,535,713;1,2,3,4,5})","v":3},{"$f":"LOOKUP(OFFSET($D432,0,$B$12),{0,90,179,268,357,446,535,624,713,802;1,2,3,4,5,6,7,8,9,10})","v":5},692,965,793,383,2834,"Northern Ireland",2834,null,null,null,null,null,null,null,"Finaghy_3"]
["95KK09W1","Newbuildings","N09000009","Mid Ulster",490,339,236,250,650,541,159,390,"Urban",281356,378748,{"$error":"#N/A"},"N06000010","Mid Ulster",{"$f":"LOOKUP(OFFSET($D433,0,$B$12),{0,179,357,535,713;1,2,3,4,5})","v":3},{"$f":"LOOKUP(OFFSET($D433,0,$B$12),{0,90,179,268,357,446,535,624,713,802;1,2,3,4,5,6,7,8,9,10})","v":5},517,862,721,412,2512,"Northern Ireland",2512,null,null,null,null,null,null,null,"Finn"]
["95KK10W1","Oaklands","N09000009","Mid Ulster",205,654,611,532,59,327,688,397,"Rural",275546,377621,{"$error":"#N/A"},"N06000010","Mid Ulster",{"$f":"LOOKUP(OFFSET($D434,0,$B$12),{0,179,357,535,713;1,2,3,4,5})","v":3},{"$f":"LOOKUP(OFFSET($D434,0,$B$12),{0,90,179,268,357,446,535,624,713,802;1,2,3,4,5,6,7,8,9,10})","v":5},536,717,715,326,2293,"Northern Ireland",2293,null,null,null,null,null,null,null,"Fintona"]
["95KK11W1","Oldtown","N09000009","Mid Ulster",243,297,189,330,552,809,204,296,"Urban",280578,378864,{"$error":"#N/A"},"N06000010","Mid Ulster",{"$f":"LOOKUP(OFFSET($D435,0,$B$12),{0,179,357,535,713;1,2,3,4,5})","v":2},{"$f":"LOOKUP(OFFSET($D435,0,$B$12),{0,90,179,268,357,446,535,624,713,802;1,2,3,4,5,6,7,8,9,10})","v":4},561,754,771,337,2423,"Northern Ireland",2423,null,null,null,null,null,null,null,"Fivemiletown"]
["95KK12W1","Pomeroy","N09000009","Mid Ulster",68,267,290,318,91,480,775,167,"Rural",270616,372252,{"$error":"#N/A"},"N06000010","Mid Ulster",{"$f":"LOOKUP(OFFSET($D436,0,$B$12),{0,179,357,535,713;1,2,3,4,5})","v":1},{"$f":"LOOKUP(OFFSET($D436,0,$B$12),{0,90,179,268,357,446,535,624,713,802;1,2,3,4,5,6,7,8,9,10})","v":2},537,834,714,268,2353,"Northern Ireland",2353,null,null,null,null,null,null,null,"Florence Court and Kinawley"]
["95KK13W1","Sandholes","N09000009","Mid Ulster",365,522,465,523,179,301,648,478,"Rural",280380,373250,{"$error":"#N/A"},"N06000010","Mid Ulster",{"$f":"LOOKUP(OFFSET($D437,0,$B$12),{0,179,357,535,713;1,2,3,4,5})","v":3},{"$f":"LOOKUP(OFFSET($D437,0,$B$12),{0,90,179,268,357,446,535,624,713,802;1,2,3,4,5,6,7,8,9,10})","v":6},324,505,595,351,1775,"Northern Ireland",1775,null,null,null,null,null,null,null,"Forest"]
["95KK14W1","Stewartstown","N09000009","Mid Ulster",554,368,291,414,161,229,649,408,"Rural",285356,371872,{"$error":"#N/A"},"N06000010","Mid Ulster",{"$f":"LOOKUP(OFFSET($D438,0,$B$12),{0,179,357,535,713;1,2,3,4,5})","v":3},{"$f":"LOOKUP(OFFSET($D438,0,$B$12),{0,90,179,268,357,446,535,624,713,802;1,2,3,4,5,6,7,8,9,10})","v":5},386,669,657,318,2030,"Northern Ireland",2030,null,null,null,null,null,null,null,"Forkhill_1"]
["95KK15W1","The Loop","N09000009","Mid Ulster",668,510,521,494,44,778,858,531,"Rural",292277,383578,{"$error":"#N/A"},"N06000010","Mid Ulster",{"$f":"LOOKUP(OFFSET($D439,0,$B$12),{0,179,357,535,713;1,2,3,4,5})","v":3},{"$f":"LOOKUP(OFFSET($D439,0,$B$12),{0,90,179,268,357,446,535,624,713,802;1,2,3,4,5,6,7,8,9,10})","v":6},786,1023,943,369,3120,"Northern Ireland",3120,null,null,null,null,null,null,null,"Forkhill_2"]
["95KK16W1","Tullagh","N09000009","Mid Ulster",760,451,329,422,674,644,96,561,"Urban",280490,378010,{"$error":"#N/A"},"N06000010","Mid Ulster",{"$f":"LOOKUP(OFFSET($D440,0,$B$12),{0,179,357,535,713;1,2,3,4,5})","v":4},{"$f":"LOOKUP(OFFSET($D440,0,$B$12),{0,90,179,268,357,446,535,624,713,802;1,2,3,4,5,6,7,8,9,10})","v":7},441,781,697,441,2360,"Northern Ireland",2360,null,null,null,null,null,null,null,"Fort"]
["95LL01S1","Aghagallon_1","N09000002","Armagh City, Banbridge and Craigavon",680,539,557,577,199,771,755,649,"Rural",310542,363476,{"$error":"#N/A"},"N06000017","Upper Bann",{"$f":"LOOKUP(OFFSET($D441,0,$B$12),{0,179,357,535,713;1,2,3,4,5})","v":4},{"$f":"LOOKUP(OFFSET($D441,0,$B$12),{0,90,179,268,357,446,535,624,713,802;1,2,3,4,5,6,7,8,9,10})","v":8},591,730,890,333,2544,"Northern Ireland",2544,null,null,null,null,null,null,null,"Fortwilliam_1"]
["95LL01S2","Aghagallon_2","N09000002","Armagh City, Banbridge and Craigavon",664,647,593,658,192,618,689,684,"Mixed urban/rural",307605,363921,{"$error":"#N/A"},"N06000017","Upper Bann",{"$f":"LOOKUP(OFFSET($D442,0,$B$12),{0,179,357,535,713;1,2,3,4,5})","v":4},{"$f":"LOOKUP(OFFSET($D442,0,$B$12),{0,90,179,268,357,446,535,624,713,802;1,2,3,4,5,6,7,8,9,10})","v":8},633,844,844,273,2594,"Northern Ireland",2594,null,null,null,null,null,null,null,"Fortwilliam_2"]
["95LL02S1","Annagh_1","N09000002","Armagh City, Banbridge and Craigavon",414,610,543,582,288,653,438,583,"Mixed urban/rural",301408,351728,{"$error":"#N/A"},"N06000017","Upper Bann",{"$f":"LOOKUP(OFFSET($D443,0,$B$12),{0,179,357,535,713;1,2,3,4,5})","v":4},{"$f":"LOOKUP(OFFSET($D443,0,$B$12),{0,90,179,268,357,446,535,624,713,802;1,2,3,4,5,6,7,8,9,10})","v":7},389,554,548,233,1723,"Northern Ireland",1723,null,null,null,null,null,null,null,"Fortwilliam_3"]
["95LL02S2","Annagh_2","N09000002","Armagh City, Banbridge and Craigavon",19,240,228,110,842,15,42,73,"Urban",301041,353310,{"$error":"#N/A"},"N06000017","Upper Bann",{"$f":"LOOKUP(OFFSET($D444,0,$B$12),{0,179,357,535,713;1,2,3,4,5})","v":1},{"$f":"LOOKUP(OFFSET($D444,0,$B$12),{0,90,179,268,357,446,535,624,713,802;1,2,3,4,5,6,7,8,9,10})","v":1},330,812,510,226,1878,"Northern Ireland",1878,null,null,null,null,null,null,null,"Fountain Hill"]
["95LL03W1","Ballybay","N09000002","Armagh City, Banbridge and Craigavon",202,275,235,82,477,637,226,200,"Mixed urban/rural",299659,353829,{"$error":"#N/A"},"N06000017","Upper Bann",{"$f":"LOOKUP(OFFSET($D445,0,$B$12),{0,179,357,535,713;1,2,3,4,5})","v":2},{"$f":"LOOKUP(OFFSET($D445,0,$B$12),{0,90,179,268,357,446,535,624,713,802;1,2,3,4,5,6,7,8,9,10})","v":3},722,1023,777,360,2882,"Northern Ireland",2882,null,null,null,null,null,null,null,"Foyle Springs_1"]
["95LL04W1","Ballyoran","N09000002","Armagh City, Banbridge and Craigavon",489,321,278,366,329,647,384,412,"Mixed urban/rural",300118,355273,{"$error":"#N/A"},"N06000017","Upper Bann",{"$f":"LOOKUP(OFFSET($D446,0,$B$12),{0,179,357,535,713;1,2,3,4,5})","v":3},{"$f":"LOOKUP(OFFSET($D446,0,$B$12),{0,90,179,268,357,446,535,624,713,802;1,2,3,4,5,6,7,8,9,10})","v":5},711,962,914,481,3069,"Northern Ireland",3069,null,null,null,null,null,null,null,"Foyle Springs_2"]
["95LL05S1","Bleary_1","N09000002","Armagh City, Banbridge and Craigavon",730,848,841,781,255,840,822,825,"Mixed urban/rural",303845,352630,{"$error":"#N/A"},"N06000017","Upper Bann",{"$f":"LOOKUP(OFFSET($D447,0,$B$12),{0,179,357,535,713;1,2,3,4,5})","v":5},{"$f":"LOOKUP(OFFSET($D447,0,$B$12),{0,90,179,268,357,446,535,624,713,802;1,2,3,4,5,6,7,8,9,10})","v":10},527,663,873,363,2426,"Northern Ireland",2426,null,null,null,null,null,null,null,"Galgorm_1"]
["95LL05S2","Bleary_2","N09000002","Armagh City, Banbridge and Craigavon",765,529,472,567,253,285,784,631,"Rural",307138,353750,{"$error":"#N/A"},"N06000017","Upper Bann",{"$f":"LOOKUP(OFFSET($D448,0,$B$12),{0,179,357,535,713;1,2,3,4,5})","v":4},{"$f":"LOOKUP(OFFSET($D448,0,$B$12),{0,90,179,268,357,446,535,624,713,802;1,2,3,4,5,6,7,8,9,10})","v":8},390,517,663,284,1855,"Northern Ireland",1855,null,null,null,null,null,null,null,"Galgorm_2"]
["95LL06S1","Brownstown_1","N09000002","Armagh City, Banbridge and Craigavon",264,520,599,311,322,311,448,423,"Mixed urban/rural",300216,351878,{"$error":"#N/A"},"N06000017","Upper Bann",{"$f":"LOOKUP(OFFSET($D449,0,$B$12),{0,179,357,535,713;1,2,3,4,5})","v":3},{"$f":"LOOKUP(OFFSET($D449,0,$B$12),{0,90,179,268,357,446,535,624,713,802;1,2,3,4,5,6,7,8,9,10})","v":5},381,566,539,279,1766,"Northern Ireland",1766,null,null,null,null,null,null,null,"Galwally"]
["95LL06S2","Brownstown_2","N09000002","Armagh City, Banbridge and Craigavon",338,467,335,297,645,539,415,447,"Urban",300263,352662,{"$error":"#N/A"},"N06000017","Upper Bann",{"$f":"LOOKUP(OFFSET($D450,0,$B$12),{0,179,357,535,713;1,2,3,4,5})","v":3},{"$f":"LOOKUP(OFFSET($D450,0,$B$12),{0,90,179,268,357,446,535,624,713,802;1,2,3,4,5,6,7,8,9,10})","v":6},325,564,504,432,1825,"Northern Ireland",1825,null,null,null,null,null,null,null,"Gardenmore"]
["95LL07W1","Church","N09000002","Armagh City, Banbridge and Craigavon",17,198,199,33,690,204,104,62,"Urban",308222,357633,{"$error":"#N/A"},"N06000017","Upper Bann",{"$f":"LOOKUP(OFFSET($D451,0,$B$12),{0,179,357,535,713;1,2,3,4,5})","v":1},{"$f":"LOOKUP(OFFSET($D451,0,$B$12),{0,90,179,268,357,446,535,624,713,802;1,2,3,4,5,6,7,8,9,10})","v":1},492,798,630,414,2334,"Northern Ireland",2334,null,null,null,null,null,null,null,"Garvagh"]
["95LL08S1","Corcrain_1","N09000002","Armagh City, Banbridge and Craigavon",100,147,168,136,637,361,196,129,"Urban",300517,354561,{"$error":"#N/A"},"N06000017","Upper Bann",{"$f":"LOOKUP(OFFSET($D452,0,$B$12),{0,179,357,535,713;1,2,3,4,5})","v":1},{"$f":"LOOKUP(OFFSET($D452,0,$B$12),{0,90,179,268,357,446,535,624,713,802;1,2,3,4,5,6,7,8,9,10})","v":2},413,600,521,160,1694,"Northern Ireland",1694,null,null,null,null,null,null,null,"Gilford"]
["95LL08S2","Corcrain_2","N09000002","Armagh City, Banbridge and Craigavon",86,178,211,81,564,70,175,108,"Urban",300559,354231,{"$error":"#N/A"},"N06000017","Upper Bann",{"$f":"LOOKUP(OFFSET($D453,0,$B$12),{0,179,357,535,713;1,2,3,4,5})","v":1},{"$f":"LOOKUP(OFFSET($D453,0,$B$12),{0,90,179,268,357,446,535,624,713,802;1,2,3,4,5,6,7,8,9,10})","v":2},438,747,582,211,1979,"Northern Ireland",1979,null,null,null,null,null,null,null,"Gilnahirk"]
["95LL09S1","Court_1","N09000002","Armagh City, Banbridge and Craigavon",105,69,67,68,850,58,7,54,"Urban",307673,358501,{"$error":"#N/A"},"N06000017","Upper Bann",{"$f":"LOOKUP(OFFSET($D454,0,$B$12),{0,179,357,535,713;1,2,3,4,5})","v":1},{"$f":"LOOKUP(OFFSET($D454,0,$B$12),{0,90,179,268,357,446,535,624,713,802;1,2,3,4,5,6,7,8,9,10})","v":1},323,490,499,208,1519,"Northern Ireland",1519,null,null,null,null,null,null,null,"Glack"]
["95LL09S2","Court_2","N09000002","Armagh City, Banbridge and Craigavon",592,92,100,115,806,299,97,179,"Urban",307521,358145,{"$error":"#N/A"},"N06000017","Upper Bann",{"$f":"LOOKUP(OFFSET($D455,0,$B$12),{0,179,357,535,713;1,2,3,4,5})","v":2},{"$f":"LOOKUP(OFFSET($D455,0,$B$12),{0,90,179,268,357,446,535,624,713,802;1,2,3,4,5,6,7,8,9,10})","v":3},347,479,520,457,1802,"Northern Ireland",1802,null,null,null,null,null,null,null,"Glebe"]
["95LL10S1","Derrytrasna_1","N09000002","Armagh City, Banbridge and Craigavon",752,646,462,681,285,626,589,697,"Mixed urban/rural",305365,359076,{"$error":"#N/A"},"N06000017","Upper Bann",{"$f":"LOOKUP(OFFSET($D456,0,$B$12),{0,179,357,535,713;1,2,3,4,5})","v":4},{"$f":"LOOKUP(OFFSET($D456,0,$B$12),{0,90,179,268,357,446,535,624,713,802;1,2,3,4,5,6,7,8,9,10})","v":8},738,1022,1079,339,3178,"Northern Ireland",3178,null,null,null,null,null,null,null,"Glebe_1_Magherafelt"]
["95LL10S2","Derrytrasna_2","N09000002","Armagh City, Banbridge and Craigavon",635,666,633,570,73,581,707,608,"Rural",301256,361767,{"$error":"#N/A"},"N06000017","Upper Bann",{"$f":"LOOKUP(OFFSET($D457,0,$B$12),{0,179,357,535,713;1,2,3,4,5})","v":4},{"$f":"LOOKUP(OFFSET($D457,0,$B$12),{0,90,179,268,357,446,535,624,713,802;1,2,3,4,5,6,7,8,9,10})","v":7},582,811,815,277,2486,"Northern Ireland",2486,null,null,null,null,null,null,null,"Glebe_1_Newtownabbey"]
["95LL11S1","Donaghcloney_1","N09000002","Armagh City, Banbridge and Craigavon",418,472,564,520,210,543,531,519,"Rural",311809,353310,{"$error":"#N/A"},"N06000017","Upper Bann",{"$f":"LOOKUP(OFFSET($D458,0,$B$12),{0,179,357,535,713;1,2,3,4,5})","v":3},{"$f":"LOOKUP(OFFSET($D458,0,$B$12),{0,90,179,268,357,446,535,624,713,802;1,2,3,4,5,6,7,8,9,10})","v":6},311,478,535,246,1571,"Northern Ireland",1571,null,null,null,null,null,null,null,"Glebe_2_Magherafelt"]
["95LL11S2","Donaghcloney_2","N09000002","Armagh City, Banbridge and Craigavon",634,797,818,688,127,767,829,727,"Rural",313404,353708,{"$error":"#N/A"},"N06000017","Upper Bann",{"$f":"LOOKUP(OFFSET($D459,0,$B$12),{0,179,357,535,713;1,2,3,4,5})","v":5},{"$f":"LOOKUP(OFFSET($D459,0,$B$12),{0,90,179,268,357,446,535,624,713,802;1,2,3,4,5,6,7,8,9,10})","v":9},645,864,874,287,2670,"Northern Ireland",2670,null,null,null,null,null,null,null,"Glebe_2_Newtownabbey"]
["95LL12S1","Drumgask_1","N09000002","Armagh City, Banbridge and Craigavon",273,265,124,164,344,687,188,208,"Urban",306347,355748,{"$error":"#N/A"},"N06000017","Upper Bann",{"$f":"LOOKUP(OFFSET($D460,0,$B$12),{0,179,357,535,713;1,2,3,4,5})","v":2},{"$f":"LOOKUP(OFFSET($D460,0,$B$12),{0,90,179,268,357,446,535,624,713,802;1,2,3,4,5,6,7,8,9,10})","v":3},897,1157,816,249,3120,"Northern Ireland",3120,null,null,null,null,null,null,null,"Glen Road_1"]
["95LL12S2","Drumgask_2","N09000002","Armagh City, Banbridge and Craigavon",117,67,42,24,478,166,295,52,"Urban",306671,356977,{"$error":"#N/A"},"N06000017","Upper Bann",{"$f":"LOOKUP(OFFSET($D461,0,$B$12),{0,179,357,535,713;1,2,3,4,5})","v":1},{"$f":"LOOKUP(OFFSET($D461,0,$B$12),{0,90,179,268,357,446,535,624,713,802;1,2,3,4,5,6,7,8,9,10})","v":1},365,432,348,136,1281,"Northern Ireland",1281,null,null,null,null,null,null,null,"Glen Road_2"]
["95LL13S1","Drumgor_1","N09000002","Armagh City, Banbridge and Craigavon",277,288,273,195,354,545,125,262,"Urban",304936,356722,{"$error":"#N/A"},"N06000017","Upper Bann",{"$f":"LOOKUP(OFFSET($D462,0,$B$12),{0,179,357,535,713;1,2,3,4,5})","v":2},{"$f":"LOOKUP(OFFSET($D462,0,$B$12),{0,90,179,268,357,446,535,624,713,802;1,2,3,4,5,6,7,8,9,10})","v":3},368,488,430,170,1455,"Northern Ireland",1455,null,null,null,null,null,null,null,"Glen Road_3"]
["95LL13S2","Drumgor_2","N09000002","Armagh City, Banbridge and Craigavon",172,107,64,37,531,792,26,81,"Urban",305645,356403,{"$error":"#N/A"},"N06000017","Upper Bann",{"$f":"LOOKUP(OFFSET($D463,0,$B$12),{0,179,357,535,713;1,2,3,4,5})","v":1},{"$f":"LOOKUP(OFFSET($D463,0,$B$12),{0,90,179,268,357,446,535,624,713,802;1,2,3,4,5,6,7,8,9,10})","v":1},413,478,424,195,1509,"Northern Ireland",1509,null,null,null,null,null,null,null,"Glen_1"]
["95LL14S1","Drumnamoe_1","N09000002","Armagh City, Banbridge and Craigavon",395,42,31,62,589,146,344,83,"Urban",308552,359558,{"$error":"#N/A"},"N06000017","Upper Bann",{"$f":"LOOKUP(OFFSET($D464,0,$B$12),{0,179,357,535,713;1,2,3,4,5})","v":1},{"$f":"LOOKUP(OFFSET($D464,0,$B$12),{0,90,179,268,357,446,535,624,713,802;1,2,3,4,5,6,7,8,9,10})","v":1},257,411,386,202,1257,"Northern Ireland",1257,null,null,null,null,null,null,null,"Glen_2"]
["95LL14S2","Drumnamoe_2","N09000002","Armagh City, Banbridge and Craigavon",444,257,202,332,524,297,606,351,"Urban",308450,359815,{"$error":"#N/A"},"N06000017","Upper Bann",{"$f":"LOOKUP(OFFSET($D465,0,$B$12),{0,179,357,535,713;1,2,3,4,5})","v":2},{"$f":"LOOKUP(OFFSET($D465,0,$B$12),{0,90,179,268,357,446,535,624,713,802;1,2,3,4,5,6,7,8,9,10})","v":4},234,396,422,232,1284,"Northern Ireland",1284,null,null,null,null,null,null,null,"Glenaan_&_Glendun"]
["95LL15S1","Edenderry_1","N09000002","Armagh City, Banbridge and Craigavon",291,468,331,449,798,268,192,427,"Urban",302040,354120,{"$error":"#N/A"},"N06000017","Upper Bann",{"$f":"LOOKUP(OFFSET($D466,0,$B$12),{0,179,357,535,713;1,2,3,4,5})","v":3},{"$f":"LOOKUP(OFFSET($D466,0,$B$12),{0,90,179,268,357,446,535,624,713,802;1,2,3,4,5,6,7,8,9,10})","v":5},297,485,506,349,1637,"Northern Ireland",1637,null,null,null,null,null,null,null,"Glenariff"]
["95LL15S2","Edenderry_2","N09000002","Armagh City, Banbridge and Craigavon",845,526,400,426,597,711,608,682,"Urban",302393,353546,{"$error":"#N/A"},"N06000017","Upper Bann",{"$f":"LOOKUP(OFFSET($D467,0,$B$12),{0,179,357,535,713;1,2,3,4,5})","v":4},{"$f":"LOOKUP(OFFSET($D467,0,$B$12),{0,90,179,268,357,446,535,624,713,802;1,2,3,4,5,6,7,8,9,10})","v":8},244,453,517,415,1628,"Northern Ireland",1628,null,null,null,null,null,null,null,"Glenarm"]
["95LL16S1","Kernan_1","N09000002","Armagh City, Banbridge and Craigavon",739,760,669,692,346,837,508,780,"Urban",303116,354772,{"$error":"#N/A"},"N06000017","Upper Bann",{"$f":"LOOKUP(OFFSET($D468,0,$B$12),{0,179,357,535,713;1,2,3,4,5})","v":5},{"$f":"LOOKUP(OFFSET($D468,0,$B$12),{0,90,179,268,357,446,535,624,713,802;1,2,3,4,5,6,7,8,9,10})","v":9},770,1111,960,499,3339,"Northern Ireland",3339,null,null,null,null,null,null,null,"Glenavy_1"]
["95LL16S2","Kernan_2","N09000002","Armagh City, Banbridge and Craigavon",516,696,567,367,276,856,541,616,"Urban",303485,356448,{"$error":"#N/A"},"N06000017","Upper Bann",{"$f":"LOOKUP(OFFSET($D469,0,$B$12),{0,179,357,535,713;1,2,3,4,5})","v":4},{"$f":"LOOKUP(OFFSET($D469,0,$B$12),{0,90,179,268,357,446,535,624,713,802;1,2,3,4,5,6,7,8,9,10})","v":7},927,1412,1062,344,3746,"Northern Ireland",3746,null,null,null,null,null,null,null,"Glenavy_2"]
["95LL17W1","Killycomain","N09000002","Armagh City, Banbridge and Craigavon",351,360,386,416,607,744,469,468,"Urban",302737,354268,{"$error":"#N/A"},"N06000017","Upper Bann",{"$f":"LOOKUP(OFFSET($D470,0,$B$12),{0,179,357,535,713;1,2,3,4,5})","v":3},{"$f":"LOOKUP(OFFSET($D470,0,$B$12),{0,90,179,268,357,446,535,624,713,802;1,2,3,4,5,6,7,8,9,10})","v":6},492,709,831,562,2595,"Northern Ireland",2595,null,null,null,null,null,null,null,"Glencairn_1"]
["95LL18S1","Knocknashane_1","N09000002","Armagh City, Banbridge and Craigavon",747,631,577,317,613,453,473,678,"Urban",308753,357178,{"$error":"#N/A"},"N06000017","Upper Bann",{"$f":"LOOKUP(OFFSET($D471,0,$B$12),{0,179,357,535,713;1,2,3,4,5})","v":4},{"$f":"LOOKUP(OFFSET($D471,0,$B$12),{0,90,179,268,357,446,535,624,713,802;1,2,3,4,5,6,7,8,9,10})","v":8},428,602,622,445,2097,"Northern Ireland",2097,null,null,null,null,null,null,null,"Glencairn_2"]
["95LL18S2","Knocknashane_2","N09000002","Armagh City, Banbridge and Craigavon",830,724,606,499,429,765,803,775,"Urban",309261,357082,{"$error":"#N/A"},"N06000017","Upper Bann",{"$f":"LOOKUP(OFFSET($D472,0,$B$12),{0,179,357,535,713;1,2,3,4,5})","v":5},{"$f":"LOOKUP(OFFSET($D472,0,$B$12),{0,90,179,268,357,446,535,624,713,802;1,2,3,4,5,6,7,8,9,10})","v":9},271,464,448,302,1486,"Northern Ireland",1486,null,null,null,null,null,null,null,"Glencolin_1"]
["95LL19S1","Magheralin_1","N09000002","Armagh City, Banbridge and Craigavon",740,667,616,606,446,599,625,746,"Mixed urban/rural",310484,358200,{"$error":"#N/A"},"N06000017","Upper Bann",{"$f":"LOOKUP(OFFSET($D473,0,$B$12),{0,179,357,535,713;1,2,3,4,5})","v":5},{"$f":"LOOKUP(OFFSET($D473,0,$B$12),{0,90,179,268,357,446,535,624,713,802;1,2,3,4,5,6,7,8,9,10})","v":9},537,672,875,355,2438,"Northern Ireland",2438,null,null,null,null,null,null,null,"Glencolin_2"]
["95LL19S2","Magheralin_2","N09000002","Armagh City, Banbridge and Craigavon",467,718,695,672,261,795,781,689,"Rural",311949,358915,{"$error":"#N/A"},"N06000017","Upper Bann",{"$f":"LOOKUP(OFFSET($D474,0,$B$12),{0,179,357,535,713;1,2,3,4,5})","v":4},{"$f":"LOOKUP(OFFSET($D474,0,$B$12),{0,90,179,268,357,446,535,624,713,802;1,2,3,4,5,6,7,8,9,10})","v":8},714,982,1055,412,3163,"Northern Ireland",3163,null,null,null,null,null,null,null,"Glencolin_3"]
["95LL20W1","Mourneview","N09000002","Armagh City, Banbridge and Craigavon",459,246,183,178,509,513,317,301,"Urban",307778,357224,{"$error":"#N/A"},"N06000017","Upper Bann",{"$f":"LOOKUP(OFFSET($D475,0,$B$12),{0,179,357,535,713;1,2,3,4,5})","v":2},{"$f":"LOOKUP(OFFSET($D475,0,$B$12),{0,90,179,268,357,446,535,624,713,802;1,2,3,4,5,6,7,8,9,10})","v":4},443,759,778,401,2381,"Northern Ireland",2381,null,null,null,null,null,null,null,"Glencolin_4"]
["95LL21W1","Parklake","N09000002","Armagh City, Banbridge and Craigavon",295,424,356,341,659,570,243,417,"Urban",308706,358293,{"$error":"#N/A"},"N06000017","Upper Bann",{"$f":"LOOKUP(OFFSET($D476,0,$B$12),{0,179,357,535,713;1,2,3,4,5})","v":3},{"$f":"LOOKUP(OFFSET($D476,0,$B$12),{0,90,179,268,357,446,535,624,713,802;1,2,3,4,5,6,7,8,9,10})","v":5},1043,1481,1283,658,4465,"Northern Ireland",4465,null,null,null,null,null,null,null,"Glenderg"]
["95LL22W1","Taghnevan","N09000002","Armagh City, Banbridge and Craigavon",465,286,208,239,533,526,173,332,"Urban",306714,357539,{"$error":"#N/A"},"N06000017","Upper Bann",{"$f":"LOOKUP(OFFSET($D477,0,$B$12),{0,179,357,535,713;1,2,3,4,5})","v":2},{"$f":"LOOKUP(OFFSET($D477,0,$B$12),{0,90,179,268,357,446,535,624,713,802;1,2,3,4,5,6,7,8,9,10})","v":4},985,1454,1043,425,3908,"Northern Ireland",3908,null,null,null,null,null,null,null,"Glengormley_1"]
["95LL23W1","Tavanagh","N09000002","Armagh City, Banbridge and Craigavon",122,199,225,93,799,502,181,164,"Urban",300532,353407,{"$error":"#N/A"},"N06000017","Upper Bann",{"$f":"LOOKUP(OFFSET($D478,0,$B$12),{0,179,357,535,713;1,2,3,4,5})","v":1},{"$f":"LOOKUP(OFFSET($D478,0,$B$12),{0,90,179,268,357,446,535,624,713,802;1,2,3,4,5,6,7,8,9,10})","v":2},548,760,707,400,2416,"Northern Ireland",2416,null,null,null,null,null,null,null,"Glengormley_2"]
["95LL24S1","The Birches_1","N09000002","Armagh City, Banbridge and Craigavon",268,704,721,537,130,808,746,534,"Rural",297080,357462,{"$error":"#N/A"},"N06000017","Upper Bann",{"$f":"LOOKUP(OFFSET($D479,0,$B$12),{0,179,357,535,713;1,2,3,4,5})","v":3},{"$f":"LOOKUP(OFFSET($D479,0,$B$12),{0,90,179,268,357,446,535,624,713,802;1,2,3,4,5,6,7,8,9,10})","v":6},515,738,682,265,2199,"Northern Ireland",2199,null,null,null,null,null,null,null,"Glenravel"]
["95LL24S2","The Birches_2","N09000002","Armagh City, Banbridge and Craigavon",627,541,609,496,96,658,786,577,"Rural",294040,361150,{"$error":"#N/A"},"N06000017","Upper Bann",{"$f":"LOOKUP(OFFSET($D480,0,$B$12),{0,179,357,535,713;1,2,3,4,5})","v":4},{"$f":"LOOKUP(OFFSET($D480,0,$B$12),{0,90,179,268,357,446,535,624,713,802;1,2,3,4,5,6,7,8,9,10})","v":7},421,583,508,308,1820,"Northern Ireland",1820,null,null,null,null,null,null,null,"Glentaisie_&_Kinbane"]
["95LL25S1","Waringstown_1","N09000002","Armagh City, Banbridge and Craigavon",521,774,729,715,254,825,539,715,"Rural",310008,355322,{"$error":"#N/A"},"N06000017","Upper Bann",{"$f":"LOOKUP(OFFSET($D481,0,$B$12),{0,179,357,535,713;1,2,3,4,5})","v":5},{"$f":"LOOKUP(OFFSET($D481,0,$B$12),{0,90,179,268,357,446,535,624,713,802;1,2,3,4,5,6,7,8,9,10})","v":9},670,998,825,401,2894,"Northern Ireland",2894,null,null,null,null,null,null,null,"Glenwhirry"]
["95LL25S2","Waringstown_2","N09000002","Armagh City, Banbridge and Craigavon",658,767,739,817,348,395,588,767,"Rural",310642,355327,{"$f":"IF(B482=$F$27,O482,NA())","v":{"$error":"#N/A"}},"N06000017","Upper Bann",{"$f":"LOOKUP(OFFSET($D482,0,$B$12),{0,179,357,535,713;1,2,3,4,5})","v":5},{"$f":"LOOKUP(OFFSET($D482,0,$B$12),{0,90,179,268,357,446,535,624,713,802;1,2,3,4,5,6,7,8,9,10})","v":9},364,539,693,318,1914,"Northern Ireland",{"$f":"CHOOSE($K$5,$Y482,IF($D482=$B$27,$Y482,\"\"),IF($R482=$B$27,$Y482,\"\"))","v":1914},null,null,null,null,null,null,null,"Glynn"]
["95LL26S1","Woodville_1","N09000002","Armagh City, Banbridge and Craigavon",9,59,91,21,729,10,27,14,"Urban",307930,359058,{"$error":"#N/A"},"N06000017","Upper Bann",{"$f":"LOOKUP(OFFSET($D483,0,$B$12),{0,179,357,535,713;1,2,3,4,5})","v":1},{"$f":"LOOKUP(OFFSET($D483,0,$B$12),{0,90,179,268,357,446,535,624,713,802;1,2,3,4,5,6,7,8,9,10})","v":1},249,536,510,205,1500,"Northern Ireland",1500,null,null,null,null,null,null,null,"Gortalee"]
["95LL26S2","Woodville_2","N09000002","Armagh City, Banbridge and Craigavon",766,645,600,780,475,478,691,772,"Urban",307708,359557,{"$error":"#N/A"},"N06000017","Upper Bann",{"$f":"LOOKUP(OFFSET($D484,0,$B$12),{0,179,357,535,713;1,2,3,4,5})","v":5},{"$f":"LOOKUP(OFFSET($D484,0,$B$12),{0,90,179,268,357,446,535,624,713,802;1,2,3,4,5,6,7,8,9,10})","v":9},433,731,790,267,2221,"Northern Ireland",2221,null,null,null,null,null,null,null,"Gortalowry"]
["95MM01S1","Altnagelvin_1","N09000005","Derry City and Strabane",199,71,118,85,461,247,176,101,"Urban",245802,414347,{"$error":"#N/A"},"N06000008","Foyle",{"$f":"LOOKUP(OFFSET($D485,0,$B$12),{0,179,357,535,713;1,2,3,4,5})","v":1},{"$f":"LOOKUP(OFFSET($D485,0,$B$12),{0,90,179,268,357,446,535,624,713,802;1,2,3,4,5,6,7,8,9,10})","v":2},321,454,450,258,1484,"Northern Ireland",1484,null,null,null,null,null,null,null,"Gortin"]
["95MM01S2","Altnagelvin_2","N09000005","Derry City and Strabane",236,584,573,611,622,785,339,545,"Urban",245805,415865,{"$error":"#N/A"},"N06000008","Foyle",{"$f":"LOOKUP(OFFSET($D486,0,$B$12),{0,179,357,535,713;1,2,3,4,5})","v":4},{"$f":"LOOKUP(OFFSET($D486,0,$B$12),{0,90,179,268,357,446,535,624,713,802;1,2,3,4,5,6,7,8,9,10})","v":7},454,623,590,170,1837,"Northern Ireland",1837,null,null,null,null,null,null,null,"Gortrush_1"]
["95MM01S3","Altnagelvin_3","N09000005","Derry City and Strabane",350,449,496,488,377,882,640,525,"Urban",246742,414917,{"$error":"#N/A"},"N06000008","Foyle",{"$f":"LOOKUP(OFFSET($D487,0,$B$12),{0,179,357,535,713;1,2,3,4,5})","v":3},{"$f":"LOOKUP(OFFSET($D487,0,$B$12),{0,90,179,268,357,446,535,624,713,802;1,2,3,4,5,6,7,8,9,10})","v":6},310,497,578,237,1622,"Northern Ireland",1622,null,null,null,null,null,null,null,"Gortrush_2"]
["95MM02S1","Ballynashallog_1","N09000005","Derry City and Strabane",596,402,481,744,534,614,328,621,"Urban",244210,419556,{"$error":"#N/A"},"N06000008","Foyle",{"$f":"LOOKUP(OFFSET($D488,0,$B$12),{0,179,357,535,713;1,2,3,4,5})","v":4},{"$f":"LOOKUP(OFFSET($D488,0,$B$12),{0,90,179,268,357,446,535,624,713,802;1,2,3,4,5,6,7,8,9,10})","v":7},229,375,541,462,1606,"Northern Ireland",1606,null,null,null,null,null,null,null,"Graham's Bridge"]
["95MM02S2","Ballynashallog_2","N09000005","Derry City and Strabane",667,750,814,853,358,700,800,808,"Urban",244783,420530,{"$error":"#N/A"},"N06000008","Foyle",{"$f":"LOOKUP(OFFSET($D489,0,$B$12),{0,179,357,535,713;1,2,3,4,5})","v":5},{"$f":"LOOKUP(OFFSET($D489,0,$B$12),{0,90,179,268,357,446,535,624,713,802;1,2,3,4,5,6,7,8,9,10})","v":10},258,432,629,278,1597,"Northern Ireland",1597,null,null,null,null,null,null,null,"Grange"]
["95MM03W1","Banagher","N09000005","Derry City and Strabane",130,414,505,517,41,148,760,245,"Rural",257029,404221,{"$error":"#N/A"},"N06000006","East Londonderry",{"$f":"LOOKUP(OFFSET($D490,0,$B$12),{0,179,357,535,713;1,2,3,4,5})","v":2},{"$f":"LOOKUP(OFFSET($D490,0,$B$12),{0,90,179,268,357,446,535,624,713,802;1,2,3,4,5,6,7,8,9,10})","v":3},833,1092,1175,454,3554,"Northern Ireland",3554,null,null,null,null,null,null,null,"Gransha"]
["95MM04W1","Beechwood","N09000005","Derry City and Strabane",429,79,115,257,857,243,397,196,"Urban",242486,417052,{"$error":"#N/A"},"N06000008","Foyle",{"$f":"LOOKUP(OFFSET($D491,0,$B$12),{0,179,357,535,713;1,2,3,4,5})","v":2},{"$f":"LOOKUP(OFFSET($D491,0,$B$12),{0,90,179,268,357,446,535,624,713,802;1,2,3,4,5,6,7,8,9,10})","v":3},402,618,730,408,2159,"Northern Ireland",2159,null,null,null,null,null,null,null,"Greenisland"]
["95MM05W1","Brandywell","N09000005","Derry City and Strabane",18,13,32,98,516,141,50,13,"Urban",242714,416194,{"$error":"#N/A"},"N06000008","Foyle",{"$f":"LOOKUP(OFFSET($D492,0,$B$12),{0,179,357,535,713;1,2,3,4,5})","v":1},{"$f":"LOOKUP(OFFSET($D492,0,$B$12),{0,90,179,268,357,446,535,624,713,802;1,2,3,4,5,6,7,8,9,10})","v":1},490,738,791,365,2384,"Northern Ireland",2384,null,null,null,null,null,null,null,"Gregstown_1"]
["95MM06S1","Carn Hill_1","N09000005","Derry City and Strabane",422,121,119,315,581,485,220,226,"Urban",243022,419798,{"$error":"#N/A"},"N06000008","Foyle",{"$f":"LOOKUP(OFFSET($D493,0,$B$12),{0,179,357,535,713;1,2,3,4,5})","v":2},{"$f":"LOOKUP(OFFSET($D493,0,$B$12),{0,90,179,268,357,446,535,624,713,802;1,2,3,4,5,6,7,8,9,10})","v":3},358,457,416,228,1460,"Northern Ireland",1460,null,null,null,null,null,null,null,"Gregstown_2"]
["95MM06S2","Carn Hill_2","N09000005","Derry City and Strabane",94,32,63,144,837,205,102,59,"Urban",243613,419817,{"$error":"#N/A"},"N06000008","Foyle",{"$f":"LOOKUP(OFFSET($D494,0,$B$12),{0,179,357,535,713;1,2,3,4,5})","v":1},{"$f":"LOOKUP(OFFSET($D494,0,$B$12),{0,90,179,268,357,446,535,624,713,802;1,2,3,4,5,6,7,8,9,10})","v":1},291,387,319,236,1232,"Northern Ireland",1232,null,null,null,null,null,null,null,"Gregstown_3"]
["95MM07W1","Caw","N09000005","Derry City and Strabane",425,176,207,189,669,844,301,287,"Urban",245800,417588,{"$error":"#N/A"},"N06000008","Foyle",{"$f":"LOOKUP(OFFSET($D495,0,$B$12),{0,179,357,535,713;1,2,3,4,5})","v":2},{"$f":"LOOKUP(OFFSET($D495,0,$B$12),{0,90,179,268,357,446,535,624,713,802;1,2,3,4,5,6,7,8,9,10})","v":4},512,812,881,507,2712,"Northern Ireland",2712,null,null,null,null,null,null,null,"Gresteel_1"]
["95MM08S1","Clondermot_1","N09000005","Derry City and Strabane",45,24,45,174,758,718,94,43,"Urban",244379,415605,{"$error":"#N/A"},"N06000008","Foyle",{"$f":"LOOKUP(OFFSET($D496,0,$B$12),{0,179,357,535,713;1,2,3,4,5})","v":1},{"$f":"LOOKUP(OFFSET($D496,0,$B$12),{0,90,179,268,357,446,535,624,713,802;1,2,3,4,5,6,7,8,9,10})","v":1},275,416,406,201,1298,"Northern Ireland",1298,null,null,null,null,null,null,null,"Gresteel_2"]
["95MM08S2","Clondermot_2","N09000005","Derry City and Strabane",731,478,385,551,616,461,351,633,"Urban",245191,415104,{"$error":"#N/A"},"N06000008","Foyle",{"$f":"LOOKUP(OFFSET($D497,0,$B$12),{0,179,357,535,713;1,2,3,4,5})","v":4},{"$f":"LOOKUP(OFFSET($D497,0,$B$12),{0,90,179,268,357,446,535,624,713,802;1,2,3,4,5,6,7,8,9,10})","v":8},271,476,555,373,1676,"Northern Ireland",1676,null,null,null,null,null,null,null,"Greystone_Antrim"]
["95MM09S1","Claudy_1","N09000005","Derry City and Strabane",565,340,366,471,229,849,600,490,"Rural",253956,407768,{"$error":"#N/A"},"N06000006","East Londonderry",{"$f":"LOOKUP(OFFSET($D498,0,$B$12),{0,179,357,535,713;1,2,3,4,5})","v":3},{"$f":"LOOKUP(OFFSET($D498,0,$B$12),{0,90,179,268,357,446,535,624,713,802;1,2,3,4,5,6,7,8,9,10})","v":6},358,461,517,241,1577,"Northern Ireland",1577,null,null,null,null,null,null,null,"Greystone_Limavady"]
["95MM09S2","Claudy_2","N09000005","Derry City and Strabane",316,442,467,571,32,241,533,340,"Rural",252602,412681,{"$error":"#N/A"},"N06000006","East Londonderry",{"$f":"LOOKUP(OFFSET($D499,0,$B$12),{0,179,357,535,713;1,2,3,4,5})","v":2},{"$f":"LOOKUP(OFFSET($D499,0,$B$12),{0,90,179,268,357,446,535,624,713,802;1,2,3,4,5,6,7,8,9,10})","v":4},462,533,677,286,1957,"Northern Ireland",1957,null,null,null,null,null,null,null,"Groomsport"]
["95MM10S1","Creggan Central_1","N09000005","Derry City and Strabane",20,16,23,31,695,82,198,10,"Urban",241798,416691,{"$error":"#N/A"},"N06000008","Foyle",{"$f":"LOOKUP(OFFSET($D500,0,$B$12),{0,179,357,535,713;1,2,3,4,5})","v":1},{"$f":"LOOKUP(OFFSET($D500,0,$B$12),{0,90,179,268,357,446,535,624,713,802;1,2,3,4,5,6,7,8,9,10})","v":1},438,549,382,112,1481,"Northern Ireland",1481,null,null,null,null,null,null,null,"Gulladuff"]
["95MM10S2","Creggan Central_2","N09000005","Derry City and Strabane",58,61,65,165,719,181,254,69,"Urban",242085,417154,{"$error":"#N/A"},"N06000008","Foyle",{"$f":"LOOKUP(OFFSET($D501,0,$B$12),{0,179,357,535,713;1,2,3,4,5})","v":1},{"$f":"LOOKUP(OFFSET($D501,0,$B$12),{0,90,179,268,357,446,535,624,713,802;1,2,3,4,5,6,7,8,9,10})","v":1},275,448,427,138,1287,"Northern Ireland",1287,null,null,null,null,null,null,null,"Hamiltonsbawn_1"]
["95MM11W1","Creggan South","N09000005","Derry City and Strabane",54,14,35,57,675,302,238,33,"Urban",241757,416185,{"$error":"#N/A"},"N06000008","Foyle",{"$f":"LOOKUP(OFFSET($D502,0,$B$12),{0,179,357,535,713;1,2,3,4,5})","v":1},{"$f":"LOOKUP(OFFSET($D502,0,$B$12),{0,90,179,268,357,446,535,624,713,802;1,2,3,4,5,6,7,8,9,10})","v":1},796,863,835,258,2752,"Northern Ireland",2752,null,null,null,null,null,null,null,"Hamiltonsbawn_2"]
["95MM12S1","Crevagh_1","N09000005","Derry City and Strabane",85,145,274,372,202,363,195,142,"Mixed urban/rural",240531,417676,{"$error":"#N/A"},"N06000008","Foyle",{"$f":"LOOKUP(OFFSET($D503,0,$B$12),{0,179,357,535,713;1,2,3,4,5})","v":1},{"$f":"LOOKUP(OFFSET($D503,0,$B$12),{0,90,179,268,357,446,535,624,713,802;1,2,3,4,5,6,7,8,9,10})","v":2},479,612,634,212,1938,"Northern Ireland",1938,null,null,null,null,null,null,null,"Harbour"]
["95MM12S2","Crevagh_2","N09000005","Derry City and Strabane",15,10,9,32,525,529,28,3,"Urban",241409,419228,{"$error":"#N/A"},"N06000008","Foyle",{"$f":"LOOKUP(OFFSET($D504,0,$B$12),{0,179,357,535,713;1,2,3,4,5})","v":1},{"$f":"LOOKUP(OFFSET($D504,0,$B$12),{0,90,179,268,357,446,535,624,713,802;1,2,3,4,5,6,7,8,9,10})","v":1},367,468,343,80,1258,"Northern Ireland",1258,null,null,null,null,null,null,null,"Harbour_1"]
["95MM12S3","Crevagh_3","N09000005","Derry City and Strabane",129,142,110,259,453,423,281,149,"Urban",241473,418567,{"$error":"#N/A"},"N06000008","Foyle",{"$f":"LOOKUP(OFFSET($D505,0,$B$12),{0,179,357,535,713;1,2,3,4,5})","v":1},{"$f":"LOOKUP(OFFSET($D505,0,$B$12),{0,90,179,268,357,446,535,624,713,802;1,2,3,4,5,6,7,8,9,10})","v":2},710,965,819,113,2608,"Northern Ireland",2608,null,null,null,null,null,null,null,"Harbour_2"]
["95MM13S1","Culmore_1","N09000005","Derry City and Strabane",814,481,501,793,165,663,497,650,"Rural",246908,422783,{"$error":"#N/A"},"N06000008","Foyle",{"$f":"LOOKUP(OFFSET($D506,0,$B$12),{0,179,357,535,713;1,2,3,4,5})","v":4},{"$f":"LOOKUP(OFFSET($D506,0,$B$12),{0,90,179,268,357,446,535,624,713,802;1,2,3,4,5,6,7,8,9,10})","v":8},239,342,424,195,1200,"Northern Ireland",1200,null,null,null,null,null,null,null,"Harmony Hill"]
["95MM13S2","Culmore_2","N09000005","Derry City and Strabane",42,22,22,64,598,95,30,22,"Urban",243560,420595,{"$error":"#N/A"},"N06000008","Foyle",{"$f":"LOOKUP(OFFSET($D507,0,$B$12),{0,179,357,535,713;1,2,3,4,5})","v":1},{"$f":"LOOKUP(OFFSET($D507,0,$B$12),{0,90,179,268,357,446,535,624,713,802;1,2,3,4,5,6,7,8,9,10})","v":1},375,466,372,145,1358,"Northern Ireland",1358,null,null,null,null,null,null,null,"Harryville"]
["95MM13S3","Culmore_3","N09000005","Derry City and Strabane",421,57,85,128,471,622,126,130,"Urban",243942,420979,{"$error":"#N/A"},"N06000008","Foyle",{"$f":"LOOKUP(OFFSET($D508,0,$B$12),{0,179,357,535,713;1,2,3,4,5})","v":1},{"$f":"LOOKUP(OFFSET($D508,0,$B$12),{0,90,179,268,357,446,535,624,713,802;1,2,3,4,5,6,7,8,9,10})","v":2},415,563,438,135,1551,"Northern Ireland",1551,null,null,null,null,null,null,null,"Hawthorne"]
["95MM13S4","Culmore_4","N09000005","Derry City and Strabane",308,245,194,377,298,823,392,300,"Urban",244303,421341,{"$error":"#N/A"},"N06000008","Foyle",{"$f":"LOOKUP(OFFSET($D509,0,$B$12),{0,179,357,535,713;1,2,3,4,5})","v":2},{"$f":"LOOKUP(OFFSET($D509,0,$B$12),{0,90,179,268,357,446,535,624,713,802;1,2,3,4,5,6,7,8,9,10})","v":4},685,786,880,313,2664,"Northern Ireland",2664,null,null,null,null,null,null,null,"Highfield_1"]
["95MM13S5","Culmore_5","N09000005","Derry City and Strabane",610,679,760,826,231,854,659,738,"Rural",246226,422179,{"$error":"#N/A"},"N06000008","Foyle",{"$f":"LOOKUP(OFFSET($D510,0,$B$12),{0,179,357,535,713;1,2,3,4,5})","v":5},{"$f":"LOOKUP(OFFSET($D510,0,$B$12),{0,90,179,268,357,446,535,624,713,802;1,2,3,4,5,6,7,8,9,10})","v":9},697,642,847,154,2340,"Northern Ireland",2340,null,null,null,null,null,null,null,"Highfield_2"]
["95MM14S1","Ebrington_1","N09000005","Derry City and Strabane",413,235,387,602,826,353,119,416,"Urban",244602,417140,{"$error":"#N/A"},"N06000008","Foyle",{"$f":"LOOKUP(OFFSET($D511,0,$B$12),{0,179,357,535,713;1,2,3,4,5})","v":3},{"$f":"LOOKUP(OFFSET($D511,0,$B$12),{0,90,179,268,357,446,535,624,713,802;1,2,3,4,5,6,7,8,9,10})","v":5},140,226,229,292,888,"Northern Ireland",888,null,null,null,null,null,null,null,"Highfield_3"]
["95MM14S2","Ebrington_2","N09000005","Derry City and Strabane",24,51,104,166,866,18,33,38,"Urban",244451,416668,{"$error":"#N/A"},"N06000008","Foyle",{"$f":"LOOKUP(OFFSET($D512,0,$B$12),{0,179,357,535,713;1,2,3,4,5})","v":1},{"$f":"LOOKUP(OFFSET($D512,0,$B$12),{0,90,179,268,357,446,535,624,713,802;1,2,3,4,5,6,7,8,9,10})","v":1},328,621,527,278,1754,"Northern Ireland",1754,null,null,null,null,null,null,null,"Hightown"]
["95MM15S1","Eglinton_1","N09000005","Derry City and Strabane",310,348,459,707,249,393,315,421,"Rural",252162,420213,{"$error":"#N/A"},"N06000008","Foyle",{"$f":"LOOKUP(OFFSET($D513,0,$B$12),{0,179,357,535,713;1,2,3,4,5})","v":3},{"$f":"LOOKUP(OFFSET($D513,0,$B$12),{0,90,179,268,357,446,535,624,713,802;1,2,3,4,5,6,7,8,9,10})","v":5},323,387,639,416,1766,"Northern Ireland",1766,null,null,null,null,null,null,null,"Hilden_1"]
["95MM15S2","Eglinton_2","N09000005","Derry City and Strabane",510,553,560,685,269,745,607,636,"Rural",252702,419686,{"$error":"#N/A"},"N06000008","Foyle",{"$f":"LOOKUP(OFFSET($D514,0,$B$12),{0,179,357,535,713;1,2,3,4,5})","v":4},{"$f":"LOOKUP(OFFSET($D514,0,$B$12),{0,90,179,268,357,446,535,624,713,802;1,2,3,4,5,6,7,8,9,10})","v":8},641,763,962,252,2618,"Northern Ireland",2618,null,null,null,null,null,null,null,"Hilden_2"]
["95MM16S1","Enagh_1_Derry","N09000005","Derry City and Strabane",119,214,176,280,273,804,257,180,"Rural",246840,420718,{"$error":"#N/A"},"N06000008","Foyle",{"$f":"LOOKUP(OFFSET($D515,0,$B$12),{0,179,357,535,713;1,2,3,4,5})","v":2},{"$f":"LOOKUP(OFFSET($D515,0,$B$12),{0,90,179,268,357,446,535,624,713,802;1,2,3,4,5,6,7,8,9,10})","v":3},662,953,711,206,2531,"Northern Ireland",2531,null,null,null,null,null,null,null,"Hillfoot"]
["95MM16S2","Enagh_2_Derry","N09000005","Derry City and Strabane",585,555,587,729,246,486,380,634,"Mixed urban/rural",246833,418182,{"$error":"#N/A"},"N06000008","Foyle",{"$f":"LOOKUP(OFFSET($D516,0,$B$12),{0,179,357,535,713;1,2,3,4,5})","v":4},{"$f":"LOOKUP(OFFSET($D516,0,$B$12),{0,90,179,268,357,446,535,624,713,802;1,2,3,4,5,6,7,8,9,10})","v":8},821,1038,1147,415,3422,"Northern Ireland",3422,null,null,null,null,null,null,null,"Hillhall_1"]
["95MM17S1","Foyle Springs_1","N09000005","Derry City and Strabane",742,488,605,738,488,426,726,713,"Urban",242208,418501,{"$error":"#N/A"},"N06000008","Foyle",{"$f":"LOOKUP(OFFSET($D517,0,$B$12),{0,179,357,535,713;1,2,3,4,5})","v":5},{"$f":"LOOKUP(OFFSET($D517,0,$B$12),{0,90,179,268,357,446,535,624,713,802;1,2,3,4,5,6,7,8,9,10})","v":9},379,609,773,203,1964,"Northern Ireland",1964,null,null,null,null,null,null,null,"Hillhall_2"]
["95MM17S2","Foyle Springs_2","N09000005","Derry City and Strabane",366,108,169,343,625,372,270,229,"Urban",242655,418158,{"$error":"#N/A"},"N06000008","Foyle",{"$f":"LOOKUP(OFFSET($D518,0,$B$12),{0,179,357,535,713;1,2,3,4,5})","v":2},{"$f":"LOOKUP(OFFSET($D518,0,$B$12),{0,90,179,268,357,446,535,624,713,802;1,2,3,4,5,6,7,8,9,10})","v":3},358,542,593,291,1784,"Northern Ireland",1784,null,null,null,null,null,null,null,"Hillsborough_1"]
["95MM18S1","Holly Mount_1","N09000005","Derry City and Strabane",419,438,442,521,185,432,495,470,"Rural",246426,412949,{"$error":"#N/A"},"N06000008","Foyle",{"$f":"LOOKUP(OFFSET($D519,0,$B$12),{0,179,357,535,713;1,2,3,4,5})","v":3},{"$f":"LOOKUP(OFFSET($D519,0,$B$12),{0,90,179,268,357,446,535,624,713,802;1,2,3,4,5,6,7,8,9,10})","v":6},553,808,772,287,2421,"Northern Ireland",2421,null,null,null,null,null,null,null,"Hillsborough_2"]
["95MM18S2","Holly Mount_2","N09000005","Derry City and Strabane",604,558,444,593,275,577,374,603,"Mixed urban/rural",244490,414651,{"$error":"#N/A"},"N06000008","Foyle",{"$f":"LOOKUP(OFFSET($D520,0,$B$12),{0,179,357,535,713;1,2,3,4,5})","v":4},{"$f":"LOOKUP(OFFSET($D520,0,$B$12),{0,90,179,268,357,446,535,624,713,802;1,2,3,4,5,6,7,8,9,10})","v":7},809,1025,1047,254,3135,"Northern Ireland",3135,null,null,null,null,null,null,null,"Hockley"]
["95MM19S1","Kilfennan_1","N09000005","Derry City and Strabane",764,415,458,456,774,328,496,630,"Urban",245796,416560,{"$error":"#N/A"},"N06000008","Foyle",{"$f":"LOOKUP(OFFSET($D521,0,$B$12),{0,179,357,535,713;1,2,3,4,5})","v":4},{"$f":"LOOKUP(OFFSET($D521,0,$B$12),{0,90,179,268,357,446,535,624,713,802;1,2,3,4,5,6,7,8,9,10})","v":8},242,410,522,342,1516,"Northern Ireland",1516,null,null,null,null,null,null,null,"Holly Mount_1"]
["95MM19S2","Kilfennan_2","N09000005","Derry City and Strabane",420,316,303,386,752,284,289,415,"Urban",246039,417018,{"$error":"#N/A"},"N06000008","Foyle",{"$f":"LOOKUP(OFFSET($D522,0,$B$12),{0,179,357,535,713;1,2,3,4,5})","v":3},{"$f":"LOOKUP(OFFSET($D522,0,$B$12),{0,90,179,268,357,446,535,624,713,802;1,2,3,4,5,6,7,8,9,10})","v":5},322,557,499,127,1505,"Northern Ireland",1505,null,null,null,null,null,null,null,"Holly Mount_2"]
["95MM20S1","Lisnagelvin_1","N09000005","Derry City and Strabane",391,127,164,371,614,876,429,274,"Urban",245227,416917,{"$error":"#N/A"},"N06000008","Foyle",{"$f":"LOOKUP(OFFSET($D523,0,$B$12),{0,179,357,535,713;1,2,3,4,5})","v":2},{"$f":"LOOKUP(OFFSET($D523,0,$B$12),{0,90,179,268,357,446,535,624,713,802;1,2,3,4,5,6,7,8,9,10})","v":4},283,405,549,340,1576,"Northern Ireland",1576,null,null,null,null,null,null,null,"Holywood Demesne"]
["95MM20S2","Lisnagelvin_2","N09000005","Derry City and Strabane",449,409,431,447,830,216,320,513,"Urban",245146,416404,{"$error":"#N/A"},"N06000008","Foyle",{"$f":"LOOKUP(OFFSET($D524,0,$B$12),{0,179,357,535,713;1,2,3,4,5})","v":3},{"$f":"LOOKUP(OFFSET($D524,0,$B$12),{0,90,179,268,357,446,535,624,713,802;1,2,3,4,5,6,7,8,9,10})","v":6},298,448,547,375,1668,"Northern Ireland",1668,null,null,null,null,null,null,null,"Holywood Priory"]
["95MM21S1","New Buildings_1","N09000005","Derry City and Strabane",270,229,280,265,307,579,574,278,"Rural",241313,412325,{"$error":"#N/A"},"N06000008","Foyle",{"$f":"LOOKUP(OFFSET($D525,0,$B$12),{0,179,357,535,713;1,2,3,4,5})","v":2},{"$f":"LOOKUP(OFFSET($D525,0,$B$12),{0,90,179,268,357,446,535,624,713,802;1,2,3,4,5,6,7,8,9,10})","v":4},365,491,511,237,1604,"Northern Ireland",1604,null,null,null,null,null,null,null,"Hopefield_1"]
["95MM21S2","New Buildings_2","N09000005","Derry City and Strabane",750,583,701,754,282,783,629,739,"Mixed urban/rural",241741,414095,{"$error":"#N/A"},"N06000008","Foyle",{"$f":"LOOKUP(OFFSET($D526,0,$B$12),{0,179,357,535,713;1,2,3,4,5})","v":5},{"$f":"LOOKUP(OFFSET($D526,0,$B$12),{0,90,179,268,357,446,535,624,713,802;1,2,3,4,5,6,7,8,9,10})","v":9},331,446,615,330,1723,"Northern Ireland",1723,null,null,null,null,null,null,null,"Hopefield_2"]
["95MM22S1","Pennyburn_1","N09000005","Derry City and Strabane",513,355,421,620,832,37,24,419,"Urban",243509,419017,{"$error":"#N/A"},"N06000008","Foyle",{"$f":"LOOKUP(OFFSET($D527,0,$B$12),{0,179,357,535,713;1,2,3,4,5})","v":3},{"$f":"LOOKUP(OFFSET($D527,0,$B$12),{0,90,179,268,357,446,535,624,713,802;1,2,3,4,5,6,7,8,9,10})","v":5},234,342,372,291,1238,"Northern Ireland",1238,null,null,null,null,null,null,null,"Irvinestown"]
["95MM22S2","Pennyburn_2","N09000005","Derry City and Strabane",835,508,476,812,635,819,535,755,"Urban",244157,419067,{"$error":"#N/A"},"N06000008","Foyle",{"$f":"LOOKUP(OFFSET($D528,0,$B$12),{0,179,357,535,713;1,2,3,4,5})","v":5},{"$f":"LOOKUP(OFFSET($D528,0,$B$12),{0,90,179,268,357,446,535,624,713,802;1,2,3,4,5,6,7,8,9,10})","v":9},161,275,406,373,1215,"Northern Ireland",1215,null,null,null,null,null,null,null,"Island Magee"]
["95MM23W1","Rosemount","N09000005","Derry City and Strabane",51,65,105,245,858,50,44,68,"Urban",242870,417673,{"$error":"#N/A"},"N06000008","Foyle",{"$f":"LOOKUP(OFFSET($D529,0,$B$12),{0,179,357,535,713;1,2,3,4,5})","v":1},{"$f":"LOOKUP(OFFSET($D529,0,$B$12),{0,90,179,268,357,446,535,624,713,802;1,2,3,4,5,6,7,8,9,10})","v":1},427,1017,840,342,2627,"Northern Ireland",2627,null,null,null,null,null,null,null,"Island_1"]
["95MM24W1","Shantallow East","N09000005","Derry City and Strabane",174,43,62,179,730,117,265,86,"Urban",244114,420228,{"$error":"#N/A"},"N06000008","Foyle",{"$f":"LOOKUP(OFFSET($D530,0,$B$12),{0,179,357,535,713;1,2,3,4,5})","v":1},{"$f":"LOOKUP(OFFSET($D530,0,$B$12),{0,90,179,268,357,446,535,624,713,802;1,2,3,4,5,6,7,8,9,10})","v":1},613,797,716,415,2542,"Northern Ireland",2542,null,null,null,null,null,null,null,"Island_2"]
["95MM25S1","Shantallow West_1","N09000005","Derry City and Strabane",65,7,13,87,684,300,19,19,"Urban",243166,420201,{"$error":"#N/A"},"N06000008","Foyle",{"$f":"LOOKUP(OFFSET($D531,0,$B$12),{0,179,357,535,713;1,2,3,4,5})","v":1},{"$f":"LOOKUP(OFFSET($D531,0,$B$12),{0,90,179,268,357,446,535,624,713,802;1,2,3,4,5,6,7,8,9,10})","v":1},338,442,356,105,1240,"Northern Ireland",1240,null,null,null,null,null,null,null,"Jordanstown_1"]
["95MM25S2","Shantallow West_2","N09000005","Derry City and Strabane",16,40,46,108,431,185,29,27,"Urban",242871,420417,{"$error":"#N/A"},"N06000008","Foyle",{"$f":"LOOKUP(OFFSET($D532,0,$B$12),{0,179,357,535,713;1,2,3,4,5})","v":1},{"$f":"LOOKUP(OFFSET($D532,0,$B$12),{0,90,179,268,357,446,535,624,713,802;1,2,3,4,5,6,7,8,9,10})","v":1},437,537,303,127,1404,"Northern Ireland",1404,null,null,null,null,null,null,null,"Jordanstown_2"]
["95MM25S3","Shantallow West_3","N09000005","Derry City and Strabane",40,58,59,135,328,730,107,51,"Urban",242832,420918,{"$error":"#N/A"},"N06000008","Foyle",{"$f":"LOOKUP(OFFSET($D533,0,$B$12),{0,179,357,535,713;1,2,3,4,5})","v":1},{"$f":"LOOKUP(OFFSET($D533,0,$B$12),{0,90,179,268,357,446,535,624,713,802;1,2,3,4,5,6,7,8,9,10})","v":1},669,808,531,87,2094,"Northern Ireland",2094,null,null,null,null,null,null,null,"Jordanstown_3"]
["95MM25S4","Shantallow West_4","N09000005","Derry City and Strabane",254,308,282,430,330,671,273,327,"Urban",242402,420435,{"$error":"#N/A"},"N06000008","Foyle",{"$f":"LOOKUP(OFFSET($D534,0,$B$12),{0,179,357,535,713;1,2,3,4,5})","v":2},{"$f":"LOOKUP(OFFSET($D534,0,$B$12),{0,90,179,268,357,446,535,624,713,802;1,2,3,4,5,6,7,8,9,10})","v":4},581,740,709,137,2166,"Northern Ireland",2166,null,null,null,null,null,null,null,"Katesbridge"]
["95MM26S1","Springtown_1","N09000005","Derry City and Strabane",157,114,108,262,584,257,291,144,"Urban",241888,419257,{"$error":"#N/A"},"N06000008","Foyle",{"$f":"LOOKUP(OFFSET($D535,0,$B$12),{0,179,357,535,713;1,2,3,4,5})","v":1},{"$f":"LOOKUP(OFFSET($D535,0,$B$12),{0,90,179,268,357,446,535,624,713,802;1,2,3,4,5,6,7,8,9,10})","v":2},436,551,589,171,1747,"Northern Ireland",1747,null,null,null,null,null,null,null,"Keady"]
["95MM26S2","Springtown_2","N09000005","Derry City and Strabane",804,347,363,626,560,255,413,578,"Urban",242072,419535,{"$error":"#N/A"},"N06000008","Foyle",{"$f":"LOOKUP(OFFSET($D536,0,$B$12),{0,179,357,535,713;1,2,3,4,5})","v":4},{"$f":"LOOKUP(OFFSET($D536,0,$B$12),{0,90,179,268,357,446,535,624,713,802;1,2,3,4,5,6,7,8,9,10})","v":7},209,366,513,215,1304,"Northern Ireland",1304,null,null,null,null,null,null,null,"Kells_1"]
["95MM27S1","Strand_1_Derry","N09000005","Derry City and Strabane",10,4,36,203,839,9,10,5,"Urban",243260,417180,{"$error":"#N/A"},"N06000008","Foyle",{"$f":"LOOKUP(OFFSET($D537,0,$B$12),{0,179,357,535,713;1,2,3,4,5})","v":1},{"$f":"LOOKUP(OFFSET($D537,0,$B$12),{0,90,179,268,357,446,535,624,713,802;1,2,3,4,5,6,7,8,9,10})","v":1},192,805,609,264,1870,"Northern Ireland",1870,null,null,null,null,null,null,null,"Kells_2"]
["95MM27S2","Strand_2_Derry","N09000005","Derry City and Strabane",345,434,339,557,862,22,205,405,"Urban",243405,418208,{"$error":"#N/A"},"N06000008","Foyle",{"$f":"LOOKUP(OFFSET($D538,0,$B$12),{0,179,357,535,713;1,2,3,4,5})","v":3},{"$f":"LOOKUP(OFFSET($D538,0,$B$12),{0,90,179,268,357,446,535,624,713,802;1,2,3,4,5,6,7,8,9,10})","v":5},187,972,427,282,1868,"Northern Ireland",1868,null,null,null,null,null,null,null,"Kernan_1"]
["95MM28W1","The Diamond","N09000005","Derry City and Strabane",11,6,44,152,845,42,1,6,"Urban",243226,416150,{"$error":"#N/A"},"N06000008","Foyle",{"$f":"LOOKUP(OFFSET($D539,0,$B$12),{0,179,357,535,713;1,2,3,4,5})","v":1},{"$f":"LOOKUP(OFFSET($D539,0,$B$12),{0,90,179,268,357,446,535,624,713,802;1,2,3,4,5,6,7,8,9,10})","v":1},359,798,819,316,2292,"Northern Ireland",2292,null,null,null,null,null,null,null,"Kernan_2"]
["95MM29W1","Victoria_Derry","N09000005","Derry City and Strabane",149,152,160,212,677,183,109,153,"Urban",244114,415868,{"$error":"#N/A"},"N06000008","Foyle",{"$f":"LOOKUP(OFFSET($D540,0,$B$12),{0,179,357,535,713;1,2,3,4,5})","v":1},{"$f":"LOOKUP(OFFSET($D540,0,$B$12),{0,90,179,268,357,446,535,624,713,802;1,2,3,4,5,6,7,8,9,10})","v":2},820,1351,1105,353,3629,"Northern Ireland",3629,null,null,null,null,null,null,null,"Kesh Ederney and Lack_1"]
["95MM30W1","Westland","N09000005","Derry City and Strabane",43,29,77,167,865,110,120,45,"Urban",242782,416772,{"$error":"#N/A"},"N06000008","Foyle",{"$f":"LOOKUP(OFFSET($D541,0,$B$12),{0,179,357,535,713;1,2,3,4,5})","v":1},{"$f":"LOOKUP(OFFSET($D541,0,$B$12),{0,90,179,268,357,446,535,624,713,802;1,2,3,4,5,6,7,8,9,10})","v":1},448,650,697,353,2148,"Northern Ireland",2148,null,null,null,null,null,null,null,"Kesh Ederney and Lack_2"]
["95NN01S1","Ardglass_1","N09000010","Newry, Mourne and Down",285,115,204,175,227,612,259,176,"Rural",355668,337291,{"$error":"#N/A"},"N06000015","South Down",{"$f":"LOOKUP(OFFSET($D542,0,$B$12),{0,179,357,535,713;1,2,3,4,5})","v":1},{"$f":"LOOKUP(OFFSET($D542,0,$B$12),{0,90,179,268,357,446,535,624,713,802;1,2,3,4,5,6,7,8,9,10})","v":2},293,441,428,316,1478,"Northern Ireland",1478,null,null,null,null,null,null,null,"Kilfennan_1"]
["95NN01S2","Ardglass_2","N09000010","Newry, Mourne and Down",302,263,372,474,104,350,449,305,"Rural",355930,340658,{"$error":"#N/A"},"N06000015","South Down",{"$f":"LOOKUP(OFFSET($D543,0,$B$12),{0,179,357,535,713;1,2,3,4,5})","v":2},{"$f":"LOOKUP(OFFSET($D543,0,$B$12),{0,90,179,268,357,446,535,624,713,802;1,2,3,4,5,6,7,8,9,10})","v":4},391,501,530,294,1716,"Northern Ireland",1716,null,null,null,null,null,null,null,"Kilfennan_2"]
["95NN02W1","Audley's Acre","N09000010","Newry, Mourne and Down",710,456,449,531,389,672,237,599,"Urban",349542,345029,{"$error":"#N/A"},"N06000015","South Down",{"$f":"LOOKUP(OFFSET($D544,0,$B$12),{0,179,357,535,713;1,2,3,4,5})","v":4},{"$f":"LOOKUP(OFFSET($D544,0,$B$12),{0,90,179,268,357,446,535,624,713,802;1,2,3,4,5,6,7,8,9,10})","v":7},394,595,734,417,2139,"Northern Ireland",2139,null,null,null,null,null,null,null,"Kilkeel Central_1"]
["95NN03S1","Ballymaglave_1","N09000010","Newry, Mourne and Down",215,372,344,527,704,677,214,396,"Urban",336251,352553,{"$error":"#N/A"},"N06000016","Strangford",{"$f":"LOOKUP(OFFSET($D545,0,$B$12),{0,179,357,535,713;1,2,3,4,5})","v":3},{"$f":"LOOKUP(OFFSET($D545,0,$B$12),{0,90,179,268,357,446,535,624,713,802;1,2,3,4,5,6,7,8,9,10})","v":5},239,325,421,243,1227,"Northern Ireland",1227,null,null,null,null,null,null,null,"Kilkeel Central_2"]
["95NN03S2","Ballymaglave_2","N09000010","Newry, Mourne and Down",548,381,365,274,341,822,556,475,"Urban",336026,353204,{"$f":"IF(B546=$F$27,O546,NA())","v":{"$error":"#N/A"}},"N06000016","Strangford",{"$f":"LOOKUP(OFFSET($D546,0,$B$12),{0,179,357,535,713;1,2,3,4,5})","v":3},{"$f":"LOOKUP(OFFSET($D546,0,$B$12),{0,90,179,268,357,446,535,624,713,802;1,2,3,4,5,6,7,8,9,10})","v":6},308,432,532,332,1603,"Northern Ireland",{"$f":"CHOOSE($K$5,$Y546,IF($D546=$B$27,$Y546,\"\"),IF($R546=$B$27,$Y546,\"\"))","v":1603},null,null,null,null,null,null,null,"Kilkeel South_1"]
["95NN04W1","Ballymote","N09000010","Newry, Mourne and Down",315,93,57,113,473,651,34,115,"Urban",349336,343907,{"$error":"#N/A"},"N06000015","South Down",{"$f":"LOOKUP(OFFSET($D547,0,$B$12),{0,179,357,535,713;1,2,3,4,5})","v":1},{"$f":"LOOKUP(OFFSET($D547,0,$B$12),{0,90,179,268,357,446,535,624,713,802;1,2,3,4,5,6,7,8,9,10})","v":2},842,1124,799,314,3080,"Northern Ireland",3080,null,null,null,null,null,null,null,"Kilkeel South_2"]
["95NN05W1","Ballynahinch East","N09000010","Newry, Mourne and Down",234,271,272,256,628,527,187,283,"Urban",337197,352481,{"$error":"#N/A"},"N06000016","Strangford",{"$f":"LOOKUP(OFFSET($D548,0,$B$12),{0,179,357,535,713;1,2,3,4,5})","v":2},{"$f":"LOOKUP(OFFSET($D548,0,$B$12),{0,90,179,268,357,446,535,624,713,802;1,2,3,4,5,6,7,8,9,10})","v":4},529,771,746,435,2481,"Northern Ireland",2481,null,null,null,null,null,null,null,"Killeen"]
["95NN06S1","Castlewellan_1","N09000010","Newry, Mourne and Down",580,184,161,142,688,35,287,235,"Rural",334186,335927,{"$error":"#N/A"},"N06000015","South Down",{"$f":"LOOKUP(OFFSET($D549,0,$B$12),{0,179,357,535,713;1,2,3,4,5})","v":2},{"$f":"LOOKUP(OFFSET($D549,0,$B$12),{0,90,179,268,357,446,535,624,713,802;1,2,3,4,5,6,7,8,9,10})","v":3},249,352,344,176,1121,"Northern Ireland",1121,null,null,null,null,null,null,null,"Killinchy_1"]
["95NN06S2","Castlewellan_2","N09000010","Newry, Mourne and Down",427,406,382,418,233,634,544,455,"Rural",334115,337370,{"$error":"#N/A"},"N06000015","South Down",{"$f":"LOOKUP(OFFSET($D550,0,$B$12),{0,179,357,535,713;1,2,3,4,5})","v":3},{"$f":"LOOKUP(OFFSET($D550,0,$B$12),{0,90,179,268,357,446,535,624,713,802;1,2,3,4,5,6,7,8,9,10})","v":6},625,784,756,329,2494,"Northern Ireland",2494,null,null,null,null,null,null,null,"Killinchy_2"]
["95NN07S1","Cathedral_1","N09000010","Newry, Mourne and Down",546,251,152,395,454,821,163,352,"Urban",348599,343190,{"$error":"#N/A"},"N06000015","South Down",{"$f":"LOOKUP(OFFSET($D551,0,$B$12),{0,179,357,535,713;1,2,3,4,5})","v":2},{"$f":"LOOKUP(OFFSET($D551,0,$B$12),{0,90,179,268,357,446,535,624,713,802;1,2,3,4,5,6,7,8,9,10})","v":4},384,586,537,153,1660,"Northern Ireland",1660,null,null,null,null,null,null,null,"Killoquin Lower"]
["95NN07S2","Cathedral_2","N09000010","Newry, Mourne and Down",108,133,125,158,489,434,23,106,"Urban",348514,343574,{"$error":"#N/A"},"N06000015","South Down",{"$f":"LOOKUP(OFFSET($D552,0,$B$12),{0,179,357,535,713;1,2,3,4,5})","v":1},{"$f":"LOOKUP(OFFSET($D552,0,$B$12),{0,90,179,268,357,446,535,624,713,802;1,2,3,4,5,6,7,8,9,10})","v":2},357,507,427,261,1551,"Northern Ireland",1551,null,null,null,null,null,null,null,"Killoquin Upper"]
["95NN08S1","Crossgar_1","N09000010","Newry, Mourne and Down",649,611,580,698,207,536,653,669,"Rural",347289,351756,{"$error":"#N/A"},"N06000015","South Down",{"$f":"LOOKUP(OFFSET($D553,0,$B$12),{0,179,357,535,713;1,2,3,4,5})","v":4},{"$f":"LOOKUP(OFFSET($D553,0,$B$12),{0,90,179,268,357,446,535,624,713,802;1,2,3,4,5,6,7,8,9,10})","v":8},256,379,561,250,1446,"Northern Ireland",1446,null,null,null,null,null,null,null,"Killough_1"]
["95NN08S2","Crossgar_2","N09000010","Newry, Mourne and Down",551,639,720,553,228,790,555,660,"Rural",346045,350561,{"$error":"#N/A"},"N06000015","South Down",{"$f":"LOOKUP(OFFSET($D554,0,$B$12),{0,179,357,535,713;1,2,3,4,5})","v":4},{"$f":"LOOKUP(OFFSET($D554,0,$B$12),{0,90,179,268,357,446,535,624,713,802;1,2,3,4,5,6,7,8,9,10})","v":8},421,573,616,296,1906,"Northern Ireland",1906,null,null,null,null,null,null,null,"Killough_2"]
["95NN09S1","Derryboy_1","N09000010","Newry, Mourne and Down",652,822,835,792,95,469,861,716,"Rural",345654,357630,{"$error":"#N/A"},"N06000016","Strangford",{"$f":"LOOKUP(OFFSET($D555,0,$B$12),{0,179,357,535,713;1,2,3,4,5})","v":5},{"$f":"LOOKUP(OFFSET($D555,0,$B$12),{0,90,179,268,357,446,535,624,713,802;1,2,3,4,5,6,7,8,9,10})","v":9},341,536,644,265,1785,"Northern Ireland",1785,null,null,null,null,null,null,null,"Killyclogher_1"]
["95NN09S2","Derryboy_2","N09000010","Newry, Mourne and Down",443,487,556,657,142,57,521,464,"Rural",350611,354861,{"$error":"#N/A"},"N06000016","Strangford",{"$f":"LOOKUP(OFFSET($D556,0,$B$12),{0,179,357,535,713;1,2,3,4,5})","v":3},{"$f":"LOOKUP(OFFSET($D556,0,$B$12),{0,90,179,268,357,446,535,624,713,802;1,2,3,4,5,6,7,8,9,10})","v":6},232,342,456,354,1385,"Northern Ireland",1385,null,null,null,null,null,null,null,"Killyclogher_2"]
["95NN10S1","Donard_1","N09000010","Newry, Mourne and Down",673,208,326,675,428,467,136,442,"Urban",337367,330463,{"$error":"#N/A"},"N06000015","South Down",{"$f":"LOOKUP(OFFSET($D557,0,$B$12),{0,179,357,535,713;1,2,3,4,5})","v":3},{"$f":"LOOKUP(OFFSET($D557,0,$B$12),{0,90,179,268,357,446,535,624,713,802;1,2,3,4,5,6,7,8,9,10})","v":5},216,311,492,466,1484,"Northern Ireland",1484,null,null,null,null,null,null,null,"Killycolpy"]
["95NN10S2","Donard_2","N09000010","Newry, Mourne and Down",462,606,652,735,352,660,685,671,"Urban",336948,331121,{"$error":"#N/A"},"N06000015","South Down",{"$f":"LOOKUP(OFFSET($D558,0,$B$12),{0,179,357,535,713;1,2,3,4,5})","v":4},{"$f":"LOOKUP(OFFSET($D558,0,$B$12),{0,90,179,268,357,446,535,624,713,802;1,2,3,4,5,6,7,8,9,10})","v":8},341,432,558,275,1605,"Northern Ireland",1605,null,null,null,null,null,null,null,"Killycomain"]
["95NN11S1","Drumaness_1","N09000010","Newry, Mourne and Down",436,334,258,369,223,354,488,364,"Rural",339769,348539,{"$error":"#N/A"},"N06000015","South Down",{"$f":"LOOKUP(OFFSET($D559,0,$B$12),{0,179,357,535,713;1,2,3,4,5})","v":3},{"$f":"LOOKUP(OFFSET($D559,0,$B$12),{0,90,179,268,357,446,535,624,713,802;1,2,3,4,5,6,7,8,9,10})","v":5},437,601,546,215,1799,"Northern Ireland",1799,null,null,null,null,null,null,null,"Killycrot"]
["95NN11S2","Drumaness_2","N09000010","Newry, Mourne and Down",476,690,645,662,129,648,787,629,"Rural",342042,348505,{"$error":"#N/A"},"N06000015","South Down",{"$f":"LOOKUP(OFFSET($D560,0,$B$12),{0,179,357,535,713;1,2,3,4,5})","v":4},{"$f":"LOOKUP(OFFSET($D560,0,$B$12),{0,90,179,268,357,446,535,624,713,802;1,2,3,4,5,6,7,8,9,10})","v":8},526,638,789,279,2232,"Northern Ireland",2232,null,null,null,null,null,null,null,"Killylea"]
["95NN12W1","Dundrum","N09000010","Newry, Mourne and Down",182,374,376,427,209,572,419,321,"Rural",338914,336920,{"$error":"#N/A"},"N06000015","South Down",{"$f":"LOOKUP(OFFSET($D561,0,$B$12),{0,179,357,535,713;1,2,3,4,5})","v":2},{"$f":"LOOKUP(OFFSET($D561,0,$B$12),{0,90,179,268,357,446,535,624,713,802;1,2,3,4,5,6,7,8,9,10})","v":4},701,859,964,467,2991,"Northern Ireland",2991,null,null,null,null,null,null,null,"Killyleagh"]
["95NN13W1","Dunmore","N09000010","Newry, Mourne and Down",623,657,677,656,146,654,657,666,"Mixed urban/rural",336033,348428,{"$error":"#N/A"},"N06000015","South Down",{"$f":"LOOKUP(OFFSET($D562,0,$B$12),{0,179,357,535,713;1,2,3,4,5})","v":4},{"$f":"LOOKUP(OFFSET($D562,0,$B$12),{0,90,179,268,357,446,535,624,713,802;1,2,3,4,5,6,7,8,9,10})","v":8},648,782,1084,605,3118,"Northern Ireland",3118,null,null,null,null,null,null,null,"Killyman"]
["95NN14S1","Killough_1","N09000010","Newry, Mourne and Down",186,266,316,327,126,329,323,217,"Rural",352457,337269,{"$error":"#N/A"},"N06000015","South Down",{"$f":"LOOKUP(OFFSET($D563,0,$B$12),{0,179,357,535,713;1,2,3,4,5})","v":2},{"$f":"LOOKUP(OFFSET($D563,0,$B$12),{0,90,179,268,357,446,535,624,713,802;1,2,3,4,5,6,7,8,9,10})","v":3},391,537,598,269,1795,"Northern Ireland",1795,null,null,null,null,null,null,null,"Killymeal"]
["95NN14S2","Killough_2","N09000010","Newry, Mourne and Down",238,318,401,378,72,143,576,261,"Rural",344585,336975,{"$error":"#N/A"},"N06000015","South Down",{"$f":"LOOKUP(OFFSET($D564,0,$B$12),{0,179,357,535,713;1,2,3,4,5})","v":2},{"$f":"LOOKUP(OFFSET($D564,0,$B$12),{0,90,179,268,357,446,535,624,713,802;1,2,3,4,5,6,7,8,9,10})","v":3},267,356,432,185,1240,"Northern Ireland",1240,null,null,null,null,null,null,null,"Killymoon"]
["95NN15W1","Killyleagh","N09000010","Newry, Mourne and Down",349,398,407,238,318,508,314,381,"Rural",352420,352563,{"$error":"#N/A"},"N06000016","Strangford",{"$f":"LOOKUP(OFFSET($D565,0,$B$12),{0,179,357,535,713;1,2,3,4,5})","v":3},{"$f":"LOOKUP(OFFSET($D565,0,$B$12),{0,90,179,268,357,446,535,624,713,802;1,2,3,4,5,6,7,8,9,10})","v":5},601,988,1008,528,3125,"Northern Ireland",3125,null,null,null,null,null,null,null,"Kilmore_1"]
["95NN16S1","Kilmore_1","N09000010","Newry, Mourne and Down",559,813,839,856,216,406,645,735,"Rural",338511,356766,{"$error":"#N/A"},"N06000016","Strangford",{"$f":"LOOKUP(OFFSET($D566,0,$B$12),{0,179,357,535,713;1,2,3,4,5})","v":5},{"$f":"LOOKUP(OFFSET($D566,0,$B$12),{0,90,179,268,357,446,535,624,713,802;1,2,3,4,5,6,7,8,9,10})","v":9},297,380,575,407,1660,"Northern Ireland",1660,null,null,null,null,null,null,null,"Kilmore_2"]
["95NN16S2","Kilmore_2","N09000010","Newry, Mourne and Down",612,707,820,614,184,414,806,693,"Rural",343375,353717,{"$error":"#N/A"},"N06000016","Strangford",{"$f":"LOOKUP(OFFSET($D567,0,$B$12),{0,179,357,535,713;1,2,3,4,5})","v":4},{"$f":"LOOKUP(OFFSET($D567,0,$B$12),{0,90,179,268,357,446,535,624,713,802;1,2,3,4,5,6,7,8,9,10})","v":8},295,456,583,301,1636,"Northern Ireland",1636,null,null,null,null,null,null,null,"Kilrea"]
["95NN17W1","Murlough","N09000010","Newry, Mourne and Down",112,77,114,176,361,600,57,89,"Mixed urban/rural",337668,332659,{"$error":"#N/A"},"N06000015","South Down",{"$f":"LOOKUP(OFFSET($D568,0,$B$12),{0,179,357,535,713;1,2,3,4,5})","v":1},{"$f":"LOOKUP(OFFSET($D568,0,$B$12),{0,90,179,268,357,446,535,624,713,802;1,2,3,4,5,6,7,8,9,10})","v":1},552,765,710,412,2439,"Northern Ireland",2439,null,null,null,null,null,null,null,"Kilwaughter_1"]
["95NN18S1","Quoile_1","N09000010","Newry, Mourne and Down",401,105,146,217,448,154,183,186,"Urban",348661,345274,{"$error":"#N/A"},"N06000015","South Down",{"$f":"LOOKUP(OFFSET($D569,0,$B$12),{0,179,357,535,713;1,2,3,4,5})","v":2},{"$f":"LOOKUP(OFFSET($D569,0,$B$12),{0,90,179,268,357,446,535,624,713,802;1,2,3,4,5,6,7,8,9,10})","v":3},256,404,404,218,1283,"Northern Ireland",1283,null,null,null,null,null,null,null,"Kilwaughter_2"]
["95NN18S2","Quoile_2","N09000010","Newry, Mourne and Down",875,607,591,759,266,810,712,761,"Urban",349432,345788,{"$error":"#N/A"},"N06000015","South Down",{"$f":"LOOKUP(OFFSET($D570,0,$B$12),{0,179,357,535,713;1,2,3,4,5})","v":5},{"$f":"LOOKUP(OFFSET($D570,0,$B$12),{0,90,179,268,357,446,535,624,713,802;1,2,3,4,5,6,7,8,9,10})","v":9},298,413,536,289,1536,"Northern Ireland",1536,null,null,null,null,null,null,null,"Kilwee_1"]
["95NN19S1","Saintfield_1","N09000010","Newry, Mourne and Down",763,577,598,756,586,756,559,771,"Rural",340392,358697,{"$error":"#N/A"},"N06000016","Strangford",{"$f":"LOOKUP(OFFSET($D571,0,$B$12),{0,179,357,535,713;1,2,3,4,5})","v":5},{"$f":"LOOKUP(OFFSET($D571,0,$B$12),{0,90,179,268,357,446,535,624,713,802;1,2,3,4,5,6,7,8,9,10})","v":9},321,469,579,280,1649,"Northern Ireland",1649,null,null,null,null,null,null,null,"Kilwee_2"]
["95NN19S2","Saintfield_2","N09000010","Newry, Mourne and Down",545,821,837,828,327,828,562,781,"Rural",340437,359452,{"$error":"#N/A"},"N06000016","Strangford",{"$f":"LOOKUP(OFFSET($D572,0,$B$12),{0,179,357,535,713;1,2,3,4,5})","v":5},{"$f":"LOOKUP(OFFSET($D572,0,$B$12),{0,90,179,268,357,446,535,624,713,802;1,2,3,4,5,6,7,8,9,10})","v":9},354,572,640,342,1908,"Northern Ireland",1908,null,null,null,null,null,null,null,"Kircubbin_1"]
["95NN20W1","Seaforde","N09000010","Newry, Mourne and Down",411,511,511,477,66,326,567,429,"Rural",341807,342176,{"$error":"#N/A"},"N06000015","South Down",{"$f":"LOOKUP(OFFSET($D573,0,$B$12),{0,179,357,535,713;1,2,3,4,5})","v":3},{"$f":"LOOKUP(OFFSET($D573,0,$B$12),{0,90,179,268,357,446,535,624,713,802;1,2,3,4,5,6,7,8,9,10})","v":5},653,906,1085,495,3138,"Northern Ireland",3138,null,null,null,null,null,null,null,"Kircubbin_2"]
["95NN21W1","Shimna","N09000010","Newry, Mourne and Down",241,278,368,481,523,171,64,295,"Urban",337304,331934,{"$error":"#N/A"},"N06000015","South Down",{"$f":"LOOKUP(OFFSET($D574,0,$B$12),{0,179,357,535,713;1,2,3,4,5})","v":2},{"$f":"LOOKUP(OFFSET($D574,0,$B$12),{0,90,179,268,357,446,535,624,713,802;1,2,3,4,5,6,7,8,9,10})","v":4},502,794,930,590,2816,"Northern Ireland",2816,null,null,null,null,null,null,null,"Knock_1"]
["95NN22W1","Strangford","N09000010","Newry, Mourne and Down",576,537,555,617,31,260,493,474,"Rural",356044,346947,{"$error":"#N/A"},"N06000015","South Down",{"$f":"LOOKUP(OFFSET($D575,0,$B$12),{0,179,357,535,713;1,2,3,4,5})","v":3},{"$f":"LOOKUP(OFFSET($D575,0,$B$12),{0,90,179,268,357,446,535,624,713,802;1,2,3,4,5,6,7,8,9,10})","v":6},602,791,952,527,2872,"Northern Ireland",2872,null,null,null,null,null,null,null,"Knock_2"]
["95NN23S1","Tollymore_1","N09000010","Newry, Mourne and Down",453,392,455,437,76,129,584,375,"Rural",329739,333168,{"$error":"#N/A"},"N06000015","South Down",{"$f":"LOOKUP(OFFSET($D576,0,$B$12),{0,179,357,535,713;1,2,3,4,5})","v":3},{"$f":"LOOKUP(OFFSET($D576,0,$B$12),{0,90,179,268,357,446,535,624,713,802;1,2,3,4,5,6,7,8,9,10})","v":5},422,556,519,193,1690,"Northern Ireland",1690,null,null,null,null,null,null,null,"Knock_3"]
["95NN23S2","Tollymore_2","N09000010","Newry, Mourne and Down",192,396,440,638,244,409,441,372,"Rural",335117,334701,{"$error":"#N/A"},"N06000015","South Down",{"$f":"LOOKUP(OFFSET($D577,0,$B$12),{0,179,357,535,713;1,2,3,4,5})","v":3},{"$f":"LOOKUP(OFFSET($D577,0,$B$12),{0,90,179,268,357,446,535,624,713,802;1,2,3,4,5,6,7,8,9,10})","v":5},384,573,621,378,1955,"Northern Ireland",1955,null,null,null,null,null,null,null,"Knockagh"]
["95OO01W1","Altmore","N09000009","Mid Ulster",242,425,497,435,53,122,871,313,"Rural",271635,366279,{"$error":"#N/A"},"N06000010","Mid Ulster",{"$f":"LOOKUP(OFFSET($D578,0,$B$12),{0,179,357,535,713;1,2,3,4,5})","v":2},{"$f":"LOOKUP(OFFSET($D578,0,$B$12),{0,90,179,268,357,446,535,624,713,802;1,2,3,4,5,6,7,8,9,10})","v":4},695,816,830,406,2746,"Northern Ireland",2746,null,null,null,null,null,null,null,"Knockaholet"]
["95OO02W1","Augher","N09000009","Mid Ulster",331,692,757,699,36,197,720,479,"Rural",259185,356286,{"$error":"#N/A"},"N06000007","Fermanagh & South Tyrone",{"$f":"LOOKUP(OFFSET($D579,0,$B$12),{0,179,357,535,713;1,2,3,4,5})","v":3},{"$f":"LOOKUP(OFFSET($D579,0,$B$12),{0,90,179,268,357,446,535,624,713,802;1,2,3,4,5,6,7,8,9,10})","v":6},514,745,753,298,2310,"Northern Ireland",2310,null,null,null,null,null,null,null,"Knockbracken_1"]
["95OO03W1","Aughnacloy","N09000009","Mid Ulster",183,482,483,500,106,474,515,344,"Rural",268626,353648,{"$error":"#N/A"},"N06000007","Fermanagh & South Tyrone",{"$f":"LOOKUP(OFFSET($D580,0,$B$12),{0,179,357,535,713;1,2,3,4,5})","v":2},{"$f":"LOOKUP(OFFSET($D580,0,$B$12),{0,90,179,268,357,446,535,624,713,802;1,2,3,4,5,6,7,8,9,10})","v":4},667,931,889,399,2885,"Northern Ireland",2885,null,null,null,null,null,null,null,"Knockbracken_2"]
["95OO04W1","Ballygawley","N09000009","Mid Ulster",113,327,330,438,107,596,543,232,"Rural",265810,359663,{"$error":"#N/A"},"N06000007","Fermanagh & South Tyrone",{"$f":"LOOKUP(OFFSET($D581,0,$B$12),{0,179,357,535,713;1,2,3,4,5})","v":2},{"$f":"LOOKUP(OFFSET($D581,0,$B$12),{0,90,179,268,357,446,535,624,713,802;1,2,3,4,5,6,7,8,9,10})","v":3},663,802,798,357,2620,"Northern Ireland",2620,null,null,null,null,null,null,null,"Knockcloghrim"]
["95OO05W1","Ballysaggart","N09000009","Mid Ulster",336,219,210,155,679,250,156,239,"Urban",279083,362618,{"$error":"#N/A"},"N06000007","Fermanagh & South Tyrone",{"$f":"LOOKUP(OFFSET($D582,0,$B$12),{0,179,357,535,713;1,2,3,4,5})","v":2},{"$f":"LOOKUP(OFFSET($D582,0,$B$12),{0,90,179,268,357,446,535,624,713,802;1,2,3,4,5,6,7,8,9,10})","v":3},797,1191,789,315,3092,"Northern Ireland",3092,null,null,null,null,null,null,null,"Knocklayd"]
["95OO06W1","Benburb","N09000009","Mid Ulster",311,636,572,566,118,358,758,494,"Rural",280601,355899,{"$error":"#N/A"},"N06000007","Fermanagh & South Tyrone",{"$f":"LOOKUP(OFFSET($D583,0,$B$12),{0,179,357,535,713;1,2,3,4,5})","v":3},{"$f":"LOOKUP(OFFSET($D583,0,$B$12),{0,90,179,268,357,446,535,624,713,802;1,2,3,4,5,6,7,8,9,10})","v":6},754,1005,938,385,3083,"Northern Ireland",3083,null,null,null,null,null,null,null,"Knocklynn_1"]
["95OO07W1","Caledon","N09000009","Mid Ulster",363,629,566,668,57,150,796,465,"Rural",275704,351922,{"$error":"#N/A"},"N06000007","Fermanagh & South Tyrone",{"$f":"LOOKUP(OFFSET($D584,0,$B$12),{0,179,357,535,713;1,2,3,4,5})","v":3},{"$f":"LOOKUP(OFFSET($D584,0,$B$12),{0,90,179,268,357,446,535,624,713,802;1,2,3,4,5,6,7,8,9,10})","v":6},586,880,788,386,2640,"Northern Ireland",2640,null,null,null,null,null,null,null,"Knocklynn_2"]
["95OO08W1","Castlecaulfield","N09000009","Mid Ulster",577,599,499,621,206,620,598,625,"Rural",274708,361557,{"$error":"#N/A"},"N06000007","Fermanagh & South Tyrone",{"$f":"LOOKUP(OFFSET($D585,0,$B$12),{0,179,357,535,713;1,2,3,4,5})","v":4},{"$f":"LOOKUP(OFFSET($D585,0,$B$12),{0,90,179,268,357,446,535,624,713,802;1,2,3,4,5,6,7,8,9,10})","v":8},644,862,897,427,2830,"Northern Ireland",2830,null,null,null,null,null,null,null,"Knockmore_1"]
["95OO09W1","Clogher","N09000009","Mid Ulster",325,474,498,393,40,203,462,331,"Rural",253798,352406,{"$error":"#N/A"},"N06000007","Fermanagh & South Tyrone",{"$f":"LOOKUP(OFFSET($D586,0,$B$12),{0,179,357,535,713;1,2,3,4,5})","v":2},{"$f":"LOOKUP(OFFSET($D586,0,$B$12),{0,90,179,268,357,446,535,624,713,802;1,2,3,4,5,6,7,8,9,10})","v":4},542,734,676,382,2334,"Northern Ireland",2334,null,null,null,null,null,null,null,"Knockmore_2"]
["95OO10W1","Coalisland North","N09000009","Mid Ulster",431,233,191,325,356,788,513,329,"Mixed urban/rural",285246,366883,{"$error":"#N/A"},"N06000010","Mid Ulster",{"$f":"LOOKUP(OFFSET($D587,0,$B$12),{0,179,357,535,713;1,2,3,4,5})","v":2},{"$f":"LOOKUP(OFFSET($D587,0,$B$12),{0,90,179,268,357,446,535,624,713,802;1,2,3,4,5,6,7,8,9,10})","v":4},905,1262,979,459,3604,"Northern Ireland",3604,null,null,null,null,null,null,null,"Knocknashane_1"]
["95OO11W1","Coalisland South","N09000009","Mid Ulster",76,96,82,199,447,595,197,92,"Urban",284323,366011,{"$error":"#N/A"},"N06000010","Mid Ulster",{"$f":"LOOKUP(OFFSET($D588,0,$B$12),{0,179,357,535,713;1,2,3,4,5})","v":1},{"$f":"LOOKUP(OFFSET($D588,0,$B$12),{0,90,179,268,357,446,535,624,713,802;1,2,3,4,5,6,7,8,9,10})","v":2},657,891,761,290,2599,"Northern Ireland",2599,null,null,null,null,null,null,null,"Knocknashane_2"]
["95OO12W1","Coalisland West and Newmills","N09000009","Mid Ulster",437,309,297,235,262,698,529,360,"Mixed urban/rural",282762,366601,{"$error":"#N/A"},"N06000010","Mid Ulster",{"$f":"LOOKUP(OFFSET($D589,0,$B$12),{0,179,357,535,713;1,2,3,4,5})","v":3},{"$f":"LOOKUP(OFFSET($D589,0,$B$12),{0,90,179,268,357,446,535,624,713,802;1,2,3,4,5,6,7,8,9,10})","v":5},789,904,887,427,3007,"Northern Ireland",3007,null,null,null,null,null,null,null,"Ladybrook_1"]
["95OO13W1","Coolhill","N09000009","Mid Ulster",799,726,630,361,493,65,612,662,"Urban",280986,361704,{"$error":"#N/A"},"N06000007","Fermanagh & South Tyrone",{"$f":"LOOKUP(OFFSET($D590,0,$B$12),{0,179,357,535,713;1,2,3,4,5})","v":4},{"$f":"LOOKUP(OFFSET($D590,0,$B$12),{0,90,179,268,357,446,535,624,713,802;1,2,3,4,5,6,7,8,9,10})","v":8},725,1216,895,342,3178,"Northern Ireland",3178,null,null,null,null,null,null,null,"Ladybrook_2"]
["95OO14W1","Donaghmore","N09000009","Mid Ulster",198,572,523,586,173,390,732,425,"Rural",277867,366722,{"$error":"#N/A"},"N06000010","Mid Ulster",{"$f":"LOOKUP(OFFSET($D591,0,$B$12),{0,179,357,535,713;1,2,3,4,5})","v":3},{"$f":"LOOKUP(OFFSET($D591,0,$B$12),{0,90,179,268,357,446,535,624,713,802;1,2,3,4,5,6,7,8,9,10})","v":5},590,783,859,370,2601,"Northern Ireland",2601,null,null,null,null,null,null,null,"Ladybrook_3"]
["95OO15W1","Drumglass","N09000009","Mid Ulster",341,262,203,206,476,549,387,291,"Urban",280281,363764,{"$error":"#N/A"},"N06000007","Fermanagh & South Tyrone",{"$f":"LOOKUP(OFFSET($D592,0,$B$12),{0,179,357,535,713;1,2,3,4,5})","v":2},{"$f":"LOOKUP(OFFSET($D592,0,$B$12),{0,90,179,268,357,446,535,624,713,802;1,2,3,4,5,6,7,8,9,10})","v":4},614,857,721,262,2454,"Northern Ireland",2454,null,null,null,null,null,null,null,"Lagan Valley_1"]
["95OO16W1","Fivemiletown","N09000009","Mid Ulster",397,545,453,298,155,507,386,431,"Rural",245492,348282,{"$error":"#N/A"},"N06000007","Fermanagh & South Tyrone",{"$f":"LOOKUP(OFFSET($D593,0,$B$12),{0,179,357,535,713;1,2,3,4,5})","v":3},{"$f":"LOOKUP(OFFSET($D593,0,$B$12),{0,90,179,268,357,446,535,624,713,802;1,2,3,4,5,6,7,8,9,10})","v":5},452,676,697,379,2204,"Northern Ireland",2204,null,null,null,null,null,null,null,"Lagan Valley_2"]
["95OO17W1","Killyman","N09000009","Mid Ulster",456,612,541,484,171,583,681,560,"Rural",286804,361455,{"$error":"#N/A"},"N06000007","Fermanagh & South Tyrone",{"$f":"LOOKUP(OFFSET($D594,0,$B$12),{0,179,357,535,713;1,2,3,4,5})","v":4},{"$f":"LOOKUP(OFFSET($D594,0,$B$12),{0,90,179,268,357,446,535,624,713,802;1,2,3,4,5,6,7,8,9,10})","v":7},705,931,911,432,2980,"Northern Ireland",2980,null,null,null,null,null,null,null,"Lambeg_1"]
["95OO18W1","Killymeal","N09000009","Mid Ulster",714,602,535,444,335,226,456,624,"Mixed urban/rural",281021,362622,{"$error":"#N/A"},"N06000007","Fermanagh & South Tyrone",{"$f":"LOOKUP(OFFSET($D595,0,$B$12),{0,179,357,535,713;1,2,3,4,5})","v":4},{"$f":"LOOKUP(OFFSET($D595,0,$B$12),{0,90,179,268,357,446,535,624,713,802;1,2,3,4,5,6,7,8,9,10})","v":8},675,1087,934,408,3104,"Northern Ireland",3104,null,null,null,null,null,null,null,"Lambeg_2"]
["95OO19W1","Moy","N09000009","Mid Ulster",348,633,646,559,218,702,404,558,"Rural",284949,357698,{"$error":"#N/A"},"N06000007","Fermanagh & South Tyrone",{"$f":"LOOKUP(OFFSET($D596,0,$B$12),{0,179,357,535,713;1,2,3,4,5})","v":4},{"$f":"LOOKUP(OFFSET($D596,0,$B$12),{0,90,179,268,357,446,535,624,713,802;1,2,3,4,5,6,7,8,9,10})","v":7},776,1081,1025,388,3269,"Northern Ireland",3269,null,null,null,null,null,null,null,"Laurelvale"]
["95OO20W1","Moygashel","N09000009","Mid Ulster",535,589,460,591,396,308,292,586,"Urban",280280,361009,{"$error":"#N/A"},"N06000007","Fermanagh & South Tyrone",{"$f":"LOOKUP(OFFSET($D597,0,$B$12),{0,179,357,535,713;1,2,3,4,5})","v":4},{"$f":"LOOKUP(OFFSET($D597,0,$B$12),{0,90,179,268,357,446,535,624,713,802;1,2,3,4,5,6,7,8,9,10})","v":7},484,656,672,410,2222,"Northern Ireland",2222,null,null,null,null,null,null,null,"Lawrencetown"]
["95OO21W1","Mullaghmore","N09000009","Mid Ulster",332,354,298,482,601,137,98,355,"Urban",279117,363096,{"$error":"#N/A"},"N06000007","Fermanagh & South Tyrone",{"$f":"LOOKUP(OFFSET($D598,0,$B$12),{0,179,357,535,713;1,2,3,4,5})","v":2},{"$f":"LOOKUP(OFFSET($D598,0,$B$12),{0,90,179,268,357,446,535,624,713,802;1,2,3,4,5,6,7,8,9,10})","v":4},510,908,761,373,2552,"Northern Ireland",2552,null,null,null,null,null,null,null,"Lecumpher"]
["95OO22W1","Washing Bay","N09000009","Mid Ulster",400,473,379,581,143,537,750,476,"Rural",288446,366145,{"$error":"#N/A"},"N06000010","Mid Ulster",{"$f":"LOOKUP(OFFSET($D599,0,$B$12),{0,179,357,535,713;1,2,3,4,5})","v":3},{"$f":"LOOKUP(OFFSET($D599,0,$B$12),{0,90,179,268,357,446,535,624,713,802;1,2,3,4,5,6,7,8,9,10})","v":6},743,1131,1040,351,3264,"Northern Ireland",3264,null,null,null,null,null,null,null,"Legoniel_1"]
["95PP01W1","Ballinamallard","N09000006","Fermanagh and Omagh",408,592,533,454,139,684,715,526,"Rural",226626,352038,{"$error":"#N/A"},"N06000007","Fermanagh & South Tyrone",{"$f":"LOOKUP(OFFSET($D600,0,$B$12),{0,179,357,535,713;1,2,3,4,5})","v":3},{"$f":"LOOKUP(OFFSET($D600,0,$B$12),{0,90,179,268,357,446,535,624,713,802;1,2,3,4,5,6,7,8,9,10})","v":6},563,714,906,392,2574,"Northern Ireland",2574,null,null,null,null,null,null,null,"Legoniel_2"]
["95PP02W1","Belcoo and Garrison","N09000006","Fermanagh and Omagh",128,543,710,540,2,182,596,238,"Rural",199940,348778,{"$error":"#N/A"},"N06000007","Fermanagh & South Tyrone",{"$f":"LOOKUP(OFFSET($D601,0,$B$12),{0,179,357,535,713;1,2,3,4,5})","v":2},{"$f":"LOOKUP(OFFSET($D601,0,$B$12),{0,90,179,268,357,446,535,624,713,802;1,2,3,4,5,6,7,8,9,10})","v":3},510,797,943,517,2766,"Northern Ireland",2766,null,null,null,null,null,null,null,"Legoniel_3"]
["95PP03W1","Belleek and Boa","N09000006","Fermanagh and Omagh",37,362,536,450,14,500,507,151,"Rural",204020,362128,{"$error":"#N/A"},"N06000007","Fermanagh & South Tyrone",{"$f":"LOOKUP(OFFSET($D602,0,$B$12),{0,179,357,535,713;1,2,3,4,5})","v":1},{"$f":"LOOKUP(OFFSET($D602,0,$B$12),{0,90,179,268,357,446,535,624,713,802;1,2,3,4,5,6,7,8,9,10})","v":2},566,814,851,471,2702,"Northern Ireland",2702,null,null,null,null,null,null,null,"Lisanelly_1"]
["95PP04W1","Boho Cleenish and Letterbreen","N09000006","Fermanagh and Omagh",230,650,655,415,48,514,654,399,"Rural",218119,341262,{"$error":"#N/A"},"N06000007","Fermanagh & South Tyrone",{"$f":"LOOKUP(OFFSET($D603,0,$B$12),{0,179,357,535,713;1,2,3,4,5})","v":3},{"$f":"LOOKUP(OFFSET($D603,0,$B$12),{0,90,179,268,357,446,535,624,713,802;1,2,3,4,5,6,7,8,9,10})","v":5},740,1043,1158,552,3494,"Northern Ireland",3494,null,null,null,null,null,null,null,"Lisanelly_2"]
["95PP05W1","Brookeborough","N09000006","Fermanagh and Omagh",262,562,705,565,27,153,668,366,"Rural",241065,342936,{"$error":"#N/A"},"N06000007","Fermanagh & South Tyrone",{"$f":"LOOKUP(OFFSET($D604,0,$B$12),{0,179,357,535,713;1,2,3,4,5})","v":3},{"$f":"LOOKUP(OFFSET($D604,0,$B$12),{0,90,179,268,357,446,535,624,713,802;1,2,3,4,5,6,7,8,9,10})","v":5},569,738,803,476,2586,"Northern Ireland",2586,null,null,null,null,null,null,null,"Lisbane_1"]
["95PP06S1","Castlecoole_1","N09000006","Fermanagh and Omagh",496,303,251,202,420,680,284,357,"Urban",225394,345197,{"$error":"#N/A"},"N06000007","Fermanagh & South Tyrone",{"$f":"LOOKUP(OFFSET($D605,0,$B$12),{0,179,357,535,713;1,2,3,4,5})","v":3},{"$f":"LOOKUP(OFFSET($D605,0,$B$12),{0,90,179,268,357,446,535,624,713,802;1,2,3,4,5,6,7,8,9,10})","v":5},500,682,664,243,2090,"Northern Ireland",2090,null,null,null,null,null,null,null,"Lisbane_2"]
["95PP06S2","Castlecoole_2","N09000006","Fermanagh and Omagh",224,462,518,669,416,610,304,466,"Urban",225074,344082,{"$error":"#N/A"},"N06000007","Fermanagh & South Tyrone",{"$f":"LOOKUP(OFFSET($D606,0,$B$12),{0,179,357,535,713;1,2,3,4,5})","v":3},{"$f":"LOOKUP(OFFSET($D606,0,$B$12),{0,90,179,268,357,446,535,624,713,802;1,2,3,4,5,6,7,8,9,10})","v":6},326,442,665,343,1775,"Northern Ireland",1775,null,null,null,null,null,null,null,"Lisbellaw"]
["95PP07W1","Derrygonnelly","N09000006","Fermanagh and Omagh",307,524,639,546,50,559,731,436,"Rural",214040,350700,{"$error":"#N/A"},"N06000007","Fermanagh & South Tyrone",{"$f":"LOOKUP(OFFSET($D607,0,$B$12),{0,179,357,535,713;1,2,3,4,5})","v":3},{"$f":"LOOKUP(OFFSET($D607,0,$B$12),{0,90,179,268,357,446,535,624,713,802;1,2,3,4,5,6,7,8,9,10})","v":5},605,765,981,533,2883,"Northern Ireland",2883,null,null,null,null,null,null,null,"Lisnacree"]
["95PP08W1","Derrylin","N09000006","Fermanagh and Omagh",159,595,807,487,42,597,687,362,"Rural",229232,325941,{"$error":"#N/A"},"N06000007","Fermanagh & South Tyrone",{"$f":"LOOKUP(OFFSET($D608,0,$B$12),{0,179,357,535,713;1,2,3,4,5})","v":3},{"$f":"LOOKUP(OFFSET($D608,0,$B$12),{0,90,179,268,357,446,535,624,713,802;1,2,3,4,5,6,7,8,9,10})","v":5},627,881,879,442,2829,"Northern Ireland",2829,null,null,null,null,null,null,null,"Lisnagarvey"]
["95PP09W1","Devenish","N09000006","Fermanagh and Omagh",28,62,69,153,595,119,59,44,"Urban",223448,344852,{"$error":"#N/A"},"N06000007","Fermanagh & South Tyrone",{"$f":"LOOKUP(OFFSET($D609,0,$B$12),{0,179,357,535,713;1,2,3,4,5})","v":1},{"$f":"LOOKUP(OFFSET($D609,0,$B$12),{0,90,179,268,357,446,535,624,713,802;1,2,3,4,5,6,7,8,9,10})","v":1},300,504,461,336,1601,"Northern Ireland",1601,null,null,null,null,null,null,null,"Lisnagelvin_1"]
["95PP10W1","Donagh","N09000006","Fermanagh and Omagh",69,509,649,605,16,556,719,234,"Rural",238683,332107,{"$f":"IF(B610=$F$27,O610,NA())","v":{"$error":"#N/A"}},"N06000007","Fermanagh & South Tyrone",{"$f":"LOOKUP(OFFSET($D610,0,$B$12),{0,179,357,535,713;1,2,3,4,5})","v":2},{"$f":"LOOKUP(OFFSET($D610,0,$B$12),{0,90,179,268,357,446,535,624,713,802;1,2,3,4,5,6,7,8,9,10})","v":3},518,661,797,402,2378,"Northern Ireland",{"$f":"CHOOSE($K$5,$Y610,IF($D610=$B$27,$Y610,\"\"),IF($R610=$B$27,$Y610,\"\"))","v":2378},null,null,null,null,null,null,null,"Lisnagelvin_2"]
["95PP11W1","Erne","N09000006","Fermanagh and Omagh",330,175,200,205,460,685,62,216,"Urban",224357,345329,{"$error":"#N/A"},"N06000007","Fermanagh & South Tyrone",{"$f":"LOOKUP(OFFSET($D611,0,$B$12),{0,179,357,535,713;1,2,3,4,5})","v":2},{"$f":"LOOKUP(OFFSET($D611,0,$B$12),{0,90,179,268,357,446,535,624,713,802;1,2,3,4,5,6,7,8,9,10})","v":3},506,722,827,448,2503,"Northern Ireland",2503,null,null,null,null,null,null,null,"Lisnarrick"]
["95PP12W1","Florence Court and Kinawley","N09000006","Fermanagh and Omagh",125,603,700,583,11,238,693,275,"Rural",220695,333069,{"$error":"#N/A"},"N06000007","Fermanagh & South Tyrone",{"$f":"LOOKUP(OFFSET($D612,0,$B$12),{0,179,357,535,713;1,2,3,4,5})","v":2},{"$f":"LOOKUP(OFFSET($D612,0,$B$12),{0,90,179,268,357,446,535,624,713,802;1,2,3,4,5,6,7,8,9,10})","v":4},662,776,874,488,2800,"Northern Ireland",2800,null,null,null,null,null,null,null,"Lisnasharragh"]
["95PP13W1","Irvinestown","N09000006","Fermanagh and Omagh",74,168,209,316,280,670,208,143,"Rural",224012,358448,{"$error":"#N/A"},"N06000007","Fermanagh & South Tyrone",{"$f":"LOOKUP(OFFSET($D613,0,$B$12),{0,179,357,535,713;1,2,3,4,5})","v":1},{"$f":"LOOKUP(OFFSET($D613,0,$B$12),{0,90,179,268,357,446,535,624,713,802;1,2,3,4,5,6,7,8,9,10})","v":2},598,712,761,401,2472,"Northern Ireland",2472,null,null,null,null,null,null,null,"Lisnaskea"]
["95PP14S1","Kesh Ederney and Lack_1","N09000006","Fermanagh and Omagh",134,375,352,331,47,298,714,211,"Rural",225026,364707,{"$error":"#N/A"},"N06000007","Fermanagh & South Tyrone",{"$f":"LOOKUP(OFFSET($D614,0,$B$12),{0,179,357,535,713;1,2,3,4,5})","v":2},{"$f":"LOOKUP(OFFSET($D614,0,$B$12),{0,90,179,268,357,446,535,624,713,802;1,2,3,4,5,6,7,8,9,10})","v":3},376,480,554,248,1658,"Northern Ireland",1658,null,null,null,null,null,null,null,"Lissan"]
["95PP14S2","Kesh Ederney and Lack_2","N09000006","Fermanagh and Omagh",213,536,549,342,159,697,482,392,"Rural",219138,363429,{"$error":"#N/A"},"N06000007","Fermanagh & South Tyrone",{"$f":"LOOKUP(OFFSET($D615,0,$B$12),{0,179,357,535,713;1,2,3,4,5})","v":3},{"$f":"LOOKUP(OFFSET($D615,0,$B$12),{0,90,179,268,357,446,535,624,713,802;1,2,3,4,5,6,7,8,9,10})","v":5},432,658,724,402,2216,"Northern Ireland",2216,null,null,null,null,null,null,null,"Loughbrickland"]
["95PP15W1","Lisbellaw","N09000006","Fermanagh and Omagh",560,656,621,526,196,349,710,622,"Rural",229423,342481,{"$error":"#N/A"},"N06000007","Fermanagh & South Tyrone",{"$f":"LOOKUP(OFFSET($D616,0,$B$12),{0,179,357,535,713;1,2,3,4,5})","v":4},{"$f":"LOOKUP(OFFSET($D616,0,$B$12),{0,90,179,268,357,446,535,624,713,802;1,2,3,4,5,6,7,8,9,10})","v":7},709,878,1020,443,3050,"Northern Ireland",3050,null,null,null,null,null,null,null,"Loughgall"]
["95PP16W1","Lisnarrick","N09000006","Fermanagh and Omagh",239,644,631,572,83,149,560,413,"Rural",222131,354350,{"$error":"#N/A"},"N06000007","Fermanagh & South Tyrone",{"$f":"LOOKUP(OFFSET($D617,0,$B$12),{0,179,357,535,713;1,2,3,4,5})","v":3},{"$f":"LOOKUP(OFFSET($D617,0,$B$12),{0,90,179,268,357,446,535,624,713,802;1,2,3,4,5,6,7,8,9,10})","v":5},353,493,754,496,2097,"Northern Ireland",2097,null,null,null,null,null,null,null,"Loughries_1"]
["95PP17W1","Lisnaskea","N09000006","Fermanagh and Omagh",166,164,233,229,289,615,179,182,"Rural",236165,333957,{"$error":"#N/A"},"N06000007","Fermanagh & South Tyrone",{"$f":"LOOKUP(OFFSET($D618,0,$B$12),{0,179,357,535,713;1,2,3,4,5})","v":2},{"$f":"LOOKUP(OFFSET($D618,0,$B$12),{0,90,179,268,357,446,535,624,713,802;1,2,3,4,5,6,7,8,9,10})","v":3},571,802,778,463,2614,"Northern Ireland",2614,null,null,null,null,null,null,null,"Loughries_2"]
["95PP18W1","Maguiresbridge","N09000006","Fermanagh and Omagh",210,531,620,373,111,695,665,394,"Rural",233815,338091,{"$error":"#N/A"},"N06000007","Fermanagh & South Tyrone",{"$f":"LOOKUP(OFFSET($D619,0,$B$12),{0,179,357,535,713;1,2,3,4,5})","v":3},{"$f":"LOOKUP(OFFSET($D619,0,$B$12),{0,90,179,268,357,446,535,624,713,802;1,2,3,4,5,6,7,8,9,10})","v":5},693,1041,1061,458,3253,"Northern Ireland",3253,null,null,null,null,null,null,null,"Loughview_1"]
["95PP19W1","Newtownbutler","N09000006","Fermanagh and Omagh",31,260,304,363,39,332,561,112,"Rural",242768,325712,{"$error":"#N/A"},"N06000007","Fermanagh & South Tyrone",{"$f":"LOOKUP(OFFSET($D620,0,$B$12),{0,179,357,535,713;1,2,3,4,5})","v":1},{"$f":"LOOKUP(OFFSET($D620,0,$B$12),{0,90,179,268,357,446,535,624,713,802;1,2,3,4,5,6,7,8,9,10})","v":2},598,714,825,365,2503,"Northern Ireland",2503,null,null,null,null,null,null,null,"Loughview_2"]
["95PP20W1","Portora","N09000006","Fermanagh and Omagh",114,328,295,407,418,384,38,214,"Urban",222496,344636,{"$error":"#N/A"},"N06000007","Fermanagh & South Tyrone",{"$f":"LOOKUP(OFFSET($D621,0,$B$12),{0,179,357,535,713;1,2,3,4,5})","v":2},{"$f":"LOOKUP(OFFSET($D621,0,$B$12),{0,90,179,268,357,446,535,624,713,802;1,2,3,4,5,6,7,8,9,10})","v":3},640,1034,997,511,3182,"Northern Ireland",3182,null,null,null,null,null,null,null,"Love Lane"]
["95PP21W1","Rosslea","N09000006","Fermanagh and Omagh",14,407,582,495,5,343,666,114,"Rural",251084,333183,{"$error":"#N/A"},"N06000007","Fermanagh & South Tyrone",{"$f":"LOOKUP(OFFSET($D622,0,$B$12),{0,179,357,535,713;1,2,3,4,5})","v":1},{"$f":"LOOKUP(OFFSET($D622,0,$B$12),{0,90,179,268,357,446,535,624,713,802;1,2,3,4,5,6,7,8,9,10})","v":2},494,629,682,368,2173,"Northern Ireland",2173,null,null,null,null,null,null,null,"Lower Braniel"]
["95PP22W1","Rossorry","N09000006","Fermanagh and Omagh",410,331,374,336,365,811,249,409,"Urban",222406,343115,{"$error":"#N/A"},"N06000007","Fermanagh & South Tyrone",{"$f":"LOOKUP(OFFSET($D623,0,$B$12),{0,179,357,535,713;1,2,3,4,5})","v":3},{"$f":"LOOKUP(OFFSET($D623,0,$B$12),{0,90,179,268,357,446,535,624,713,802;1,2,3,4,5,6,7,8,9,10})","v":5},475,653,830,511,2468,"Northern Ireland",2468,null,null,null,null,null,null,null,"Lower Glenshane_1"]
["95PP23W1","Tempo","N09000006","Fermanagh and Omagh",153,428,532,431,81,568,527,309,"Rural",235663,348641,{"$error":"#N/A"},"N06000007","Fermanagh & South Tyrone",{"$f":"LOOKUP(OFFSET($D624,0,$B$12),{0,179,357,535,713;1,2,3,4,5})","v":2},{"$f":"LOOKUP(OFFSET($D624,0,$B$12),{0,90,179,268,357,446,535,624,713,802;1,2,3,4,5,6,7,8,9,10})","v":4},621,799,963,465,2848,"Northern Ireland",2848,null,null,null,null,null,null,null,"Lower Glenshane_2"]
["95QQ01W1","Antiville","N09000008","Mid and East Antrim",212,117,217,160,689,134,118,156,"Urban",339107,402693,{"$error":"#N/A"},"N06000005","East Antrim",{"$f":"LOOKUP(OFFSET($D625,0,$B$12),{0,179,357,535,713;1,2,3,4,5})","v":1},{"$f":"LOOKUP(OFFSET($D625,0,$B$12),{0,90,179,268,357,446,535,624,713,802;1,2,3,4,5,6,7,8,9,10})","v":2},330,411,439,318,1498,"Northern Ireland",1498,null,null,null,null,null,null,null,"Macosquin"]
["95QQ02W1","Ballycarry","N09000008","Mid and East Antrim",615,689,767,420,122,356,723,612,"Rural",343820,395126,{"$error":"#N/A"},"N06000005","East Antrim",{"$f":"LOOKUP(OFFSET($D626,0,$B$12),{0,179,357,535,713;1,2,3,4,5})","v":4},{"$f":"LOOKUP(OFFSET($D626,0,$B$12),{0,90,179,268,357,446,535,624,713,802;1,2,3,4,5,6,7,8,9,10})","v":7},578,810,937,439,2765,"Northern Ireland",2765,null,null,null,null,null,null,null,"Maghaberry_1"]
["95QQ03W1","Ballyloran","N09000008","Mid and East Antrim",70,129,141,150,432,401,158,104,"Urban",338540,403500,{"$error":"#N/A"},"N06000005","East Antrim",{"$f":"LOOKUP(OFFSET($D627,0,$B$12),{0,179,357,535,713;1,2,3,4,5})","v":1},{"$f":"LOOKUP(OFFSET($D627,0,$B$12),{0,90,179,268,357,446,535,624,713,802;1,2,3,4,5,6,7,8,9,10})","v":2},217,310,282,193,1003,"Northern Ireland",1003,null,null,null,null,null,null,null,"Maghaberry_2"]
["95QQ04W1","Blackcave","N09000008","Mid and East Antrim",512,258,263,209,495,488,676,367,"Urban",340077,404207,{"$error":"#N/A"},"N06000005","East Antrim",{"$f":"LOOKUP(OFFSET($D628,0,$B$12),{0,179,357,535,713;1,2,3,4,5})","v":3},{"$f":"LOOKUP(OFFSET($D628,0,$B$12),{0,90,179,268,357,446,535,624,713,802;1,2,3,4,5,6,7,8,9,10})","v":5},331,427,545,281,1583,"Northern Ireland",1583,null,null,null,null,null,null,null,"Maghera"]
["95QQ05W1","Carncastle","N09000008","Mid and East Antrim",660,683,783,751,265,344,741,729,"Mixed urban/rural",338056,405553,{"$error":"#N/A"},"N06000005","East Antrim",{"$f":"LOOKUP(OFFSET($D629,0,$B$12),{0,179,357,535,713;1,2,3,4,5})","v":5},{"$f":"LOOKUP(OFFSET($D629,0,$B$12),{0,90,179,268,357,446,535,624,713,802;1,2,3,4,5,6,7,8,9,10})","v":9},463,630,1129,602,2824,"Northern Ireland",2824,null,null,null,null,null,null,null,"Magheralave_1"]
["95QQ06W1","Carnlough","N09000008","Mid and East Antrim",469,319,412,440,115,290,324,369,"Rural",328498,417677,{"$error":"#N/A"},"N06000005","East Antrim",{"$f":"LOOKUP(OFFSET($D630,0,$B$12),{0,179,357,535,713;1,2,3,4,5})","v":3},{"$f":"LOOKUP(OFFSET($D630,0,$B$12),{0,90,179,268,357,446,535,624,713,802;1,2,3,4,5,6,7,8,9,10})","v":5},414,589,709,372,2084,"Northern Ireland",2084,null,null,null,null,null,null,null,"Magheralave_2"]
["95QQ07W1","Central_Larne","N09000008","Mid and East Antrim",280,166,223,268,723,36,41,192,"Urban",339972,402482,{"$error":"#N/A"},"N06000005","East Antrim",{"$f":"LOOKUP(OFFSET($D631,0,$B$12),{0,179,357,535,713;1,2,3,4,5})","v":2},{"$f":"LOOKUP(OFFSET($D631,0,$B$12),{0,90,179,268,357,446,535,624,713,802;1,2,3,4,5,6,7,8,9,10})","v":3},202,473,660,475,1809,"Northern Ireland",1809,null,null,null,null,null,null,null,"Magheralin_1"]
["95QQ08W1","Craigy Hill","N09000008","Mid and East Antrim",515,104,156,145,633,323,357,209,"Urban",338883,403501,{"$error":"#N/A"},"N06000005","East Antrim",{"$f":"LOOKUP(OFFSET($D632,0,$B$12),{0,179,357,535,713;1,2,3,4,5})","v":2},{"$f":"LOOKUP(OFFSET($D632,0,$B$12),{0,90,179,268,357,446,535,624,713,802;1,2,3,4,5,6,7,8,9,10})","v":3},224,349,489,352,1414,"Northern Ireland",1414,null,null,null,null,null,null,null,"Magheralin_2"]
["95QQ09W1","Gardenmore","N09000008","Mid and East Antrim",700,395,454,536,632,336,350,595,"Urban",339687,403313,{"$error":"#N/A"},"N06000005","East Antrim",{"$f":"LOOKUP(OFFSET($D633,0,$B$12),{0,179,357,535,713;1,2,3,4,5})","v":4},{"$f":"LOOKUP(OFFSET($D633,0,$B$12),{0,90,179,268,357,446,535,624,713,802;1,2,3,4,5,6,7,8,9,10})","v":7},268,411,603,629,1912,"Northern Ireland",1912,null,null,null,null,null,null,null,"Magilligan"]
["95QQ10W1","Glenarm","N09000008","Mid and East Antrim",288,623,682,554,3,16,401,281,"Rural",331560,410252,{"$error":"#N/A"},"N06000005","East Antrim",{"$f":"LOOKUP(OFFSET($D634,0,$B$12),{0,179,357,535,713;1,2,3,4,5})","v":2},{"$f":"LOOKUP(OFFSET($D634,0,$B$12),{0,90,179,268,357,446,535,624,713,802;1,2,3,4,5,6,7,8,9,10})","v":4},349,497,677,341,1863,"Northern Ireland",1863,null,null,null,null,null,null,null,"Maguiresbridge"]
["95QQ11W1","Glynn","N09000008","Mid and East Antrim",379,615,644,618,178,338,655,555,"Mixed urban/rural",338769,398846,{"$error":"#N/A"},"N06000005","East Antrim",{"$f":"LOOKUP(OFFSET($D635,0,$B$12),{0,179,357,535,713;1,2,3,4,5})","v":4},{"$f":"LOOKUP(OFFSET($D635,0,$B$12),{0,90,179,268,357,446,535,624,713,802;1,2,3,4,5,6,7,8,9,10})","v":7},344,515,775,361,1995,"Northern Ireland",1995,null,null,null,null,null,null,null,"Mallusk_1"]
["95QQ12W1","Harbour","N09000008","Mid and East Antrim",532,276,519,412,381,176,375,441,"Urban",340994,402888,{"$error":"#N/A"},"N06000005","East Antrim",{"$f":"LOOKUP(OFFSET($D636,0,$B$12),{0,179,357,535,713;1,2,3,4,5})","v":3},{"$f":"LOOKUP(OFFSET($D636,0,$B$12),{0,90,179,268,357,446,535,624,713,802;1,2,3,4,5,6,7,8,9,10})","v":5},282,507,618,442,1850,"Northern Ireland",1850,null,null,null,null,null,null,null,"Mallusk_2"]
["95QQ13W1","Island Magee","N09000008","Mid and East Antrim",614,617,763,461,69,51,773,514,"Rural",346614,397352,{"$error":"#N/A"},"N06000005","East Antrim",{"$f":"LOOKUP(OFFSET($D637,0,$B$12),{0,179,357,535,713;1,2,3,4,5})","v":3},{"$f":"LOOKUP(OFFSET($D637,0,$B$12),{0,90,179,268,357,446,535,624,713,802;1,2,3,4,5,6,7,8,9,10})","v":6},440,656,957,511,2564,"Northern Ireland",2564,null,null,null,null,null,null,null,"Mallusk_3"]
["95QQ14S1","Kilwaughter_1","N09000008","Mid and East Antrim",707,752,641,545,313,758,485,728,"Urban",338220,402653,{"$error":"#N/A"},"N06000005","East Antrim",{"$f":"LOOKUP(OFFSET($D638,0,$B$12),{0,179,357,535,713;1,2,3,4,5})","v":5},{"$f":"LOOKUP(OFFSET($D638,0,$B$12),{0,90,179,268,357,446,535,624,713,802;1,2,3,4,5,6,7,8,9,10})","v":9},1004,1504,1276,260,4043,"Northern Ireland",4043,null,null,null,null,null,null,null,"Malone_1"]
["95QQ14S2","Kilwaughter_2","N09000008","Mid and East Antrim",488,669,773,663,99,126,646,568,"Mixed urban/rural",333848,397987,{"$error":"#N/A"},"N06000005","East Antrim",{"$f":"LOOKUP(OFFSET($D639,0,$B$12),{0,179,357,535,713;1,2,3,4,5})","v":4},{"$f":"LOOKUP(OFFSET($D639,0,$B$12),{0,90,179,268,357,446,535,624,713,802;1,2,3,4,5,6,7,8,9,10})","v":7},322,422,659,346,1749,"Northern Ireland",1749,null,null,null,null,null,null,null,"Malone_2"]
["95QQ15W1","Town Parks","N09000008","Mid and East Antrim",206,326,312,307,720,80,430,292,"Urban",340268,403259,{"$error":"#N/A"},"N06000005","East Antrim",{"$f":"LOOKUP(OFFSET($D640,0,$B$12),{0,179,357,535,713;1,2,3,4,5})","v":2},{"$f":"LOOKUP(OFFSET($D640,0,$B$12),{0,90,179,268,357,446,535,624,713,802;1,2,3,4,5,6,7,8,9,10})","v":4},237,409,513,336,1495,"Northern Ireland",1495,null,null,null,null,null,null,null,"Malone_3"]
["95RR01S1","Aghanloo_1","N09000004","Causeway Coast and Glens",184,400,434,598,357,890,638,414,"Urban",268799,422314,{"$error":"#N/A"},"N06000006","East Londonderry",{"$f":"LOOKUP(OFFSET($D641,0,$B$12),{0,179,357,535,713;1,2,3,4,5})","v":3},{"$f":"LOOKUP(OFFSET($D641,0,$B$12),{0,90,179,268,357,446,535,624,713,802;1,2,3,4,5,6,7,8,9,10})","v":5},640,807,855,247,2549,"Northern Ireland",2549,null,null,null,null,null,null,null,"Markethill"]
["95RR01S2","Aghanloo_2","N09000004","Causeway Coast and Glens",498,544,683,544,77,123,614,493,"Mixed urban/rural",269861,424595,{"$error":"#N/A"},"N06000006","East Londonderry",{"$f":"LOOKUP(OFFSET($D642,0,$B$12),{0,179,357,535,713;1,2,3,4,5})","v":3},{"$f":"LOOKUP(OFFSET($D642,0,$B$12),{0,90,179,268,357,446,535,624,713,802;1,2,3,4,5,6,7,8,9,10})","v":6},416,562,713,273,1964,"Northern Ireland",1964,null,null,null,null,null,null,null,"Massereene_1"]
["95RR02W1","Ballykelly","N09000004","Causeway Coast and Glens",259,205,373,338,234,227,280,251,"Rural",263597,422187,{"$error":"#N/A"},"N06000006","East Londonderry",{"$f":"LOOKUP(OFFSET($D643,0,$B$12),{0,179,357,535,713;1,2,3,4,5})","v":2},{"$f":"LOOKUP(OFFSET($D643,0,$B$12),{0,90,179,268,357,446,535,624,713,802;1,2,3,4,5,6,7,8,9,10})","v":3},325,529,608,330,1792,"Northern Ireland",1792,null,null,null,null,null,null,null,"Massereene_2"]
["95RR03W1","Coolessan","N09000004","Causeway Coast and Glens",60,23,48,67,503,381,20,34,"Urban",267192,422009,{"$error":"#N/A"},"N06000006","East Londonderry",{"$f":"LOOKUP(OFFSET($D644,0,$B$12),{0,179,357,535,713;1,2,3,4,5})","v":1},{"$f":"LOOKUP(OFFSET($D644,0,$B$12),{0,90,179,268,357,446,535,624,713,802;1,2,3,4,5,6,7,8,9,10})","v":1},291,447,454,200,1392,"Northern Ireland",1392,null,null,null,null,null,null,null,"Mayobridge_1"]
["95RR04W1","Dungiven","N09000004","Causeway Coast and Glens",39,151,241,455,483,661,450,145,"Rural",269172,409624,{"$error":"#N/A"},"N06000006","East Londonderry",{"$f":"LOOKUP(OFFSET($D645,0,$B$12),{0,179,357,535,713;1,2,3,4,5})","v":1},{"$f":"LOOKUP(OFFSET($D645,0,$B$12),{0,90,179,268,357,446,535,624,713,802;1,2,3,4,5,6,7,8,9,10})","v":2},444,701,633,268,2047,"Northern Ireland",2047,null,null,null,null,null,null,null,"Mayobridge_2"]
["95RR05S1","Enagh_1_Limavady","N09000004","Causeway Coast and Glens",681,384,429,710,375,754,480,610,"Urban",268286,421914,{"$error":"#N/A"},"N06000006","East Londonderry",{"$f":"LOOKUP(OFFSET($D646,0,$B$12),{0,179,357,535,713;1,2,3,4,5})","v":4},{"$f":"LOOKUP(OFFSET($D646,0,$B$12),{0,90,179,268,357,446,535,624,713,802;1,2,3,4,5,6,7,8,9,10})","v":7},223,347,480,203,1254,"Northern Ireland",1254,null,null,null,null,null,null,null,"Maze_1"]
["95RR05S2","Enagh_2_Limavady","N09000004","Causeway Coast and Glens",189,97,120,173,518,649,47,127,"Urban",268201,422285,{"$error":"#N/A"},"N06000006","East Londonderry",{"$f":"LOOKUP(OFFSET($D647,0,$B$12),{0,179,357,535,713;1,2,3,4,5})","v":1},{"$f":"LOOKUP(OFFSET($D647,0,$B$12),{0,90,179,268,357,446,535,624,713,802;1,2,3,4,5,6,7,8,9,10})","v":2},283,356,396,192,1227,"Northern Ireland",1227,null,null,null,null,null,null,null,"Maze_2"]
["95RR06W1","Feeny","N09000004","Causeway Coast and Glens",53,366,414,389,186,388,684,203,"Rural",262606,407205,{"$error":"#N/A"},"N06000006","East Londonderry",{"$f":"LOOKUP(OFFSET($D648,0,$B$12),{0,179,357,535,713;1,2,3,4,5})","v":2},{"$f":"LOOKUP(OFFSET($D648,0,$B$12),{0,90,179,268,357,446,535,624,713,802;1,2,3,4,5,6,7,8,9,10})","v":3},491,799,712,304,2306,"Northern Ireland",2306,null,null,null,null,null,null,null,"Milebush"]
["95RR07W1","Forest","N09000004","Causeway Coast and Glens",323,444,492,492,194,399,686,446,"Mixed urban/rural",270025,419494,{"$error":"#N/A"},"N06000006","East Londonderry",{"$f":"LOOKUP(OFFSET($D649,0,$B$12),{0,179,357,535,713;1,2,3,4,5})","v":3},{"$f":"LOOKUP(OFFSET($D649,0,$B$12),{0,90,179,268,357,446,535,624,713,802;1,2,3,4,5,6,7,8,9,10})","v":6},513,759,856,354,2482,"Northern Ireland",2482,null,null,null,null,null,null,null,"Milford"]
["95RR08W1","Glack","N09000004","Causeway Coast and Glens",352,420,539,653,12,525,776,365,"Rural",261353,418885,{"$error":"#N/A"},"N06000006","East Londonderry",{"$f":"LOOKUP(OFFSET($D650,0,$B$12),{0,179,357,535,713;1,2,3,4,5})","v":3},{"$f":"LOOKUP(OFFSET($D650,0,$B$12),{0,90,179,268,357,446,535,624,713,802;1,2,3,4,5,6,7,8,9,10})","v":5},446,565,814,324,2149,"Northern Ireland",2149,null,null,null,null,null,null,null,"Millisle_1"]
["95RR09S1","Gresteel_1","N09000004","Causeway Coast and Glens",256,228,268,493,188,592,573,290,"Rural",256431,420657,{"$error":"#N/A"},"N06000006","East Londonderry",{"$f":"LOOKUP(OFFSET($D651,0,$B$12),{0,179,357,535,713;1,2,3,4,5})","v":2},{"$f":"LOOKUP(OFFSET($D651,0,$B$12),{0,90,179,268,357,446,535,624,713,802;1,2,3,4,5,6,7,8,9,10})","v":4},473,670,720,280,2143,"Northern Ireland",2143,null,null,null,null,null,null,null,"Millisle_2"]
["95RR09S2","Gresteel_2","N09000004","Causeway Coast and Glens",140,403,381,273,259,287,434,265,"Rural",261837,422127,{"$error":"#N/A"},"N06000006","East Londonderry",{"$f":"LOOKUP(OFFSET($D652,0,$B$12),{0,179,357,535,713;1,2,3,4,5})","v":2},{"$f":"LOOKUP(OFFSET($D652,0,$B$12),{0,90,179,268,357,446,535,624,713,802;1,2,3,4,5,6,7,8,9,10})","v":3},505,847,481,79,1911,"Northern Ireland",1911,null,null,null,null,null,null,null,"Minnowburn"]
["95RR10W1","Greystone_Limavady","N09000004","Causeway Coast and Glens",33,5,51,42,599,296,12,11,"Urban",267610,422111,{"$error":"#N/A"},"N06000006","East Londonderry",{"$f":"LOOKUP(OFFSET($D653,0,$B$12),{0,179,357,535,713;1,2,3,4,5})","v":1},{"$f":"LOOKUP(OFFSET($D653,0,$B$12),{0,90,179,268,357,446,535,624,713,802;1,2,3,4,5,6,7,8,9,10})","v":1},250,381,404,228,1263,"Northern Ireland",1263,null,null,null,null,null,null,null,"Moat"]
["95RR11W1","Magilligan","N09000004","Causeway Coast and Glens",598,638,489,613,25,274,587,491,"Rural",266920,431721,{"$error":"#N/A"},"N06000006","East Londonderry",{"$f":"LOOKUP(OFFSET($D654,0,$B$12),{0,179,357,535,713;1,2,3,4,5})","v":3},{"$f":"LOOKUP(OFFSET($D654,0,$B$12),{0,90,179,268,357,446,535,624,713,802;1,2,3,4,5,6,7,8,9,10})","v":6},344,695,839,609,2487,"Northern Ireland",2487,null,null,null,null,null,null,null,"Moira_1"]
["95RR12W1","Rathbrady","N09000004","Causeway Coast and Glens",380,261,396,376,529,156,169,348,"Urban",268121,423095,{"$error":"#N/A"},"N06000006","East Londonderry",{"$f":"LOOKUP(OFFSET($D655,0,$B$12),{0,179,357,535,713;1,2,3,4,5})","v":2},{"$f":"LOOKUP(OFFSET($D655,0,$B$12),{0,90,179,268,357,446,535,624,713,802;1,2,3,4,5,6,7,8,9,10})","v":4},216,341,516,368,1441,"Northern Ireland",1441,null,null,null,null,null,null,null,"Moira_2"]
["95RR13W1","Roeside","N09000004","Causeway Coast and Glens",347,94,214,277,775,101,81,191,"Urban",267326,423104,{"$error":"#N/A"},"N06000006","East Londonderry",{"$f":"LOOKUP(OFFSET($D656,0,$B$12),{0,179,357,535,713;1,2,3,4,5})","v":2},{"$f":"LOOKUP(OFFSET($D656,0,$B$12),{0,90,179,268,357,446,535,624,713,802;1,2,3,4,5,6,7,8,9,10})","v":3},222,370,492,369,1454,"Northern Ireland",1454,null,null,null,null,null,null,null,"Moneymore"]
["95RR14W1","The Highlands","N09000004","Causeway Coast and Glens",57,310,471,511,63,603,804,194,"Rural",267387,413578,{"$error":"#N/A"},"N06000006","East Londonderry",{"$f":"LOOKUP(OFFSET($D657,0,$B$12),{0,179,357,535,713;1,2,3,4,5})","v":2},{"$f":"LOOKUP(OFFSET($D657,0,$B$12),{0,90,179,268,357,446,535,624,713,802;1,2,3,4,5,6,7,8,9,10})","v":3},506,624,657,274,2061,"Northern Ireland",2061,null,null,null,null,null,null,null,"Moneyreagh_1"]
["95RR15W1","Upper Glenshane","N09000004","Causeway Coast and Glens",381,356,447,497,160,555,828,440,"Rural",270645,409262,{"$error":"#N/A"},"N06000006","East Londonderry",{"$f":"LOOKUP(OFFSET($D658,0,$B$12),{0,179,357,535,713;1,2,3,4,5})","v":3},{"$f":"LOOKUP(OFFSET($D658,0,$B$12),{0,90,179,268,357,446,535,624,713,802;1,2,3,4,5,6,7,8,9,10})","v":5},661,871,752,281,2565,"Northern Ireland",2565,null,null,null,null,null,null,null,"Moneyreagh_2"]
["95SS01S1","Ballinderry_1","N09000007","Lisburn and Castlereagh",746,852,725,746,45,294,852,673,"Rural",318177,366623,{"$error":"#N/A"},"N06000009","Lagan Valley",{"$f":"LOOKUP(OFFSET($D659,0,$B$12),{0,179,357,535,713;1,2,3,4,5})","v":4},{"$f":"LOOKUP(OFFSET($D659,0,$B$12),{0,90,179,268,357,446,535,624,713,802;1,2,3,4,5,6,7,8,9,10})","v":8},348,657,911,409,2326,"Northern Ireland",2326,null,null,null,null,null,null,null,"Monkstown_1"]
["95SS01S2","Ballinderry_2","N09000007","Lisburn and Castlereagh",628,697,717,612,182,662,761,695,"Rural",313252,366541,{"$error":"#N/A"},"N06000009","Lagan Valley",{"$f":"LOOKUP(OFFSET($D660,0,$B$12),{0,179,357,535,713;1,2,3,4,5})","v":4},{"$f":"LOOKUP(OFFSET($D660,0,$B$12),{0,90,179,268,357,446,535,624,713,802;1,2,3,4,5,6,7,8,9,10})","v":8},671,847,1086,331,2934,"Northern Ireland",2934,null,null,null,null,null,null,null,"Monkstown_2"]
["95SS02S1","Ballymacash_1","N09000007","Lisburn and Castlereagh",724,685,709,424,557,72,346,655,"Urban",325262,365701,{"$error":"#N/A"},"N06000009","Lagan Valley",{"$f":"LOOKUP(OFFSET($D661,0,$B$12),{0,179,357,535,713;1,2,3,4,5})","v":4},{"$f":"LOOKUP(OFFSET($D661,0,$B$12),{0,90,179,268,357,446,535,624,713,802;1,2,3,4,5,6,7,8,9,10})","v":8},460,594,660,491,2204,"Northern Ireland",2204,null,null,null,null,null,null,null,"Mossley_1"]
["95SS02S2","Ballymacash_2","N09000007","Lisburn and Castlereagh",849,874,873,865,359,164,873,844,"Urban",325545,366186,{"$error":"#N/A"},"N06000009","Lagan Valley",{"$f":"LOOKUP(OFFSET($D662,0,$B$12),{0,179,357,535,713;1,2,3,4,5})","v":5},{"$f":"LOOKUP(OFFSET($D662,0,$B$12),{0,90,179,268,357,446,535,624,713,802;1,2,3,4,5,6,7,8,9,10})","v":10},415,619,858,346,2238,"Northern Ireland",2238,null,null,null,null,null,null,null,"Mossley_2"]
["95SS03S1","Ballymacbrennan_1","N09000007","Lisburn and Castlereagh",676,866,864,859,86,145,888,700,"Rural",330241,357944,{"$error":"#N/A"},"N06000009","Lagan Valley",{"$f":"LOOKUP(OFFSET($D663,0,$B$12),{0,179,357,535,713;1,2,3,4,5})","v":4},{"$f":"LOOKUP(OFFSET($D663,0,$B$12),{0,90,179,268,357,446,535,624,713,802;1,2,3,4,5,6,7,8,9,10})","v":8},275,392,588,351,1606,"Northern Ireland",1606,null,null,null,null,null,null,null,"Mount Sandel"]
["95SS03S2","Ballymacbrennan_2","N09000007","Lisburn and Castlereagh",722,850,868,864,56,52,837,659,"Rural",333364,360506,{"$error":"#N/A"},"N06000009","Lagan Valley",{"$f":"LOOKUP(OFFSET($D664,0,$B$12),{0,179,357,535,713;1,2,3,4,5})","v":4},{"$f":"LOOKUP(OFFSET($D664,0,$B$12),{0,90,179,268,357,446,535,624,713,802;1,2,3,4,5,6,7,8,9,10})","v":8},353,456,672,418,1898,"Northern Ireland",1898,null,null,null,null,null,null,null,"Mourneview"]
["95SS04S1","Ballymacoss_1","N09000007","Lisburn and Castlereagh",475,284,197,286,437,879,330,361,"Urban",324378,365285,{"$error":"#N/A"},"N06000009","Lagan Valley",{"$f":"LOOKUP(OFFSET($D665,0,$B$12),{0,179,357,535,713;1,2,3,4,5})","v":3},{"$f":"LOOKUP(OFFSET($D665,0,$B$12),{0,90,179,268,357,446,535,624,713,802;1,2,3,4,5,6,7,8,9,10})","v":5},632,796,855,247,2531,"Northern Ireland",2531,null,null,null,null,null,null,null,"Movilla_1"]
["95SS04S2","Ballymacoss_2","N09000007","Lisburn and Castlereagh",557,503,410,264,443,667,536,535,"Urban",324583,365935,{"$error":"#N/A"},"N06000009","Lagan Valley",{"$f":"LOOKUP(OFFSET($D666,0,$B$12),{0,179,357,535,713;1,2,3,4,5})","v":4},{"$f":"LOOKUP(OFFSET($D666,0,$B$12),{0,90,179,268,357,446,535,624,713,802;1,2,3,4,5,6,7,8,9,10})","v":7},627,1030,619,229,2505,"Northern Ireland",2505,null,null,null,null,null,null,null,"Movilla_2"]
["95SS04S3","Ballymacoss_3","N09000007","Lisburn and Castlereagh",685,771,706,574,252,521,677,723,"Mixed urban/rural",324291,366252,{"$error":"#N/A"},"N06000009","Lagan Valley",{"$f":"LOOKUP(OFFSET($D667,0,$B$12),{0,179,357,535,713;1,2,3,4,5})","v":5},{"$f":"LOOKUP(OFFSET($D667,0,$B$12),{0,90,179,268,357,446,535,624,713,802;1,2,3,4,5,6,7,8,9,10})","v":9},949,1588,1260,323,4120,"Northern Ireland",4120,null,null,null,null,null,null,null,"Movilla_3"]
["95SS05S1","Blaris_1","N09000007","Lisburn and Castlereagh",556,394,509,263,834,334,216,509,"Urban",327275,363754,{"$error":"#N/A"},"N06000009","Lagan Valley",{"$f":"LOOKUP(OFFSET($D668,0,$B$12),{0,179,357,535,713;1,2,3,4,5})","v":3},{"$f":"LOOKUP(OFFSET($D668,0,$B$12),{0,90,179,268,357,446,535,624,713,802;1,2,3,4,5,6,7,8,9,10})","v":6},244,462,496,335,1538,"Northern Ireland",1538,null,null,null,null,null,null,null,"Moy"]
["95SS05S2","Blaris_2","N09000007","Lisburn and Castlereagh",806,858,824,843,295,659,514,837,"Mixed urban/rural",326779,362769,{"$error":"#N/A"},"N06000009","Lagan Valley",{"$f":"LOOKUP(OFFSET($D669,0,$B$12),{0,179,357,535,713;1,2,3,4,5})","v":5},{"$f":"LOOKUP(OFFSET($D669,0,$B$12),{0,90,179,268,357,446,535,624,713,802;1,2,3,4,5,6,7,8,9,10})","v":10},297,504,667,383,1851,"Northern Ireland",1851,null,null,null,null,null,null,null,"Moygashel"]
["95SS06S1","Collin Glen_1","N09000003","Belfast",378,48,38,50,278,30,165,63,"Mixed urban/rural",326795,370274,{"$error":"#N/A"},"N06000004","Belfast West",{"$f":"LOOKUP(OFFSET($D670,0,$B$12),{0,179,357,535,713;1,2,3,4,5})","v":1},{"$f":"LOOKUP(OFFSET($D670,0,$B$12),{0,90,179,268,357,446,535,624,713,802;1,2,3,4,5,6,7,8,9,10})","v":1},432,602,473,95,1602,"Northern Ireland",1602,null,null,null,null,null,null,null,"Mullaghmore"]
["95SS06S2","Collin Glen_2","N09000003","Belfast",135,11,2,30,592,98,134,20,"Urban",327325,369382,{"$error":"#N/A"},"N06000004","Belfast West",{"$f":"LOOKUP(OFFSET($D671,0,$B$12),{0,179,357,535,713;1,2,3,4,5})","v":1},{"$f":"LOOKUP(OFFSET($D671,0,$B$12),{0,90,179,268,357,446,535,624,713,802;1,2,3,4,5,6,7,8,9,10})","v":1},755,851,556,86,2249,"Northern Ireland",2249,null,null,null,null,null,null,null,"Murlough"]
["95SS06S3","Collin Glen_3","N09000003","Belfast",120,35,16,11,765,28,45,26,"Urban",327674,369797,{"$error":"#N/A"},"N06000004","Belfast West",{"$f":"LOOKUP(OFFSET($D672,0,$B$12),{0,179,357,535,713;1,2,3,4,5})","v":1},{"$f":"LOOKUP(OFFSET($D672,0,$B$12),{0,90,179,268,357,446,535,624,713,802;1,2,3,4,5,6,7,8,9,10})","v":1},585,688,493,121,1888,"Northern Ireland",1888,null,null,null,null,null,null,null,"Musgrave_1"]
["95SS07S1","Derryaghy_1","N09000003","Belfast",639,477,299,261,306,721,378,487,"Urban",326573,368944,{"$error":"#N/A"},"N06000004","Belfast West",{"$f":"LOOKUP(OFFSET($D673,0,$B$12),{0,179,357,535,713;1,2,3,4,5})","v":3},{"$f":"LOOKUP(OFFSET($D673,0,$B$12),{0,90,179,268,357,446,535,624,713,802;1,2,3,4,5,6,7,8,9,10})","v":6},1488,1999,1075,95,4657,"Northern Ireland",4657,null,null,null,null,null,null,null,"Musgrave_2"]
["95SS07S2","Derryaghy_2","N09000003","Belfast",539,443,367,434,634,523,474,554,"Urban",327358,368869,{"$f":"IF(B674=$F$27,O674,NA())","v":{"$error":"#N/A"}},"N06000004","Belfast West",{"$f":"LOOKUP(OFFSET($D674,0,$B$12),{0,179,357,535,713;1,2,3,4,5})","v":4},{"$f":"LOOKUP(OFFSET($D674,0,$B$12),{0,90,179,268,357,446,535,624,713,802;1,2,3,4,5,6,7,8,9,10})","v":7},459,611,520,55,1646,"Northern Ireland",{"$f":"CHOOSE($K$5,$Y674,IF($D674=$B$27,$Y674,\"\"),IF($R674=$B$27,$Y674,\"\"))","v":1646},null,null,null,null,null,null,null,"Musgrave_3"]
["95SS07S3","Derryaghy_3","N09000007","Lisburn and Castlereagh",578,450,450,397,426,817,431,567,"Mixed urban/rural",327667,367683,{"$error":"#N/A"},"N06000009","Lagan Valley",{"$f":"LOOKUP(OFFSET($D675,0,$B$12),{0,179,357,535,713;1,2,3,4,5})","v":4},{"$f":"LOOKUP(OFFSET($D675,0,$B$12),{0,90,179,268,357,446,535,624,713,802;1,2,3,4,5,6,7,8,9,10})","v":7},914,1280,1337,751,4282,"Northern Ireland",4282,null,null,null,null,null,null,null,"New Buildings_1"]
["95SS08S1","Dromara_1","N09000007","Lisburn and Castlereagh",704,793,790,861,190,379,881,769,"Rural",329535,355579,{"$error":"#N/A"},"N06000009","Lagan Valley",{"$f":"LOOKUP(OFFSET($D676,0,$B$12),{0,179,357,535,713;1,2,3,4,5})","v":5},{"$f":"LOOKUP(OFFSET($D676,0,$B$12),{0,90,179,268,357,446,535,624,713,802;1,2,3,4,5,6,7,8,9,10})","v":9},364,413,785,345,1907,"Northern Ireland",1907,null,null,null,null,null,null,null,"New Buildings_2"]
["95SS08S2","Dromara_2","N09000007","Lisburn and Castlereagh",653,711,658,693,169,246,747,675,"Rural",328972,351263,{"$error":"#N/A"},"N06000009","Lagan Valley",{"$f":"LOOKUP(OFFSET($D677,0,$B$12),{0,179,357,535,713;1,2,3,4,5})","v":4},{"$f":"LOOKUP(OFFSET($D677,0,$B$12),{0,90,179,268,357,446,535,624,713,802;1,2,3,4,5,6,7,8,9,10})","v":8},629,726,941,437,2733,"Northern Ireland",2733,null,null,null,null,null,null,null,"New Lodge_1"]
["95SS09S1","Drumbo_1","N09000007","Lisburn and Castlereagh",769,884,884,885,242,53,662,764,"Rural",330799,366620,{"$error":"#N/A"},"N06000009","Lagan Valley",{"$f":"LOOKUP(OFFSET($D678,0,$B$12),{0,179,357,535,713;1,2,3,4,5})","v":5},{"$f":"LOOKUP(OFFSET($D678,0,$B$12),{0,90,179,268,357,446,535,624,713,802;1,2,3,4,5,6,7,8,9,10})","v":9},318,482,624,355,1780,"Northern Ireland",1780,null,null,null,null,null,null,null,"New Lodge_2"]
["95SS09S2","Drumbo_2","N09000007","Lisburn and Castlereagh",648,800,862,823,164,239,422,709,"Rural",333205,365075,{"$error":"#N/A"},"N06000009","Lagan Valley",{"$f":"LOOKUP(OFFSET($D679,0,$B$12),{0,179,357,535,713;1,2,3,4,5})","v":4},{"$f":"LOOKUP(OFFSET($D679,0,$B$12),{0,90,179,268,357,446,535,624,713,802;1,2,3,4,5,6,7,8,9,10})","v":8},328,413,595,353,1689,"Northern Ireland",1689,null,null,null,null,null,null,null,"New Lodge_3"]
["95SS10S1","Dunmurry_1","N09000003","Belfast",461,460,530,641,795,342,129,572,"Urban",328980,368937,{"$error":"#N/A"},"N06000004","Belfast West",{"$f":"LOOKUP(OFFSET($D680,0,$B$12),{0,179,357,535,713;1,2,3,4,5})","v":4},{"$f":"LOOKUP(OFFSET($D680,0,$B$12),{0,90,179,268,357,446,535,624,713,802;1,2,3,4,5,6,7,8,9,10})","v":7},423,762,688,352,2225,"Northern Ireland",2225,null,null,null,null,null,null,null,"Newbuildings"]
["95SS10S2","Dunmurry_2","N09000003","Belfast",831,782,762,841,640,252,417,831,"Urban",329312,369701,{"$error":"#N/A"},"N06000004","Belfast West",{"$f":"LOOKUP(OFFSET($D681,0,$B$12),{0,179,357,535,713;1,2,3,4,5})","v":5},{"$f":"LOOKUP(OFFSET($D681,0,$B$12),{0,90,179,268,357,446,535,624,713,802;1,2,3,4,5,6,7,8,9,10})","v":10},369,759,843,247,2218,"Northern Ireland",2218,null,null,null,null,null,null,null,"Newhill"]
["95SS11S1","Glenavy_1","N09000007","Lisburn and Castlereagh",723,715,553,649,225,793,483,703,"Rural",315087,372596,{"$error":"#N/A"},"N06000014","South Antrim",{"$f":"LOOKUP(OFFSET($D682,0,$B$12),{0,179,357,535,713;1,2,3,4,5})","v":4},{"$f":"LOOKUP(OFFSET($D682,0,$B$12),{0,90,179,268,357,446,535,624,713,802;1,2,3,4,5,6,7,8,9,10})","v":8},839,981,1081,316,3218,"Northern Ireland",3218,null,null,null,null,null,null,null,"Newtownbreda"]
["95SS11S2","Glenavy_2","N09000007","Lisburn and Castlereagh",675,738,755,652,87,265,575,645,"Rural",319943,371660,{"$error":"#N/A"},"N06000014","South Antrim",{"$f":"LOOKUP(OFFSET($D683,0,$B$12),{0,179,357,535,713;1,2,3,4,5})","v":4},{"$f":"LOOKUP(OFFSET($D683,0,$B$12),{0,90,179,268,357,446,535,624,713,802;1,2,3,4,5,6,7,8,9,10})","v":8},663,854,966,375,2859,"Northern Ireland",2859,null,null,null,null,null,null,null,"Newtownbutler"]
["95SS12W1","Harmony Hill","N09000007","Lisburn and Castlereagh",837,744,738,786,724,439,546,852,"Urban",327278,365837,{"$error":"#N/A"},"N06000009","Lagan Valley",{"$f":"LOOKUP(OFFSET($D684,0,$B$12),{0,179,357,535,713;1,2,3,4,5})","v":5},{"$f":"LOOKUP(OFFSET($D684,0,$B$12),{0,90,179,268,357,446,535,624,713,802;1,2,3,4,5,6,7,8,9,10})","v":10},495,726,1006,736,2964,"Northern Ireland",2964,null,null,null,null,null,null,null,"Newtownhamilton"]
["95SS13S1","Hilden_1","N09000007","Lisburn and Castlereagh",164,296,313,119,754,49,99,190,"Urban",327002,364213,{"$error":"#N/A"},"N06000009","Lagan Valley",{"$f":"LOOKUP(OFFSET($D685,0,$B$12),{0,179,357,535,713;1,2,3,4,5})","v":2},{"$f":"LOOKUP(OFFSET($D685,0,$B$12),{0,90,179,268,357,446,535,624,713,802;1,2,3,4,5,6,7,8,9,10})","v":3},294,531,502,258,1584,"Northern Ireland",1584,null,null,null,null,null,null,null,"Newtownsaville"]
["95SS13S2","Hilden_2","N09000007","Lisburn and Castlereagh",92,289,296,181,817,310,310,202,"Urban",327756,364885,{"$error":"#N/A"},"N06000009","Lagan Valley",{"$f":"LOOKUP(OFFSET($D686,0,$B$12),{0,179,357,535,713;1,2,3,4,5})","v":2},{"$f":"LOOKUP(OFFSET($D686,0,$B$12),{0,90,179,268,357,446,535,624,713,802;1,2,3,4,5,6,7,8,9,10})","v":3},243,431,444,225,1342,"Northern Ireland",1342,null,null,null,null,null,null,null,"Newtownstewart"]
["95SS14S1","Hillhall_1","N09000007","Lisburn and Castlereagh",550,183,195,122,681,371,427,277,"Urban",327672,364198,{"$error":"#N/A"},"N06000009","Lagan Valley",{"$f":"LOOKUP(OFFSET($D687,0,$B$12),{0,179,357,535,713;1,2,3,4,5})","v":2},{"$f":"LOOKUP(OFFSET($D687,0,$B$12),{0,90,179,268,357,446,535,624,713,802;1,2,3,4,5,6,7,8,9,10})","v":4},281,437,465,275,1458,"Northern Ireland",1458,null,null,null,null,null,null,null,"North"]
["95SS14S2","Hillhall_2","N09000007","Lisburn and Castlereagh",480,736,736,637,264,635,729,690,"Mixed urban/rural",328351,364109,{"$error":"#N/A"},"N06000009","Lagan Valley",{"$f":"LOOKUP(OFFSET($D688,0,$B$12),{0,179,357,535,713;1,2,3,4,5})","v":4},{"$f":"LOOKUP(OFFSET($D688,0,$B$12),{0,90,179,268,357,446,535,624,713,802;1,2,3,4,5,6,7,8,9,10})","v":8},402,528,523,311,1763,"Northern Ireland",1763,null,null,null,null,null,null,null,"Northland"]
["95SS15S1","Hillsborough_1","N09000007","Lisburn and Castlereagh",695,834,840,852,485,712,793,862,"Rural",325008,359126,{"$error":"#N/A"},"N06000009","Lagan Valley",{"$f":"LOOKUP(OFFSET($D689,0,$B$12),{0,179,357,535,713;1,2,3,4,5})","v":5},{"$f":"LOOKUP(OFFSET($D689,0,$B$12),{0,90,179,268,357,446,535,624,713,802;1,2,3,4,5,6,7,8,9,10})","v":10},304,426,702,412,1843,"Northern Ireland",1843,null,null,null,null,null,null,null,"Oaklands"]
["95SS15S2","Hillsborough_2","N09000007","Lisburn and Castlereagh",793,862,867,884,226,315,717,812,"Rural",323820,358017,{"$error":"#N/A"},"N06000009","Lagan Valley",{"$f":"LOOKUP(OFFSET($D690,0,$B$12),{0,179,357,535,713;1,2,3,4,5})","v":5},{"$f":"LOOKUP(OFFSET($D690,0,$B$12),{0,90,179,268,357,446,535,624,713,802;1,2,3,4,5,6,7,8,9,10})","v":10},406,436,743,530,2115,"Northern Ireland",2115,null,null,null,null,null,null,null,"Observatory"]
["95SS16S1","Kilwee_1","N09000003","Belfast",773,344,239,603,718,309,461,553,"Urban",328412,369965,{"$error":"#N/A"},"N06000004","Belfast West",{"$f":"LOOKUP(OFFSET($D691,0,$B$12),{0,179,357,535,713;1,2,3,4,5})","v":4},{"$f":"LOOKUP(OFFSET($D691,0,$B$12),{0,90,179,268,357,446,535,624,713,802;1,2,3,4,5,6,7,8,9,10})","v":7},262,491,541,283,1576,"Northern Ireland",1576,null,null,null,null,null,null,null,"Old Warren"]
["95SS16S2","Kilwee_2","N09000003","Belfast",511,53,40,125,756,102,67,107,"Urban",328190,369472,{"$error":"#N/A"},"N06000004","Belfast West",{"$f":"LOOKUP(OFFSET($D692,0,$B$12),{0,179,357,535,713;1,2,3,4,5})","v":1},{"$f":"LOOKUP(OFFSET($D692,0,$B$12),{0,90,179,268,357,446,535,624,713,802;1,2,3,4,5,6,7,8,9,10})","v":2},344,504,525,236,1608,"Northern Ireland",1608,null,null,null,null,null,null,null,"Oldtown"]
["95SS17S1","Knockmore_1","N09000007","Lisburn and Castlereagh",594,554,510,284,403,705,451,576,"Urban",324421,364232,{"$error":"#N/A"},"N06000009","Lagan Valley",{"$f":"LOOKUP(OFFSET($D693,0,$B$12),{0,179,357,535,713;1,2,3,4,5})","v":4},{"$f":"LOOKUP(OFFSET($D693,0,$B$12),{0,90,179,268,357,446,535,624,713,802;1,2,3,4,5,6,7,8,9,10})","v":7},690,1113,858,449,3110,"Northern Ireland",3110,null,null,null,null,null,null,null,"Orangefield_1"]
["95SS17S2","Knockmore_2","N09000007","Lisburn and Castlereagh",506,346,237,185,408,331,297,346,"Urban",324917,364790,{"$error":"#N/A"},"N06000009","Lagan Valley",{"$f":"LOOKUP(OFFSET($D694,0,$B$12),{0,179,357,535,713;1,2,3,4,5})","v":2},{"$f":"LOOKUP(OFFSET($D694,0,$B$12),{0,90,179,268,357,446,535,624,713,802;1,2,3,4,5,6,7,8,9,10})","v":4},264,485,477,251,1477,"Northern Ireland",1477,null,null,null,null,null,null,null,"Orangefield_2"]
["95SS18S1","Lagan Valley_1","N09000007","Lisburn and Castlereagh",278,230,218,137,540,627,436,246,"Urban",325967,363102,{"$error":"#N/A"},"N06000009","Lagan Valley",{"$f":"LOOKUP(OFFSET($D695,0,$B$12),{0,179,357,535,713;1,2,3,4,5})","v":2},{"$f":"LOOKUP(OFFSET($D695,0,$B$12),{0,90,179,268,357,446,535,624,713,802;1,2,3,4,5,6,7,8,9,10})","v":3},310,483,401,220,1415,"Northern Ireland",1415,null,null,null,null,null,null,null,"Orangefield_3"]
["95SS18S2","Lagan Valley_2","N09000007","Lisburn and Castlereagh",382,254,292,534,778,448,78,380,"Urban",326262,363573,{"$error":"#N/A"},"N06000009","Lagan Valley",{"$f":"LOOKUP(OFFSET($D696,0,$B$12),{0,179,357,535,713;1,2,3,4,5})","v":3},{"$f":"LOOKUP(OFFSET($D696,0,$B$12),{0,90,179,268,357,446,535,624,713,802;1,2,3,4,5,6,7,8,9,10})","v":5},288,423,454,487,1653,"Northern Ireland",1653,null,null,null,null,null,null,null,"Owenkillew"]
["95SS19S1","Lambeg_1","N09000007","Lisburn and Castlereagh",608,604,548,357,456,544,262,606,"Mixed urban/rural",327947,365627,{"$error":"#N/A"},"N06000009","Lagan Valley",{"$f":"LOOKUP(OFFSET($D697,0,$B$12),{0,179,357,535,713;1,2,3,4,5})","v":4},{"$f":"LOOKUP(OFFSET($D697,0,$B$12),{0,90,179,268,357,446,535,624,713,802;1,2,3,4,5,6,7,8,9,10})","v":7},222,432,481,210,1345,"Northern Ireland",1345,null,null,null,null,null,null,null,"Park"]
["95SS19S2","Lambeg_2","N09000007","Lisburn and Castlereagh",452,430,384,90,380,477,428,359,"Mixed urban/rural",328959,367424,{"$error":"#N/A"},"N06000009","Lagan Valley",{"$f":"LOOKUP(OFFSET($D698,0,$B$12),{0,179,357,535,713;1,2,3,4,5})","v":3},{"$f":"LOOKUP(OFFSET($D698,0,$B$12),{0,90,179,268,357,446,535,624,713,802;1,2,3,4,5,6,7,8,9,10})","v":5},339,490,412,210,1451,"Northern Ireland",1451,null,null,null,null,null,null,null,"Parkgate"]
["95SS20W1","Lisnagarvey","N09000007","Lisburn and Castlereagh",772,721,743,597,710,576,566,809,"Urban",325629,364954,{"$error":"#N/A"},"N06000009","Lagan Valley",{"$f":"LOOKUP(OFFSET($D699,0,$B$12),{0,179,357,535,713;1,2,3,4,5})","v":5},{"$f":"LOOKUP(OFFSET($D699,0,$B$12),{0,90,179,268,357,446,535,624,713,802;1,2,3,4,5,6,7,8,9,10})","v":10},360,594,812,794,2560,"Northern Ireland",2560,null,null,null,null,null,null,null,"Parklake"]
["95SS21S1","Maghaberry_1","N09000007","Lisburn and Castlereagh",663,816,764,741,232,211,410,712,"Rural",317699,363587,{"$error":"#N/A"},"N06000009","Lagan Valley",{"$f":"LOOKUP(OFFSET($D700,0,$B$12),{0,179,357,535,713;1,2,3,4,5})","v":4},{"$f":"LOOKUP(OFFSET($D700,0,$B$12),{0,90,179,268,357,446,535,624,713,802;1,2,3,4,5,6,7,8,9,10})","v":8},640,887,889,280,2696,"Northern Ireland",2696,null,null,null,null,null,null,null,"Pennyburn_1"]
["95SS21S2","Maghaberry_2","N09000007","Lisburn and Castlereagh",748,796,770,740,175,291,774,742,"Rural",318065,360536,{"$error":"#N/A"},"N06000009","Lagan Valley",{"$f":"LOOKUP(OFFSET($D701,0,$B$12),{0,179,357,535,713;1,2,3,4,5})","v":5},{"$f":"LOOKUP(OFFSET($D701,0,$B$12),{0,90,179,268,357,446,535,624,713,802;1,2,3,4,5,6,7,8,9,10})","v":9},506,713,881,404,2504,"Northern Ireland",2504,null,null,null,null,null,null,null,"Pennyburn_2"]
["95SS22S1","Magheralave_1","N09000007","Lisburn and Castlereagh",619,759,694,433,762,492,780,753,"Urban",327132,366393,{"$error":"#N/A"},"N06000009","Lagan Valley",{"$f":"LOOKUP(OFFSET($D702,0,$B$12),{0,179,357,535,713;1,2,3,4,5})","v":5},{"$f":"LOOKUP(OFFSET($D702,0,$B$12),{0,90,179,268,357,446,535,624,713,802;1,2,3,4,5,6,7,8,9,10})","v":9},361,586,403,208,1558,"Northern Ireland",1558,null,null,null,null,null,null,null,"Plumbridge"]
["95SS22S2","Magheralave_2","N09000007","Lisburn and Castlereagh",867,748,771,770,459,706,810,857,"Urban",326825,366668,{"$error":"#N/A"},"N06000009","Lagan Valley",{"$f":"LOOKUP(OFFSET($D703,0,$B$12),{0,179,357,535,713;1,2,3,4,5})","v":5},{"$f":"LOOKUP(OFFSET($D703,0,$B$12),{0,90,179,268,357,446,535,624,713,802;1,2,3,4,5,6,7,8,9,10})","v":10},344,527,631,475,1976,"Northern Ireland",1976,null,null,null,null,null,null,null,"Poleglass_1"]
["95SS23S1","Maze_1","N09000007","Lisburn and Castlereagh",677,777,822,794,301,490,722,787,"Rural",323511,360392,{"$error":"#N/A"},"N06000009","Lagan Valley",{"$f":"LOOKUP(OFFSET($D704,0,$B$12),{0,179,357,535,713;1,2,3,4,5})","v":5},{"$f":"LOOKUP(OFFSET($D704,0,$B$12),{0,90,179,268,357,446,535,624,713,802;1,2,3,4,5,6,7,8,9,10})","v":9},470,570,813,455,2307,"Northern Ireland",2307,null,null,null,null,null,null,null,"Poleglass_2"]
["95SS23S2","Maze_2","N09000007","Lisburn and Castlereagh",706,625,612,548,136,501,777,646,"Rural",324006,361691,{"$error":"#N/A"},"N06000009","Lagan Valley",{"$f":"LOOKUP(OFFSET($D705,0,$B$12),{0,179,357,535,713;1,2,3,4,5})","v":4},{"$f":"LOOKUP(OFFSET($D705,0,$B$12),{0,90,179,268,357,446,535,624,713,802;1,2,3,4,5,6,7,8,9,10})","v":8},345,462,597,253,1658,"Northern Ireland",1658,null,null,null,null,null,null,null,"Pomeroy"]
["95SS24S1","Moira_1","N09000007","Lisburn and Castlereagh",713,847,832,824,251,782,528,804,"Rural",314904,360482,{"$error":"#N/A"},"N06000009","Lagan Valley",{"$f":"LOOKUP(OFFSET($D706,0,$B$12),{0,179,357,535,713;1,2,3,4,5})","v":5},{"$f":"LOOKUP(OFFSET($D706,0,$B$12),{0,90,179,268,357,446,535,624,713,802;1,2,3,4,5,6,7,8,9,10})","v":10},624,831,1038,485,2978,"Northern Ireland",2978,null,null,null,null,null,null,null,"Portaferry_1"]
["95SS24S2","Moira_2","N09000007","Lisburn and Castlereagh",754,713,699,722,411,846,682,796,"Rural",314567,360348,{"$error":"#N/A"},"N06000009","Lagan Valley",{"$f":"LOOKUP(OFFSET($D707,0,$B$12),{0,179,357,535,713;1,2,3,4,5})","v":5},{"$f":"LOOKUP(OFFSET($D707,0,$B$12),{0,90,179,268,357,446,535,624,713,802;1,2,3,4,5,6,7,8,9,10})","v":9},443,546,820,387,2195,"Northern Ireland",2195,null,null,null,null,null,null,null,"Portaferry_2"]
["95SS25W1","Old Warren","N09000007","Lisburn and Castlereagh",137,162,93,84,512,462,171,118,"Urban",325117,363811,{"$error":"#N/A"},"N06000009","Lagan Valley",{"$f":"LOOKUP(OFFSET($D708,0,$B$12),{0,179,357,535,713;1,2,3,4,5})","v":1},{"$f":"LOOKUP(OFFSET($D708,0,$B$12),{0,90,179,268,357,446,535,624,713,802;1,2,3,4,5,6,7,8,9,10})","v":2},776,954,721,344,2795,"Northern Ireland",2795,null,null,null,null,null,null,null,"Portavogie_1"]
["95SS26S1","Poleglass_1","N09000003","Belfast",167,33,17,40,491,235,82,39,"Urban",327796,370690,{"$error":"#N/A"},"N06000004","Belfast West",{"$f":"LOOKUP(OFFSET($D709,0,$B$12),{0,179,357,535,713;1,2,3,4,5})","v":1},{"$f":"LOOKUP(OFFSET($D709,0,$B$12),{0,90,179,268,357,446,535,624,713,802;1,2,3,4,5,6,7,8,9,10})","v":1},578,730,486,163,1957,"Northern Ireland",1957,null,null,null,null,null,null,null,"Portavogie_2"]
["95SS26S2","Poleglass_2","N09000003","Belfast",584,282,333,329,663,515,325,454,"Urban",328154,370592,{"$error":"#N/A"},"N06000004","Belfast West",{"$f":"LOOKUP(OFFSET($D710,0,$B$12),{0,179,357,535,713;1,2,3,4,5})","v":3},{"$f":"LOOKUP(OFFSET($D710,0,$B$12),{0,90,179,268,357,446,535,624,713,802;1,2,3,4,5,6,7,8,9,10})","v":6},403,565,563,223,1755,"Northern Ireland",1755,null,null,null,null,null,null,null,"Portglenone_1"]
["95SS27W1","Seymour Hill","N09000007","Lisburn and Castlereagh",501,317,306,279,579,405,393,418,"Urban",329025,368193,{"$error":"#N/A"},"N06000009","Lagan Valley",{"$f":"LOOKUP(OFFSET($D711,0,$B$12),{0,179,357,535,713;1,2,3,4,5})","v":3},{"$f":"LOOKUP(OFFSET($D711,0,$B$12),{0,90,179,268,357,446,535,624,713,802;1,2,3,4,5,6,7,8,9,10})","v":5},454,731,849,532,2566,"Northern Ireland",2566,null,null,null,null,null,null,null,"Portglenone_2"]
["95SS28W1","Tonagh","N09000007","Lisburn and Castlereagh",396,252,232,180,784,158,180,282,"Urban",325783,364105,{"$error":"#N/A"},"N06000009","Lagan Valley",{"$f":"LOOKUP(OFFSET($D712,0,$B$12),{0,179,357,535,713;1,2,3,4,5})","v":2},{"$f":"LOOKUP(OFFSET($D712,0,$B$12),{0,90,179,268,357,446,535,624,713,802;1,2,3,4,5,6,7,8,9,10})","v":4},530,863,785,422,2598,"Northern Ireland",2598,null,null,null,null,null,null,null,"Portora"]
["95SS29S1","Twinbrook_1","N09000003","Belfast",96,47,30,70,621,23,245,42,"Urban",328036,368646,{"$error":"#N/A"},"N06000004","Belfast West",{"$f":"LOOKUP(OFFSET($D713,0,$B$12),{0,179,357,535,713;1,2,3,4,5})","v":1},{"$f":"LOOKUP(OFFSET($D713,0,$B$12),{0,90,179,268,357,446,535,624,713,802;1,2,3,4,5,6,7,8,9,10})","v":1},332,426,318,162,1237,"Northern Ireland",1237,null,null,null,null,null,null,null,"Portstewart"]
["95SS29S2","Twinbrook_2","N09000003","Belfast",64,26,28,112,668,59,167,36,"Urban",327787,368731,{"$error":"#N/A"},"N06000004","Belfast West",{"$f":"LOOKUP(OFFSET($D714,0,$B$12),{0,179,357,535,713;1,2,3,4,5})","v":1},{"$f":"LOOKUP(OFFSET($D714,0,$B$12),{0,90,179,268,357,446,535,624,713,802;1,2,3,4,5,6,7,8,9,10})","v":1},319,425,371,213,1328,"Northern Ireland",1328,null,null,null,null,null,null,null,"Poyntz Pass"]
["95SS30S1","Wallace Park_1","N09000007","Lisburn and Castlereagh",887,886,865,660,742,104,868,858,"Urban",326192,365158,{"$error":"#N/A"},"N06000009","Lagan Valley",{"$f":"LOOKUP(OFFSET($D715,0,$B$12),{0,179,357,535,713;1,2,3,4,5})","v":5},{"$f":"LOOKUP(OFFSET($D715,0,$B$12),{0,90,179,268,357,446,535,624,713,802;1,2,3,4,5,6,7,8,9,10})","v":10},165,767,275,189,1394,"Northern Ireland",1394,null,null,null,null,null,null,null,"Princetown"]
["95SS30S2","Wallace Park_2","N09000007","Lisburn and Castlereagh",818,814,857,820,417,307,683,842,"Urban",326647,365495,{"$error":"#N/A"},"N06000009","Lagan Valley",{"$f":"LOOKUP(OFFSET($D716,0,$B$12),{0,179,357,535,713;1,2,3,4,5})","v":5},{"$f":"LOOKUP(OFFSET($D716,0,$B$12),{0,90,179,268,357,446,535,624,713,802;1,2,3,4,5,6,7,8,9,10})","v":10},448,511,732,589,2279,"Northern Ireland",2279,null,null,null,null,null,null,null,"Quilly"]
["95TT01W1","Ballymaguigan","N09000009","Mid Ulster",640,730,690,728,112,314,727,664,"Rural",294536,390225,{"$error":"#N/A"},"N06000010","Mid Ulster",{"$f":"LOOKUP(OFFSET($D717,0,$B$12),{0,179,357,535,713;1,2,3,4,5})","v":4},{"$f":"LOOKUP(OFFSET($D717,0,$B$12),{0,90,179,268,357,446,535,624,713,802;1,2,3,4,5,6,7,8,9,10})","v":8},668,929,897,454,2947,"Northern Ireland",2947,null,null,null,null,null,null,null,"Quoile_1"]
["95TT02W1","Bellaghy","N09000009","Mid Ulster",377,546,540,629,168,533,826,541,"Rural",295980,397927,{"$error":"#N/A"},"N06000010","Mid Ulster",{"$f":"LOOKUP(OFFSET($D718,0,$B$12),{0,179,357,535,713;1,2,3,4,5})","v":4},{"$f":"LOOKUP(OFFSET($D718,0,$B$12),{0,90,179,268,357,446,535,624,713,802;1,2,3,4,5,6,7,8,9,10})","v":7},665,915,804,367,2751,"Northern Ireland",2751,null,null,null,null,null,null,null,"Quoile_2"]
["95TT03S1","Castledawson_1","N09000009","Mid Ulster",599,421,301,301,296,359,494,453,"Rural",292942,392719,{"$error":"#N/A"},"N06000010","Mid Ulster",{"$f":"LOOKUP(OFFSET($D719,0,$B$12),{0,179,357,535,713;1,2,3,4,5})","v":3},{"$f":"LOOKUP(OFFSET($D719,0,$B$12),{0,90,179,268,357,446,535,624,713,802;1,2,3,4,5,6,7,8,9,10})","v":6},364,564,477,211,1617,"Northern Ireland",1617,null,null,null,null,null,null,null,"Randalstown_1"]
["95TT03S2","Castledawson_2","N09000009","Mid Ulster",522,502,618,552,277,538,763,607,"Rural",293575,393069,{"$error":"#N/A"},"N06000010","Mid Ulster",{"$f":"LOOKUP(OFFSET($D720,0,$B$12),{0,179,357,535,713;1,2,3,4,5})","v":4},{"$f":"LOOKUP(OFFSET($D720,0,$B$12),{0,90,179,268,357,446,535,624,713,802;1,2,3,4,5,6,7,8,9,10})","v":7},448,532,579,231,1790,"Northern Ireland",1790,null,null,null,null,null,null,null,"Randalstown_2"]
["95TT04W1","Draperstown","N09000009","Mid Ulster",214,416,370,575,174,686,812,389,"Rural",277224,393858,{"$error":"#N/A"},"N06000010","Mid Ulster",{"$f":"LOOKUP(OFFSET($D721,0,$B$12),{0,179,357,535,713;1,2,3,4,5})","v":3},{"$f":"LOOKUP(OFFSET($D721,0,$B$12),{0,90,179,268,357,446,535,624,713,802;1,2,3,4,5,6,7,8,9,10})","v":5},832,1023,926,398,3179,"Northern Ireland",3179,null,null,null,null,null,null,null,"Rathbrady"]
["95TT05S1","Glebe_1_Magherafelt","N09000009","Mid Ulster",537,672,657,610,536,606,253,688,"Urban",289276,391104,{"$error":"#N/A"},"N06000010","Mid Ulster",{"$f":"LOOKUP(OFFSET($D722,0,$B$12),{0,179,357,535,713;1,2,3,4,5})","v":4},{"$f":"LOOKUP(OFFSET($D722,0,$B$12),{0,90,179,268,357,446,535,624,713,802;1,2,3,4,5,6,7,8,9,10})","v":8},415,595,621,269,1900,"Northern Ireland",1900,null,null,null,null,null,null,null,"Rathfriland"]
["95TT05S2","Glebe_2_Magherafelt","N09000009","Mid Ulster",356,190,122,131,780,511,382,227,"Urban",290252,390410,{"$error":"#N/A"},"N06000010","Mid Ulster",{"$f":"LOOKUP(OFFSET($D723,0,$B$12),{0,179,357,535,713;1,2,3,4,5})","v":2},{"$f":"LOOKUP(OFFSET($D723,0,$B$12),{0,90,179,268,357,446,535,624,713,802;1,2,3,4,5,6,7,8,9,10})","v":3},302,526,416,183,1427,"Northern Ireland",1427,null,null,null,null,null,null,null,"Rathgael"]
["95TT06W1","Gulladuff","N09000009","Mid Ulster",534,575,491,622,170,562,751,589,"Rural",289407,400043,{"$error":"#N/A"},"N06000010","Mid Ulster",{"$f":"LOOKUP(OFFSET($D724,0,$B$12),{0,179,357,535,713;1,2,3,4,5})","v":4},{"$f":"LOOKUP(OFFSET($D724,0,$B$12),{0,90,179,268,357,446,535,624,713,802;1,2,3,4,5,6,7,8,9,10})","v":7},704,908,913,390,2915,"Northern Ireland",2915,null,null,null,null,null,null,null,"Ravenhill_1"]
["95TT07W1","Knockcloghrim","N09000009","Mid Ulster",715,702,622,631,141,367,756,674,"Mixed urban/rural",290227,394666,{"$error":"#N/A"},"N06000010","Mid Ulster",{"$f":"LOOKUP(OFFSET($D725,0,$B$12),{0,179,357,535,713;1,2,3,4,5})","v":4},{"$f":"LOOKUP(OFFSET($D725,0,$B$12),{0,90,179,268,357,446,535,624,713,802;1,2,3,4,5,6,7,8,9,10})","v":8},622,824,987,434,2866,"Northern Ireland",2866,null,null,null,null,null,null,null,"Ravenhill_2"]
["95TT08W1","Lecumpher","N09000009","Mid Ulster",406,703,650,704,65,532,814,563,"Rural",286189,388890,{"$error":"#N/A"},"N06000010","Mid Ulster",{"$f":"LOOKUP(OFFSET($D726,0,$B$12),{0,179,357,535,713;1,2,3,4,5})","v":4},{"$f":"LOOKUP(OFFSET($D726,0,$B$12),{0,90,179,268,357,446,535,624,713,802;1,2,3,4,5,6,7,8,9,10})","v":7},617,935,959,365,2875,"Northern Ireland",2875,null,null,null,null,null,null,null,"Ravenhill_3"]
["95TT09S1","Lower Glenshane_1","N09000009","Mid Ulster",574,563,502,761,30,489,869,527,"Rural",275523,396266,{"$error":"#N/A"},"N06000010","Mid Ulster",{"$f":"LOOKUP(OFFSET($D727,0,$B$12),{0,179,357,535,713;1,2,3,4,5})","v":3},{"$f":"LOOKUP(OFFSET($D727,0,$B$12),{0,90,179,268,357,446,535,624,713,802;1,2,3,4,5,6,7,8,9,10})","v":6},336,482,455,234,1507,"Northern Ireland",1507,null,null,null,null,null,null,null,"Rich Hill_1"]
["95TT09S2","Lower Glenshane_2","N09000009","Mid Ulster",587,762,799,837,62,404,807,661,"Rural",282062,399926,{"$error":"#N/A"},"N06000010","Mid Ulster",{"$f":"LOOKUP(OFFSET($D728,0,$B$12),{0,179,357,535,713;1,2,3,4,5})","v":4},{"$f":"LOOKUP(OFFSET($D728,0,$B$12),{0,90,179,268,357,446,535,624,713,802;1,2,3,4,5,6,7,8,9,10})","v":8},340,434,497,219,1491,"Northern Ireland",1491,null,null,null,null,null,null,null,"Rich Hill_2"]
["95TT10W1","Maghera","N09000009","Mid Ulster",163,301,289,275,527,256,343,255,"Rural",285284,400680,{"$error":"#N/A"},"N06000010","Mid Ulster",{"$f":"LOOKUP(OFFSET($D729,0,$B$12),{0,179,357,535,713;1,2,3,4,5})","v":2},{"$f":"LOOKUP(OFFSET($D729,0,$B$12),{0,90,179,268,357,446,535,624,713,802;1,2,3,4,5,6,7,8,9,10})","v":3},658,1046,767,387,2858,"Northern Ireland",2858,null,null,null,null,null,null,null,"Ringsend"]
["95TT11S1","Swatragh_1","N09000009","Mid Ulster",364,565,632,742,123,741,842,562,"Rural",284148,402235,{"$error":"#N/A"},"N06000010","Mid Ulster",{"$f":"LOOKUP(OFFSET($D730,0,$B$12),{0,179,357,535,713;1,2,3,4,5})","v":4},{"$f":"LOOKUP(OFFSET($D730,0,$B$12),{0,90,179,268,357,446,535,624,713,802;1,2,3,4,5,6,7,8,9,10})","v":7},452,598,542,291,1883,"Northern Ireland",1883,null,null,null,null,null,null,null,"Roeside"]
["95TT11S2","Swatragh_2","N09000009","Mid Ulster",299,640,723,725,24,400,839,459,"Rural",285364,407367,{"$error":"#N/A"},"N06000010","Mid Ulster",{"$f":"LOOKUP(OFFSET($D731,0,$B$12),{0,179,357,535,713;1,2,3,4,5})","v":3},{"$f":"LOOKUP(OFFSET($D731,0,$B$12),{0,90,179,268,357,446,535,624,713,802;1,2,3,4,5,6,7,8,9,10})","v":6},466,547,468,214,1695,"Northern Ireland",1695,null,null,null,null,null,null,null,"Rosemount"]
["95TT12W1","Tobermore","N09000009","Mid Ulster",611,568,528,640,116,366,738,582,"Rural",283160,395251,{"$error":"#N/A"},"N06000010","Mid Ulster",{"$f":"LOOKUP(OFFSET($D732,0,$B$12),{0,179,357,535,713;1,2,3,4,5})","v":4},{"$f":"LOOKUP(OFFSET($D732,0,$B$12),{0,90,179,268,357,446,535,624,713,802;1,2,3,4,5,6,7,8,9,10})","v":7},631,821,856,420,2729,"Northern Ireland",2729,null,null,null,null,null,null,null,"Rosetta_1"]
["95TT13S1","Town Parks East_1","N09000009","Mid Ulster",232,527,463,352,551,443,363,435,"Urban",289529,389680,{"$error":"#N/A"},"N06000010","Mid Ulster",{"$f":"LOOKUP(OFFSET($D733,0,$B$12),{0,179,357,535,713;1,2,3,4,5})","v":3},{"$f":"LOOKUP(OFFSET($D733,0,$B$12),{0,90,179,268,357,446,535,624,713,802;1,2,3,4,5,6,7,8,9,10})","v":5},341,526,523,173,1563,"Northern Ireland",1563,null,null,null,null,null,null,null,"Rosetta_2"]
["95TT13S2","Town Parks East_2","N09000009","Mid Ulster",249,223,137,221,715,769,90,218,"Urban",289902,390005,{"$error":"#N/A"},"N06000010","Mid Ulster",{"$f":"LOOKUP(OFFSET($D734,0,$B$12),{0,179,357,535,713;1,2,3,4,5})","v":2},{"$f":"LOOKUP(OFFSET($D734,0,$B$12),{0,90,179,268,357,446,535,624,713,802;1,2,3,4,5,6,7,8,9,10})","v":3},305,490,399,193,1387,"Northern Ireland",1387,null,null,null,null,null,null,null,"Rosetta_3"]
["95TT14W1","Town Parks West","N09000009","Mid Ulster",583,431,358,396,636,768,215,544,"Urban",289054,390186,{"$error":"#N/A"},"N06000010","Mid Ulster",{"$f":"LOOKUP(OFFSET($D735,0,$B$12),{0,179,357,535,713;1,2,3,4,5})","v":4},{"$f":"LOOKUP(OFFSET($D735,0,$B$12),{0,90,179,268,357,446,535,624,713,802;1,2,3,4,5,6,7,8,9,10})","v":7},463,671,706,349,2188,"Northern Ireland",2188,null,null,null,null,null,null,null,"Rosslea"]
["95TT15W1","Upperlands","N09000009","Mid Ulster",207,483,404,562,140,195,733,358,"Rural",289049,405742,{"$error":"#N/A"},"N06000010","Mid Ulster",{"$f":"LOOKUP(OFFSET($D736,0,$B$12),{0,179,357,535,713;1,2,3,4,5})","v":3},{"$f":"LOOKUP(OFFSET($D736,0,$B$12),{0,90,179,268,357,446,535,624,713,802;1,2,3,4,5,6,7,8,9,10})","v":5},585,766,809,396,2556,"Northern Ireland",2556,null,null,null,null,null,null,null,"Rossorry"]
["95TT16W1","Valley","N09000009","Mid Ulster",328,557,623,549,148,424,795,510,"Rural",295324,404578,{"$error":"#N/A"},"N06000010","Mid Ulster",{"$f":"LOOKUP(OFFSET($D737,0,$B$12),{0,179,357,535,713;1,2,3,4,5})","v":3},{"$f":"LOOKUP(OFFSET($D737,0,$B$12),{0,90,179,268,357,446,535,624,713,802;1,2,3,4,5,6,7,8,9,10})","v":6},593,898,846,392,2729,"Northern Ireland",2729,null,null,null,null,null,null,null,"Rostrevor"]
["95UU06W1","Dalriada","N09000004","Causeway Coast and Glens",542,390,515,608,386,870,464,584,"Urban",311233,441363,{"$f":"IF(B738=$F$27,O738,NA())","v":{"$error":"#N/A"}},"N06000012","North Antrim",{"$f":"LOOKUP(OFFSET($D738,0,$B$12),{0,179,357,535,713;1,2,3,4,5})","v":4},{"$f":"LOOKUP(OFFSET($D738,0,$B$12),{0,90,179,268,357,446,535,624,713,802;1,2,3,4,5,6,7,8,9,10})","v":7},271,407,509,312,1500,"Northern Ireland",{"$f":"CHOOSE($K$5,$Y738,IF($D738=$B$27,$Y738,\"\"),IF($R738=$B$27,$Y738,\"\"))","v":1500},null,null,null,null,null,null,null,"Rostulla_1"]
["95UU09W1","Glenariff","N09000004","Causeway Coast and Glens",386,542,613,743,134,449,597,543,"Rural",323934,425241,{"$error":"#N/A"},"N06000005","East Antrim",{"$f":"LOOKUP(OFFSET($D739,0,$B$12),{0,179,357,535,713;1,2,3,4,5})","v":4},{"$f":"LOOKUP(OFFSET($D739,0,$B$12),{0,90,179,268,357,446,535,624,713,802;1,2,3,4,5,6,7,8,9,10})","v":7},345,477,591,239,1652,"Northern Ireland",1652,null,null,null,null,null,null,null,"Rostulla_2"]
["95UU14W1","Knocklayd","N09000004","Causeway Coast and Glens",143,201,266,310,385,871,381,221,"Urban",310538,440492,{"$error":"#N/A"},"N06000012","North Antrim",{"$f":"LOOKUP(OFFSET($D740,0,$B$12),{0,179,357,535,713;1,2,3,4,5})","v":2},{"$f":"LOOKUP(OFFSET($D740,0,$B$12),{0,90,179,268,357,446,535,624,713,802;1,2,3,4,5,6,7,8,9,10})","v":3},421,556,579,296,1852,"Northern Ireland",1852,null,null,null,null,null,null,null,"Route"]
["95UU99C1","Armoy_&_Moss-side and Moyarget","N09000004","Causeway Coast and Glens",72,281,348,423,55,271,526,169,"Rural",305748,433968,{"$error":"#N/A"},"N06000012","North Antrim",{"$f":"LOOKUP(OFFSET($D741,0,$B$12),{0,179,357,535,713;1,2,3,4,5})","v":1},{"$f":"LOOKUP(OFFSET($D741,0,$B$12),{0,90,179,268,357,446,535,624,713,802;1,2,3,4,5,6,7,8,9,10})","v":2},451,594,744,300,2089,"Northern Ireland",2089,null,null,null,null,null,null,null,"Royal Portrush"]
["95UU99C2","Ballylough_&_Bushmills","N09000004","Causeway Coast and Glens",59,270,558,147,247,734,458,177,"Rural",294400,439910,{"$error":"#N/A"},"N06000012","North Antrim",{"$f":"LOOKUP(OFFSET($D742,0,$B$12),{0,179,357,535,713;1,2,3,4,5})","v":1},{"$f":"LOOKUP(OFFSET($D742,0,$B$12),{0,90,179,268,357,446,535,624,713,802;1,2,3,4,5,6,7,8,9,10})","v":2},342,438,628,399,1806,"Northern Ireland",1806,null,null,null,null,null,null,null,"Saintfield_1"]
["95UU99C3","Bonamargy and Rathlin_&_Glenshesk","N09000004","Causeway Coast and Glens",344,459,666,696,124,249,316,460,"Mixed urban/rural",314058,440547,{"$error":"#N/A"},"N06000012","North Antrim",{"$f":"LOOKUP(OFFSET($D743,0,$B$12),{0,179,357,535,713;1,2,3,4,5})","v":3},{"$f":"LOOKUP(OFFSET($D743,0,$B$12),{0,90,179,268,357,446,535,624,713,802;1,2,3,4,5,6,7,8,9,10})","v":6},307,452,603,484,1846,"Northern Ireland",1846,null,null,null,null,null,null,null,"Saintfield_2"]
["95UU99C4","Carnmoon_&_Dunseverick","N09000004","Causeway Coast and Glens",84,437,586,490,38,99,788,210,"Rural",299510,439437,{"$error":"#N/A"},"N06000012","North Antrim",{"$f":"LOOKUP(OFFSET($D744,0,$B$12),{0,179,357,535,713;1,2,3,4,5})","v":2},{"$f":"LOOKUP(OFFSET($D744,0,$B$12),{0,90,179,268,357,446,535,624,713,802;1,2,3,4,5,6,7,8,9,10})","v":3},363,479,681,343,1866,"Northern Ireland",1866,null,null,null,null,null,null,null,"Sandholes"]
["95UU99C5","Glenaan_&_Glendun","N09000004","Causeway Coast and Glens",371,535,653,682,85,313,692,499,"Rural",323251,429011,{"$error":"#N/A"},"N06000005","East Antrim",{"$f":"LOOKUP(OFFSET($D745,0,$B$12),{0,179,357,535,713;1,2,3,4,5})","v":3},{"$f":"LOOKUP(OFFSET($D745,0,$B$12),{0,90,179,268,357,446,535,624,713,802;1,2,3,4,5,6,7,8,9,10})","v":6},403,643,821,507,2374,"Northern Ireland",2374,null,null,null,null,null,null,null,"Scrabo_1"]
["95UU99C6","Glentaisie_&_Kinbane","N09000004","Causeway Coast and Glens",25,231,350,347,222,333,251,124,"Mixed urban/rural",309287,440804,{"$error":"#N/A"},"N06000012","North Antrim",{"$f":"LOOKUP(OFFSET($D746,0,$B$12),{0,179,357,535,713;1,2,3,4,5})","v":1},{"$f":"LOOKUP(OFFSET($D746,0,$B$12),{0,90,179,268,357,446,535,624,713,802;1,2,3,4,5,6,7,8,9,10})","v":2},484,653,788,390,2316,"Northern Ireland",2316,null,null,null,null,null,null,null,"Scrabo_2"]
["95VV01S1","Annalong_1","N09000010","Newry, Mourne and Down",169,574,590,441,153,236,530,363,"Rural",336580,321135,{"$error":"#N/A"},"N06000015","South Down",{"$f":"LOOKUP(OFFSET($D747,0,$B$12),{0,179,357,535,713;1,2,3,4,5})","v":3},{"$f":"LOOKUP(OFFSET($D747,0,$B$12),{0,90,179,268,357,446,535,624,713,802;1,2,3,4,5,6,7,8,9,10})","v":5},326,502,549,262,1638,"Northern Ireland",1638,null,null,null,null,null,null,null,"Seacon"]
["95VV01S2","Annalong_2","N09000010","Newry, Mourne and Down",66,300,288,282,302,563,355,187,"Rural",337308,319677,{"$error":"#N/A"},"N06000015","South Down",{"$f":"LOOKUP(OFFSET($D748,0,$B$12),{0,179,357,535,713;1,2,3,4,5})","v":2},{"$f":"LOOKUP(OFFSET($D748,0,$B$12),{0,90,179,268,357,446,535,624,713,802;1,2,3,4,5,6,7,8,9,10})","v":3},347,518,515,241,1621,"Northern Ireland",1621,null,null,null,null,null,null,null,"Seaforde"]
["95VV02W1","Ballybot","N09000010","Newry, Mourne and Down",271,73,80,100,575,73,56,93,"Urban",307788,327313,{"$error":"#N/A"},"N06000011","Newry & Armagh",{"$f":"LOOKUP(OFFSET($D749,0,$B$12),{0,179,357,535,713;1,2,3,4,5})","v":1},{"$f":"LOOKUP(OFFSET($D749,0,$B$12),{0,90,179,268,357,446,535,624,713,802;1,2,3,4,5,6,7,8,9,10})","v":2},457,709,722,357,2246,"Northern Ireland",2246,null,null,null,null,null,null,null,"Seapatrick"]
["95VV03W1","Bessbrook","N09000010","Newry, Mourne and Down",281,130,128,61,412,155,299,132,"Rural",304710,328628,{"$error":"#N/A"},"N06000011","Newry & Armagh",{"$f":"LOOKUP(OFFSET($D750,0,$B$12),{0,179,357,535,713;1,2,3,4,5})","v":1},{"$f":"LOOKUP(OFFSET($D750,0,$B$12),{0,90,179,268,357,446,535,624,713,802;1,2,3,4,5,6,7,8,9,10})","v":2},652,901,808,420,2781,"Northern Ireland",2781,null,null,null,null,null,null,null,"Seaview_1"]
["95VV04W1","Binnian","N09000010","Newry, Mourne and Down",123,540,629,550,93,417,705,335,"Rural",333609,318064,{"$error":"#N/A"},"N06000015","South Down",{"$f":"LOOKUP(OFFSET($D751,0,$B$12),{0,179,357,535,713;1,2,3,4,5})","v":2},{"$f":"LOOKUP(OFFSET($D751,0,$B$12),{0,90,179,268,357,446,535,624,713,802;1,2,3,4,5,6,7,8,9,10})","v":4},763,996,986,503,3248,"Northern Ireland",3248,null,null,null,null,null,null,null,"Seaview_2"]
["95VV05S1","Burren and Kilbroney_1","N09000010","Newry, Mourne and Down",257,587,726,716,90,263,782,473,"Mixed urban/rural",316836,320289,{"$error":"#N/A"},"N06000015","South Down",{"$f":"LOOKUP(OFFSET($D752,0,$B$12),{0,179,357,535,713;1,2,3,4,5})","v":3},{"$f":"LOOKUP(OFFSET($D752,0,$B$12),{0,90,179,268,357,446,535,624,713,802;1,2,3,4,5,6,7,8,9,10})","v":6},494,644,697,256,2091,"Northern Ireland",2091,null,null,null,null,null,null,null,"Seymour Hill"]
["95VV05S2","Burren and Kilbroney_2","N09000010","Newry, Mourne and Down",393,765,823,789,138,739,833,663,"Mixed urban/rural",312265,322103,{"$error":"#N/A"},"N06000015","South Down",{"$f":"LOOKUP(OFFSET($D753,0,$B$12),{0,179,357,535,713;1,2,3,4,5})","v":4},{"$f":"LOOKUP(OFFSET($D753,0,$B$12),{0,90,179,268,357,446,535,624,713,802;1,2,3,4,5,6,7,8,9,10})","v":8},727,852,840,250,2669,"Northern Ireland",2669,null,null,null,null,null,null,null,"Shaftesbury_1"]
["95VV06W1","Camlough","N09000010","Newry, Mourne and Down",110,294,364,599,215,412,506,260,"Rural",302763,326130,{"$error":"#N/A"},"N06000011","Newry & Armagh",{"$f":"LOOKUP(OFFSET($D754,0,$B$12),{0,179,357,535,713;1,2,3,4,5})","v":2},{"$f":"LOOKUP(OFFSET($D754,0,$B$12),{0,90,179,268,357,446,535,624,713,802;1,2,3,4,5,6,7,8,9,10})","v":3},982,1136,1115,403,3636,"Northern Ireland",3636,null,null,null,null,null,null,null,"Shaftesbury_2"]
["95VV07S1","Clonallan_1","N09000010","Newry, Mourne and Down",98,157,206,198,609,161,75,133,"Urban",314081,318654,{"$error":"#N/A"},"N06000015","South Down",{"$f":"LOOKUP(OFFSET($D755,0,$B$12),{0,179,357,535,713;1,2,3,4,5})","v":1},{"$f":"LOOKUP(OFFSET($D755,0,$B$12),{0,90,179,268,357,446,535,624,713,802;1,2,3,4,5,6,7,8,9,10})","v":2},399,662,642,316,2018,"Northern Ireland",2018,null,null,null,null,null,null,null,"Shaftesbury_3"]
["95VV07S2","Clonallan_2","N09000010","Newry, Mourne and Down",434,493,610,661,362,802,634,619,"Urban",314152,319294,{"$error":"#N/A"},"N06000015","South Down",{"$f":"LOOKUP(OFFSET($D756,0,$B$12),{0,179,357,535,713;1,2,3,4,5})","v":4},{"$f":"LOOKUP(OFFSET($D756,0,$B$12),{0,90,179,268,357,446,535,624,713,802;1,2,3,4,5,6,7,8,9,10})","v":7},529,741,861,340,2471,"Northern Ireland",2471,null,null,null,null,null,null,null,"Shankill_1"]
["95VV08W1","Creggan","N09000010","Newry, Mourne and Down",1,221,415,391,61,159,721,72,"Rural",292941,317517,{"$error":"#N/A"},"N06000011","Newry & Armagh",{"$f":"LOOKUP(OFFSET($D757,0,$B$12),{0,179,357,535,713;1,2,3,4,5})","v":1},{"$f":"LOOKUP(OFFSET($D757,0,$B$12),{0,90,179,268,357,446,535,624,713,802;1,2,3,4,5,6,7,8,9,10})","v":1},984,1044,987,442,3458,"Northern Ireland",3458,null,null,null,null,null,null,null,"Shankill_2"]
["95VV09W1","Crossmaglen","N09000010","Newry, Mourne and Down",5,109,229,276,208,81,783,57,"Rural",290839,314177,{"$error":"#N/A"},"N06000011","Newry & Armagh",{"$f":"LOOKUP(OFFSET($D758,0,$B$12),{0,179,357,535,713;1,2,3,4,5})","v":1},{"$f":"LOOKUP(OFFSET($D758,0,$B$12),{0,90,179,268,357,446,535,624,713,802;1,2,3,4,5,6,7,8,9,10})","v":1},730,908,889,353,2881,"Northern Ireland",2881,null,null,null,null,null,null,null,"Shantallow East"]
["95VV10S1","Daisy Hill_1","N09000010","Newry, Mourne and Down",519,124,83,105,580,175,137,171,"Urban",307684,326152,{"$error":"#N/A"},"N06000011","Newry & Armagh",{"$f":"LOOKUP(OFFSET($D759,0,$B$12),{0,179,357,535,713;1,2,3,4,5})","v":1},{"$f":"LOOKUP(OFFSET($D759,0,$B$12),{0,90,179,268,357,446,535,624,713,802;1,2,3,4,5,6,7,8,9,10})","v":2},384,593,468,131,1576,"Northern Ireland",1576,null,null,null,null,null,null,null,"Shantallow West_1"]
["95VV10S2","Daisy Hill_2","N09000010","Newry, Mourne and Down",104,100,75,213,680,24,8,75,"Urban",307787,326646,{"$error":"#N/A"},"N06000011","Newry & Armagh",{"$f":"LOOKUP(OFFSET($D760,0,$B$12),{0,179,357,535,713;1,2,3,4,5})","v":1},{"$f":"LOOKUP(OFFSET($D760,0,$B$12),{0,90,179,268,357,446,535,624,713,802;1,2,3,4,5,6,7,8,9,10})","v":1},422,629,512,211,1774,"Northern Ireland",1774,null,null,null,null,null,null,null,"Shantallow West_2"]
["95VV11S1","Derryleckagh_1","N09000010","Newry, Mourne and Down",518,641,571,800,257,743,739,686,"Mixed urban/rural",310437,324915,{"$error":"#N/A"},"N06000015","South Down",{"$f":"LOOKUP(OFFSET($D761,0,$B$12),{0,179,357,535,713;1,2,3,4,5})","v":4},{"$f":"LOOKUP(OFFSET($D761,0,$B$12),{0,90,179,268,357,446,535,624,713,802;1,2,3,4,5,6,7,8,9,10})","v":8},496,643,697,281,2117,"Northern Ireland",2117,null,null,null,null,null,null,null,"Shantallow West_3"]
["95VV11S2","Derryleckagh_2","N09000010","Newry, Mourne and Down",289,556,607,748,271,619,709,557,"Mixed urban/rural",309809,328101,{"$error":"#N/A"},"N06000015","South Down",{"$f":"LOOKUP(OFFSET($D762,0,$B$12),{0,179,357,535,713;1,2,3,4,5})","v":4},{"$f":"LOOKUP(OFFSET($D762,0,$B$12),{0,90,179,268,357,446,535,624,713,802;1,2,3,4,5,6,7,8,9,10})","v":7},646,817,811,260,2536,"Northern Ireland",2536,null,null,null,null,null,null,null,"Shantallow West_4"]
["95VV12S1","Derrymore_1","N09000010","Newry, Mourne and Down",77,274,213,242,379,85,148,147,"Mixed urban/rural",306219,327521,{"$error":"#N/A"},"N06000011","Newry & Armagh",{"$f":"LOOKUP(OFFSET($D763,0,$B$12),{0,179,357,535,713;1,2,3,4,5})","v":1},{"$f":"LOOKUP(OFFSET($D763,0,$B$12),{0,90,179,268,357,446,535,624,713,802;1,2,3,4,5,6,7,8,9,10})","v":2},434,561,475,212,1683,"Northern Ireland",1683,null,null,null,null,null,null,null,"Shilvodan"]
["95VV12S2","Derrymore_2","N09000010","Newry, Mourne and Down",225,207,216,240,497,433,377,237,"Urban",306061,327996,{"$error":"#N/A"},"N06000011","Newry & Armagh",{"$f":"LOOKUP(OFFSET($D764,0,$B$12),{0,179,357,535,713;1,2,3,4,5})","v":2},{"$f":"LOOKUP(OFFSET($D764,0,$B$12),{0,90,179,268,357,446,535,624,713,802;1,2,3,4,5,6,7,8,9,10})","v":3},409,532,459,231,1631,"Northern Ireland",1631,null,null,null,null,null,null,null,"Shimna"]
["95VV13S1","Donaghmore_1","N09000010","Newry, Mourne and Down",136,582,647,727,26,574,736,334,"Rural",312705,331679,{"$error":"#N/A"},"N06000015","South Down",{"$f":"LOOKUP(OFFSET($D765,0,$B$12),{0,179,357,535,713;1,2,3,4,5})","v":2},{"$f":"LOOKUP(OFFSET($D765,0,$B$12),{0,90,179,268,357,446,535,624,713,802;1,2,3,4,5,6,7,8,9,10})","v":4},617,645,719,230,2210,"Northern Ireland",2210,null,null,null,null,null,null,null,"Silver Bridge_1"]
["95VV13S2","Donaghmore_2","N09000010","Newry, Mourne and Down",252,626,654,783,128,392,630,504,"Rural",309214,332768,{"$error":"#N/A"},"N06000015","South Down",{"$f":"LOOKUP(OFFSET($D766,0,$B$12),{0,179,357,535,713;1,2,3,4,5})","v":3},{"$f":"LOOKUP(OFFSET($D766,0,$B$12),{0,90,179,268,357,446,535,624,713,802;1,2,3,4,5,6,7,8,9,10})","v":6},315,444,495,205,1460,"Northern Ireland",1460,null,null,null,null,null,null,null,"Silver Bridge_2"]
["95VV14S1","Drumalane_1","N09000010","Newry, Mourne and Down",284,299,322,322,462,218,446,326,"Urban",308346,324885,{"$error":"#N/A"},"N06000011","Newry & Armagh",{"$f":"LOOKUP(OFFSET($D767,0,$B$12),{0,179,357,535,713;1,2,3,4,5})","v":2},{"$f":"LOOKUP(OFFSET($D767,0,$B$12),{0,90,179,268,357,446,535,624,713,802;1,2,3,4,5,6,7,8,9,10})","v":4},497,730,618,198,2042,"Northern Ireland",2042,null,null,null,null,null,null,null,"Silverstream"]
["95VV14S2","Drumalane_2","N09000010","Newry, Mourne and Down",151,371,323,625,545,135,58,279,"Urban",308037,325528,{"$error":"#N/A"},"N06000011","Newry & Armagh",{"$f":"LOOKUP(OFFSET($D768,0,$B$12),{0,179,357,535,713;1,2,3,4,5})","v":2},{"$f":"LOOKUP(OFFSET($D768,0,$B$12),{0,90,179,268,357,446,535,624,713,802;1,2,3,4,5,6,7,8,9,10})","v":4},269,457,488,272,1485,"Northern Ireland",1485,null,null,null,null,null,null,null,"Sion Mills"]
["95VV15S1","Drumgullion_1","N09000010","Newry, Mourne and Down",52,89,90,102,693,188,206,70,"Urban",308341,327271,{"$error":"#N/A"},"N06000011","Newry & Armagh",{"$f":"LOOKUP(OFFSET($D769,0,$B$12),{0,179,357,535,713;1,2,3,4,5})","v":1},{"$f":"LOOKUP(OFFSET($D769,0,$B$12),{0,90,179,268,357,446,535,624,713,802;1,2,3,4,5,6,7,8,9,10})","v":1},300,515,413,182,1411,"Northern Ireland",1411,null,null,null,null,null,null,null,"Sixmilecross"]
["95VV15S2","Drumgullion_2","N09000010","Newry, Mourne and Down",716,408,347,399,470,617,376,551,"Urban",307655,328412,{"$error":"#N/A"},"N06000011","Newry & Armagh",{"$f":"LOOKUP(OFFSET($D770,0,$B$12),{0,179,357,535,713;1,2,3,4,5})","v":4},{"$f":"LOOKUP(OFFSET($D770,0,$B$12),{0,90,179,268,357,446,535,624,713,802;1,2,3,4,5,6,7,8,9,10})","v":7},359,664,597,177,1796,"Northern Ireland",1796,null,null,null,null,null,null,null,"Slemish"]
["95VV16W1","Fathom","N09000010","Newry, Mourne and Down",102,329,487,355,213,446,395,243,"Mixed urban/rural",307852,322409,{"$error":"#N/A"},"N06000011","Newry & Armagh",{"$f":"LOOKUP(OFFSET($D771,0,$B$12),{0,179,357,535,713;1,2,3,4,5})","v":2},{"$f":"LOOKUP(OFFSET($D771,0,$B$12),{0,90,179,268,357,446,535,624,713,802;1,2,3,4,5,6,7,8,9,10})","v":3},754,1076,1093,428,3350,"Northern Ireland",3350,null,null,null,null,null,null,null,"Slievekirk"]
["95VV17S1","Forkhill_1","N09000010","Newry, Mourne and Down",87,351,437,448,214,402,628,249,"Rural",304832,318925,{"$error":"#N/A"},"N06000011","Newry & Armagh",{"$f":"LOOKUP(OFFSET($D772,0,$B$12),{0,179,357,535,713;1,2,3,4,5})","v":2},{"$f":"LOOKUP(OFFSET($D772,0,$B$12),{0,90,179,268,357,446,535,624,713,802;1,2,3,4,5,6,7,8,9,10})","v":3},600,720,713,276,2309,"Northern Ireland",2309,null,null,null,null,null,null,null,"South_1"]
["95VV17S2","Forkhill_2","N09000010","Newry, Mourne and Down",2,272,395,624,94,472,635,100,"Rural",303650,315889,{"$error":"#N/A"},"N06000011","Newry & Armagh",{"$f":"LOOKUP(OFFSET($D773,0,$B$12),{0,179,357,535,713;1,2,3,4,5})","v":1},{"$f":"LOOKUP(OFFSET($D773,0,$B$12),{0,90,179,268,357,446,535,624,713,802;1,2,3,4,5,6,7,8,9,10})","v":2},663,756,766,224,2409,"Northern Ireland",2409,null,null,null,null,null,null,null,"South_2"]
["95VV18S1","Kilkeel Central_1","N09000010","Newry, Mourne and Down",376,534,570,405,563,437,333,540,"Urban",331165,315043,{"$error":"#N/A"},"N06000015","South Down",{"$f":"LOOKUP(OFFSET($D774,0,$B$12),{0,179,357,535,713;1,2,3,4,5})","v":4},{"$f":"LOOKUP(OFFSET($D774,0,$B$12),{0,90,179,268,357,446,535,624,713,802;1,2,3,4,5,6,7,8,9,10})","v":7},425,615,565,304,1909,"Northern Ireland",1909,null,null,null,null,null,null,null,"Spelga"]
["95VV18S2","Kilkeel Central_2","N09000010","Newry, Mourne and Down",445,177,212,272,383,234,185,258,"Mixed urban/rural",330371,314829,{"$error":"#N/A"},"N06000015","South Down",{"$f":"LOOKUP(OFFSET($D775,0,$B$12),{0,179,357,535,713;1,2,3,4,5})","v":2},{"$f":"LOOKUP(OFFSET($D775,0,$B$12),{0,90,179,268,357,446,535,624,713,802;1,2,3,4,5,6,7,8,9,10})","v":3},320,560,546,341,1767,"Northern Ireland",1767,null,null,null,null,null,null,null,"Springfarm_1"]
["95VV19S1","Kilkeel South_1","N09000010","Newry, Mourne and Down",570,412,514,335,345,623,190,500,"Urban",330588,313872,{"$error":"#N/A"},"N06000015","South Down",{"$f":"LOOKUP(OFFSET($D776,0,$B$12),{0,179,357,535,713;1,2,3,4,5})","v":3},{"$f":"LOOKUP(OFFSET($D776,0,$B$12),{0,90,179,268,357,446,535,624,713,802;1,2,3,4,5,6,7,8,9,10})","v":6},256,389,388,280,1312,"Northern Ireland",1312,null,null,null,null,null,null,null,"Springfarm_2"]
["95VV19S2","Kilkeel South_2","N09000010","Newry, Mourne and Down",78,122,158,201,401,365,228,113,"Urban",329566,314506,{"$error":"#N/A"},"N06000015","South Down",{"$f":"LOOKUP(OFFSET($D777,0,$B$12),{0,179,357,535,713;1,2,3,4,5})","v":1},{"$f":"LOOKUP(OFFSET($D777,0,$B$12),{0,90,179,268,357,446,535,624,713,802;1,2,3,4,5,6,7,8,9,10})","v":2},440,546,461,202,1650,"Northern Ireland",1650,null,null,null,null,null,null,null,"Springhill_1"]
["95VV20W1","Lisnacree","N09000010","Newry, Mourne and Down",269,489,525,509,28,351,525,336,"Rural",327380,315322,{"$error":"#N/A"},"N06000015","South Down",{"$f":"LOOKUP(OFFSET($D778,0,$B$12),{0,179,357,535,713;1,2,3,4,5})","v":2},{"$f":"LOOKUP(OFFSET($D778,0,$B$12),{0,90,179,268,357,446,535,624,713,802;1,2,3,4,5,6,7,8,9,10})","v":4},730,952,1024,460,3165,"Northern Ireland",3165,null,null,null,null,null,null,null,"Springhill_2"]
["95VV21S1","Mayobridge_1","N09000010","Newry, Mourne and Down",144,514,552,506,147,731,823,378,"Rural",316045,329088,{"$error":"#N/A"},"N06000015","South Down",{"$f":"LOOKUP(OFFSET($D779,0,$B$12),{0,179,357,535,713;1,2,3,4,5})","v":3},{"$f":"LOOKUP(OFFSET($D779,0,$B$12),{0,90,179,268,357,446,535,624,713,802;1,2,3,4,5,6,7,8,9,10})","v":5},643,794,786,238,2462,"Northern Ireland",2462,null,null,null,null,null,null,null,"Springtown_1"]
["95VV21S2","Mayobridge_2","N09000010","Newry, Mourne and Down",540,716,696,766,29,611,853,587,"Rural",316639,327181,{"$error":"#N/A"},"N06000015","South Down",{"$f":"LOOKUP(OFFSET($D780,0,$B$12),{0,179,357,535,713;1,2,3,4,5})","v":4},{"$f":"LOOKUP(OFFSET($D780,0,$B$12),{0,90,179,268,357,446,535,624,713,802;1,2,3,4,5,6,7,8,9,10})","v":7},513,628,579,207,1928,"Northern Ireland",1928,null,null,null,null,null,null,null,"Springtown_2"]
["95VV22W1","Newtownhamilton","N09000010","Newry, Mourne and Down",13,389,484,403,37,217,361,111,"Rural",293673,326999,{"$error":"#N/A"},"N06000011","Newry & Armagh",{"$f":"LOOKUP(OFFSET($D781,0,$B$12),{0,179,357,535,713;1,2,3,4,5})","v":1},{"$f":"LOOKUP(OFFSET($D781,0,$B$12),{0,90,179,268,357,446,535,624,713,802;1,2,3,4,5,6,7,8,9,10})","v":2},850,1062,889,364,3166,"Northern Ireland",3166,null,null,null,null,null,null,null,"St Mary's"]
["95VV23W1","Rostrevor","N09000010","Newry, Mourne and Down",216,447,520,560,248,133,491,385,"Rural",318741,317978,{"$error":"#N/A"},"N06000015","South Down",{"$f":"LOOKUP(OFFSET($D782,0,$B$12),{0,179,357,535,713;1,2,3,4,5})","v":3},{"$f":"LOOKUP(OFFSET($D782,0,$B$12),{0,90,179,268,357,446,535,624,713,802;1,2,3,4,5,6,7,8,9,10})","v":5},529,808,998,530,2865,"Northern Ireland",2865,null,null,null,null,null,null,null,"St Patrick's_1"]
["95VV24S1","Seaview_1","N09000010","Newry, Mourne and Down",394,616,663,830,468,190,348,620,"Urban",315070,318471,{"$error":"#N/A"},"N06000015","South Down",{"$f":"LOOKUP(OFFSET($D783,0,$B$12),{0,179,357,535,713;1,2,3,4,5})","v":4},{"$f":"LOOKUP(OFFSET($D783,0,$B$12),{0,90,179,268,357,446,535,624,713,802;1,2,3,4,5,6,7,8,9,10})","v":7},284,434,563,335,1616,"Northern Ireland",1616,null,null,null,null,null,null,null,"St Patrick's_2"]
["95VV24S2","Seaview_2","N09000010","Newry, Mourne and Down",152,250,257,349,528,322,402,244,"Urban",314598,318585,{"$error":"#N/A"},"N06000015","South Down",{"$f":"LOOKUP(OFFSET($D784,0,$B$12),{0,179,357,535,713;1,2,3,4,5})","v":2},{"$f":"LOOKUP(OFFSET($D784,0,$B$12),{0,90,179,268,357,446,535,624,713,802;1,2,3,4,5,6,7,8,9,10})","v":3},305,483,488,300,1576,"Northern Ireland",1576,null,null,null,null,null,null,null,"Steeple"]
["95VV25S1","Silver Bridge_1","N09000010","Newry, Mourne and Down",3,253,380,491,78,638,702,94,"Rural",297445,317630,{"$error":"#N/A"},"N06000011","Newry & Armagh",{"$f":"LOOKUP(OFFSET($D785,0,$B$12),{0,179,357,535,713;1,2,3,4,5})","v":1},{"$f":"LOOKUP(OFFSET($D785,0,$B$12),{0,90,179,268,357,446,535,624,713,802;1,2,3,4,5,6,7,8,9,10})","v":2},545,619,556,238,1958,"Northern Ireland",1958,null,null,null,null,null,null,null,"Stewartstown"]
["95VV25S2","Silver Bridge_2","N09000010","Newry, Mourne and Down",36,454,664,689,67,535,848,220,"Rural",299269,321061,{"$error":"#N/A"},"N06000011","Newry & Armagh",{"$f":"LOOKUP(OFFSET($D786,0,$B$12),{0,179,357,535,713;1,2,3,4,5})","v":2},{"$f":"LOOKUP(OFFSET($D786,0,$B$12),{0,90,179,268,357,446,535,624,713,802;1,2,3,4,5,6,7,8,9,10})","v":3},511,657,628,242,2039,"Northern Ireland",2039,null,null,null,null,null,null,null,"Stiles"]
["95VV26W1","Spelga","N09000010","Newry, Mourne and Down",91,471,485,510,154,408,552,284,"Rural",322049,329822,{"$error":"#N/A"},"N06000015","South Down",{"$f":"LOOKUP(OFFSET($D787,0,$B$12),{0,179,357,535,713;1,2,3,4,5})","v":2},{"$f":"LOOKUP(OFFSET($D787,0,$B$12),{0,90,179,268,357,446,535,624,713,802;1,2,3,4,5,6,7,8,9,10})","v":4},990,1229,1105,426,3750,"Northern Ireland",3750,null,null,null,null,null,null,null,"Stormont_1"]
["95VV27W1","St Mary's","N09000010","Newry, Mourne and Down",334,203,188,216,482,74,128,207,"Urban",309176,325280,{"$error":"#N/A"},"N06000011","Newry & Armagh",{"$f":"LOOKUP(OFFSET($D788,0,$B$12),{0,179,357,535,713;1,2,3,4,5})","v":2},{"$f":"LOOKUP(OFFSET($D788,0,$B$12),{0,90,179,268,357,446,535,624,713,802;1,2,3,4,5,6,7,8,9,10})","v":3},430,821,690,433,2375,"Northern Ireland",2375,null,null,null,null,null,null,null,"Stormont_2"]
["95VV28S1","St Patrick's_1","N09000010","Newry, Mourne and Down",415,323,377,429,542,90,308,400,"Urban",309360,326879,{"$error":"#N/A"},"N06000011","Newry & Armagh",{"$f":"LOOKUP(OFFSET($D789,0,$B$12),{0,179,357,535,713;1,2,3,4,5})","v":3},{"$f":"LOOKUP(OFFSET($D789,0,$B$12),{0,90,179,268,357,446,535,624,713,802;1,2,3,4,5,6,7,8,9,10})","v":5},547,755,697,322,2321,"Northern Ireland",2321,null,null,null,null,null,null,null,"Stormont_3"]
["95VV28S2","St Patrick's_2","N09000010","Newry, Mourne and Down",103,163,154,314,643,38,49,126,"Urban",309100,326421,{"$error":"#N/A"},"N06000011","Newry & Armagh",{"$f":"LOOKUP(OFFSET($D790,0,$B$12),{0,179,357,535,713;1,2,3,4,5})","v":1},{"$f":"LOOKUP(OFFSET($D790,0,$B$12),{0,90,179,268,357,446,535,624,713,802;1,2,3,4,5,6,7,8,9,10})","v":2},222,419,415,230,1286,"Northern Ireland",1286,null,null,null,null,null,null,null,"Strand_1_Coleraine"]
["95VV29W1","Tullyhappy","N09000010","Newry, Mourne and Down",82,622,712,561,97,378,694,322,"Rural",303331,331991,{"$error":"#N/A"},"N06000011","Newry & Armagh",{"$f":"LOOKUP(OFFSET($D791,0,$B$12),{0,179,357,535,713;1,2,3,4,5})","v":2},{"$f":"LOOKUP(OFFSET($D791,0,$B$12),{0,90,179,268,357,446,535,624,713,802;1,2,3,4,5,6,7,8,9,10})","v":4},961,1031,1089,415,3497,"Northern Ireland",3497,null,null,null,null,null,null,null,"Strand_1_Derry"]
["95VV30S1","Windsor Hill_1","N09000010","Newry, Mourne and Down",701,567,698,765,492,179,594,710,"Urban",309428,327540,{"$error":"#N/A"},"N06000011","Newry & Armagh",{"$f":"LOOKUP(OFFSET($D792,0,$B$12),{0,179,357,535,713;1,2,3,4,5})","v":4},{"$f":"LOOKUP(OFFSET($D792,0,$B$12),{0,90,179,268,357,446,535,624,713,802;1,2,3,4,5,6,7,8,9,10})","v":8},295,477,545,304,1622,"Northern Ireland",1622,null,null,null,null,null,null,null,"Strand_2_Coleraine"]
["95VV30S2","Windsor Hill_2","N09000010","Newry, Mourne and Down",491,315,250,291,504,416,162,370,"Urban",308609,328303,{"$error":"#N/A"},"N06000011","Newry & Armagh",{"$f":"LOOKUP(OFFSET($D793,0,$B$12),{0,179,357,535,713;1,2,3,4,5})","v":3},{"$f":"LOOKUP(OFFSET($D793,0,$B$12),{0,90,179,268,357,446,535,624,713,802;1,2,3,4,5,6,7,8,9,10})","v":5},299,499,420,267,1485,"Northern Ireland",1485,null,null,null,null,null,null,null,"Strand_2_Derry"]
["95WW01S1","Abbey_1","N09000001","Antrim and Newtownabbey",595,295,397,269,728,312,319,451,"Urban",335411,381922,{"$error":"#N/A"},"N06000002","Belfast North",{"$f":"LOOKUP(OFFSET($D794,0,$B$12),{0,179,357,535,713;1,2,3,4,5})","v":3},{"$f":"LOOKUP(OFFSET($D794,0,$B$12),{0,90,179,268,357,446,535,624,713,802;1,2,3,4,5,6,7,8,9,10})","v":6},208,391,478,401,1479,"Northern Ireland",1479,null,null,null,null,null,null,null,"Strangford"]
["95WW01S2","Abbey_2","N09000001","Antrim and Newtownabbey",398,401,337,354,771,261,193,428,"Urban",334936,382693,{"$error":"#N/A"},"N06000002","Belfast North",{"$f":"LOOKUP(OFFSET($D795,0,$B$12),{0,179,357,535,713;1,2,3,4,5})","v":3},{"$f":"LOOKUP(OFFSET($D795,0,$B$12),{0,90,179,268,357,446,535,624,713,802;1,2,3,4,5,6,7,8,9,10})","v":5},292,429,397,194,1312,"Northern Ireland",1312,null,null,null,null,null,null,null,"Stranmillis_1"]
["95WW02S1","Ballyclare North_1","N09000001","Antrim and Newtownabbey",531,324,343,346,600,875,423,489,"Urban",328031,391163,{"$error":"#N/A"},"N06000014","South Antrim",{"$f":"LOOKUP(OFFSET($D796,0,$B$12),{0,179,357,535,713;1,2,3,4,5})","v":3},{"$f":"LOOKUP(OFFSET($D796,0,$B$12),{0,90,179,268,357,446,535,624,713,802;1,2,3,4,5,6,7,8,9,10})","v":6},409,502,600,376,1887,"Northern Ireland",1887,null,null,null,null,null,null,null,"Stranmillis_2"]
["95WW02S2","Ballyclare North_2","N09000001","Antrim and Newtownabbey",372,594,547,358,570,883,416,571,"Urban",328450,392110,{"$error":"#N/A"},"N06000014","South Antrim",{"$f":"LOOKUP(OFFSET($D797,0,$B$12),{0,179,357,535,713;1,2,3,4,5})","v":4},{"$f":"LOOKUP(OFFSET($D797,0,$B$12),{0,90,179,268,357,446,535,624,713,802;1,2,3,4,5,6,7,8,9,10})","v":7},509,661,733,296,2199,"Northern Ireland",2199,null,null,null,null,null,null,null,"Stranmillis_3"]
["95WW03S1","Ballyclare South_1","N09000001","Antrim and Newtownabbey",484,244,283,161,644,373,244,324,"Urban",328837,391154,{"$error":"#N/A"},"N06000014","South Antrim",{"$f":"LOOKUP(OFFSET($D798,0,$B$12),{0,179,357,535,713;1,2,3,4,5})","v":2},{"$f":"LOOKUP(OFFSET($D798,0,$B$12),{0,90,179,268,357,446,535,624,713,802;1,2,3,4,5,6,7,8,9,10})","v":4},249,483,497,329,1557,"Northern Ireland",1557,null,null,null,null,null,null,null,"Stranmillis_4"]
["95WW03S2","Ballyclare South_2","N09000001","Antrim and Newtownabbey",762,648,627,452,520,750,583,732,"Urban",329250,391594,{"$error":"#N/A"},"N06000014","South Antrim",{"$f":"LOOKUP(OFFSET($D799,0,$B$12),{0,179,357,535,713;1,2,3,4,5})","v":5},{"$f":"LOOKUP(OFFSET($D799,0,$B$12),{0,90,179,268,357,446,535,624,713,802;1,2,3,4,5,6,7,8,9,10})","v":9},492,655,675,253,2075,"Northern Ireland",2075,null,null,null,null,null,null,null,"Stranocum"]
["95WW04S1","Ballyduff_1","N09000001","Antrim and Newtownabbey",616,439,341,200,479,571,498,486,"Urban",332977,384066,{"$error":"#N/A"},"N06000014","South Antrim",{"$f":"LOOKUP(OFFSET($D800,0,$B$12),{0,179,357,535,713;1,2,3,4,5})","v":3},{"$f":"LOOKUP(OFFSET($D800,0,$B$12),{0,90,179,268,357,446,535,624,713,802;1,2,3,4,5,6,7,8,9,10})","v":6},358,551,403,251,1563,"Northern Ireland",1563,null,null,null,null,null,null,null,"Strule"]
["95WW04S2","Ballyduff_2","N09000001","Antrim and Newtownabbey",774,530,426,356,665,558,658,654,"Urban",332542,384124,{"$error":"#N/A"},"N06000014","South Antrim",{"$f":"LOOKUP(OFFSET($D801,0,$B$12),{0,179,357,535,713;1,2,3,4,5})","v":4},{"$f":"LOOKUP(OFFSET($D801,0,$B$12),{0,90,179,268,357,446,535,624,713,802;1,2,3,4,5,6,7,8,9,10})","v":8},216,338,367,266,1186,"Northern Ireland",1186,null,null,null,null,null,null,null,"Summerfield"]
["95WW05S1","Ballyhenry_1","N09000001","Antrim and Newtownabbey",810,694,578,472,619,140,540,705,"Urban",330846,383076,{"$f":"IF(B802=$F$27,O802,NA())","v":{"$error":"#N/A"}},"N06000002","Belfast North",{"$f":"LOOKUP(OFFSET($D802,0,$B$12),{0,179,357,535,713;1,2,3,4,5})","v":4},{"$f":"LOOKUP(OFFSET($D802,0,$B$12),{0,90,179,268,357,446,535,624,713,802;1,2,3,4,5,6,7,8,9,10})","v":8},286,452,509,250,1497,"Northern Ireland",{"$f":"CHOOSE($K$5,$Y802,IF($D802=$B$27,$Y802,\"\"),IF($R802=$B$27,$Y802,\"\"))","v":1497},null,null,null,null,null,null,null,"Sunnylands"]
["95WW05S2","Ballyhenry_2","N09000001","Antrim and Newtownabbey",702,370,318,294,820,248,369,507,"Urban",331516,382972,{"$error":"#N/A"},"N06000002","Belfast North",{"$f":"LOOKUP(OFFSET($D803,0,$B$12),{0,179,357,535,713;1,2,3,4,5})","v":3},{"$f":"LOOKUP(OFFSET($D803,0,$B$12),{0,90,179,268,357,446,535,624,713,802;1,2,3,4,5,6,7,8,9,10})","v":6},206,320,396,335,1257,"Northern Ireland",1257,null,null,null,null,null,null,null,"Swatragh_1"]
["95WW06S1","Ballynure_1","N09000001","Antrim and Newtownabbey",647,811,848,628,74,207,713,653,"Mixed urban/rural",332954,389402,{"$error":"#N/A"},"N06000014","South Antrim",{"$f":"LOOKUP(OFFSET($D804,0,$B$12),{0,179,357,535,713;1,2,3,4,5})","v":4},{"$f":"LOOKUP(OFFSET($D804,0,$B$12),{0,90,179,268,357,446,535,624,713,802;1,2,3,4,5,6,7,8,9,10})","v":8},288,422,584,282,1575,"Northern Ireland",1575,null,null,null,null,null,null,null,"Swatragh_2"]
["95WW06S2","Ballynure_2","N09000001","Antrim and Newtownabbey",719,809,851,809,235,812,650,800,"Rural",331205,393323,{"$error":"#N/A"},"N06000014","South Antrim",{"$f":"LOOKUP(OFFSET($D805,0,$B$12),{0,179,357,535,713;1,2,3,4,5})","v":5},{"$f":"LOOKUP(OFFSET($D805,0,$B$12),{0,90,179,268,357,446,535,624,713,802;1,2,3,4,5,6,7,8,9,10})","v":9},349,425,630,315,1719,"Northern Ireland",1719,null,null,null,null,null,null,null,"Sydenham_1"]
["95WW07S1","Ballyrobert_1","N09000001","Antrim and Newtownabbey",785,789,854,769,224,232,808,777,"Rural",329264,387654,{"$error":"#N/A"},"N06000014","South Antrim",{"$f":"LOOKUP(OFFSET($D806,0,$B$12),{0,179,357,535,713;1,2,3,4,5})","v":5},{"$f":"LOOKUP(OFFSET($D806,0,$B$12),{0,90,179,268,357,446,535,624,713,802;1,2,3,4,5,6,7,8,9,10})","v":9},377,521,734,365,1998,"Northern Ireland",1998,null,null,null,null,null,null,null,"Sydenham_2"]
["95WW07S2","Ballyrobert_2","N09000001","Antrim and Newtownabbey",850,731,707,485,351,445,621,748,"Urban",328327,390586,{"$error":"#N/A"},"N06000014","South Antrim",{"$f":"LOOKUP(OFFSET($D807,0,$B$12),{0,179,357,535,713;1,2,3,4,5})","v":5},{"$f":"LOOKUP(OFFSET($D807,0,$B$12),{0,90,179,268,357,446,535,624,713,802;1,2,3,4,5,6,7,8,9,10})","v":9},505,690,832,384,2411,"Northern Ireland",2411,null,null,null,null,null,null,null,"Sydenham_3"]
["95WW08S1","Burnthill_1","N09000001","Antrim and Newtownabbey",839,668,624,498,761,245,586,754,"Urban",331686,383350,{"$error":"#N/A"},"N06000014","South Antrim",{"$f":"LOOKUP(OFFSET($D808,0,$B$12),{0,179,357,535,713;1,2,3,4,5})","v":5},{"$f":"LOOKUP(OFFSET($D808,0,$B$12),{0,90,179,268,357,446,535,624,713,802;1,2,3,4,5,6,7,8,9,10})","v":9},219,327,346,227,1118,"Northern Ireland",1118,null,null,null,null,null,null,null,"Taghnevan"]
["95WW08S2","Burnthill_2","N09000001","Antrim and Newtownabbey",873,653,603,516,683,348,519,759,"Urban",331813,383581,{"$error":"#N/A"},"N06000014","South Antrim",{"$f":"LOOKUP(OFFSET($D809,0,$B$12),{0,179,357,535,713;1,2,3,4,5})","v":5},{"$f":"LOOKUP(OFFSET($D809,0,$B$12),{0,90,179,268,357,446,535,624,713,802;1,2,3,4,5,6,7,8,9,10})","v":9},207,318,416,371,1311,"Northern Ireland",1311,null,null,null,null,null,null,null,"Tandragee"]
["95WW09S1","Carnmoney_1","N09000001","Antrim and Newtownabbey",245,143,170,69,547,482,362,165,"Urban",331675,384065,{"$error":"#N/A"},"N06000014","South Antrim",{"$f":"LOOKUP(OFFSET($D810,0,$B$12),{0,179,357,535,713;1,2,3,4,5})","v":1},{"$f":"LOOKUP(OFFSET($D810,0,$B$12),{0,90,179,268,357,446,535,624,713,802;1,2,3,4,5,6,7,8,9,10})","v":2},284,379,367,297,1327,"Northern Ireland",1327,null,null,null,null,null,null,null,"Tavanagh"]
["95WW09S2","Carnmoney_2","N09000001","Antrim and Newtownabbey",888,680,643,619,653,224,618,782,"Urban",332373,383683,{"$error":"#N/A"},"N06000014","South Antrim",{"$f":"LOOKUP(OFFSET($D811,0,$B$12),{0,179,357,535,713;1,2,3,4,5})","v":5},{"$f":"LOOKUP(OFFSET($D811,0,$B$12),{0,90,179,268,357,446,535,624,713,802;1,2,3,4,5,6,7,8,9,10})","v":9},215,278,393,396,1282,"Northern Ireland",1282,null,null,null,null,null,null,null,"Templepatrick"]
["95WW10S1","Cloughfern_1","N09000001","Antrim and Newtownabbey",691,532,390,446,494,789,286,618,"Urban",334043,383264,{"$error":"#N/A"},"N06000002","Belfast North",{"$f":"LOOKUP(OFFSET($D812,0,$B$12),{0,179,357,535,713;1,2,3,4,5})","v":4},{"$f":"LOOKUP(OFFSET($D812,0,$B$12),{0,90,179,268,357,446,535,624,713,802;1,2,3,4,5,6,7,8,9,10})","v":7},360,500,550,213,1623,"Northern Ireland",1623,null,null,null,null,null,null,null,"Tempo"]
["95WW10S2","Cloughfern_2","N09000001","Antrim and Newtownabbey",625,313,349,278,764,364,322,469,"Urban",334599,382973,{"$error":"#N/A"},"N06000002","Belfast North",{"$f":"LOOKUP(OFFSET($D813,0,$B$12),{0,179,357,535,713;1,2,3,4,5})","v":3},{"$f":"LOOKUP(OFFSET($D813,0,$B$12),{0,90,179,268,357,446,535,624,713,802;1,2,3,4,5,6,7,8,9,10})","v":6},252,378,334,263,1227,"Northern Ireland",1227,null,null,null,null,null,null,null,"Termon"]
["95WW11S1","Collinbridge_1","N09000001","Antrim and Newtownabbey",780,819,680,763,398,575,489,802,"Urban",331355,381556,{"$error":"#N/A"},"N06000002","Belfast North",{"$f":"LOOKUP(OFFSET($D814,0,$B$12),{0,179,357,535,713;1,2,3,4,5})","v":5},{"$f":"LOOKUP(OFFSET($D814,0,$B$12),{0,90,179,268,357,446,535,624,713,802;1,2,3,4,5,6,7,8,9,10})","v":10},348,466,634,213,1661,"Northern Ireland",1661,null,null,null,null,null,null,null,"The Birches_1"]
["95WW11S2","Collinbridge_2","N09000001","Antrim and Newtownabbey",857,699,661,733,647,184,224,760,"Urban",332027,381689,{"$error":"#N/A"},"N06000002","Belfast North",{"$f":"LOOKUP(OFFSET($D815,0,$B$12),{0,179,357,535,713;1,2,3,4,5})","v":5},{"$f":"LOOKUP(OFFSET($D815,0,$B$12),{0,90,179,268,357,446,535,624,713,802;1,2,3,4,5,6,7,8,9,10})","v":9},227,379,430,304,1340,"Northern Ireland",1340,null,null,null,null,null,null,null,"The Birches_2"]
["95WW12W1","Coole","N09000001","Antrim and Newtownabbey",148,90,107,71,816,233,199,103,"Urban",334427,382119,{"$error":"#N/A"},"N06000002","Belfast North",{"$f":"LOOKUP(OFFSET($D816,0,$B$12),{0,179,357,535,713;1,2,3,4,5})","v":1},{"$f":"LOOKUP(OFFSET($D816,0,$B$12),{0,90,179,268,357,446,535,624,713,802;1,2,3,4,5,6,7,8,9,10})","v":2},506,742,700,379,2327,"Northern Ireland",2327,null,null,null,null,null,null,null,"The Cut"]
["95WW13S1","Doagh_1","N09000001","Antrim and Newtownabbey",744,795,806,720,287,665,767,799,"Rural",325977,389983,{"$error":"#N/A"},"N06000014","South Antrim",{"$f":"LOOKUP(OFFSET($D817,0,$B$12),{0,179,357,535,713;1,2,3,4,5})","v":5},{"$f":"LOOKUP(OFFSET($D817,0,$B$12),{0,90,179,268,357,446,535,624,713,802;1,2,3,4,5,6,7,8,9,10})","v":9},348,519,648,328,1843,"Northern Ireland",1843,null,null,null,null,null,null,null,"The Cuts_1"]
["95WW13S2","Doagh_2","N09000001","Antrim and Newtownabbey",530,769,747,645,211,656,604,694,"Rural",326234,392485,{"$error":"#N/A"},"N06000014","South Antrim",{"$f":"LOOKUP(OFFSET($D818,0,$B$12),{0,179,357,535,713;1,2,3,4,5})","v":4},{"$f":"LOOKUP(OFFSET($D818,0,$B$12),{0,90,179,268,357,446,535,624,713,802;1,2,3,4,5,6,7,8,9,10})","v":8},435,531,667,245,1878,"Northern Ireland",1878,null,null,null,null,null,null,null,"The Cuts_2"]
["95WW14W1","Dunanney","N09000001","Antrim and Newtownabbey",116,87,92,43,711,385,306,84,"Urban",333893,381777,{"$error":"#N/A"},"N06000002","Belfast North",{"$f":"LOOKUP(OFFSET($D819,0,$B$12),{0,179,357,535,713;1,2,3,4,5})","v":1},{"$f":"LOOKUP(OFFSET($D819,0,$B$12),{0,90,179,268,357,446,535,624,713,802;1,2,3,4,5,6,7,8,9,10})","v":1},520,739,676,345,2279,"Northern Ireland",2279,null,null,null,null,null,null,null,"The Diamond"]
["95WW15S1","Glebe_1_Newtownabbey","N09000001","Antrim and Newtownabbey",712,665,538,558,624,553,453,724,"Urban",332523,382083,{"$error":"#N/A"},"N06000002","Belfast North",{"$f":"LOOKUP(OFFSET($D820,0,$B$12),{0,179,357,535,713;1,2,3,4,5})","v":5},{"$f":"LOOKUP(OFFSET($D820,0,$B$12),{0,90,179,268,357,446,535,624,713,802;1,2,3,4,5,6,7,8,9,10})","v":9},410,519,489,236,1654,"Northern Ireland",1654,null,null,null,null,null,null,null,"The Highlands"]
["95WW15S2","Glebe_2_Newtownabbey","N09000001","Antrim and Newtownabbey",803,766,636,694,539,799,680,826,"Urban",332303,382881,{"$error":"#N/A"},"N06000002","Belfast North",{"$f":"LOOKUP(OFFSET($D821,0,$B$12),{0,179,357,535,713;1,2,3,4,5})","v":5},{"$f":"LOOKUP(OFFSET($D821,0,$B$12),{0,90,179,268,357,446,535,624,713,802;1,2,3,4,5,6,7,8,9,10})","v":10},266,467,587,308,1627,"Northern Ireland",1627,null,null,null,null,null,null,null,"The Loop"]
["95WW16S1","Glengormley_1","N09000001","Antrim and Newtownabbey",842,634,469,388,743,196,124,638,"Urban",332112,382388,{"$error":"#N/A"},"N06000002","Belfast North",{"$f":"LOOKUP(OFFSET($D822,0,$B$12),{0,179,357,535,713;1,2,3,4,5})","v":4},{"$f":"LOOKUP(OFFSET($D822,0,$B$12),{0,90,179,268,357,446,535,624,713,802;1,2,3,4,5,6,7,8,9,10})","v":8},342,523,483,293,1642,"Northern Ireland",1642,null,null,null,null,null,null,null,"The Mall"]
["95WW16S2","Glengormley_2","N09000001","Antrim and Newtownabbey",312,181,136,86,697,652,268,195,"Urban",331772,382991,{"$error":"#N/A"},"N06000002","Belfast North",{"$f":"LOOKUP(OFFSET($D823,0,$B$12),{0,179,357,535,713;1,2,3,4,5})","v":2},{"$f":"LOOKUP(OFFSET($D823,0,$B$12),{0,90,179,268,357,446,535,624,713,802;1,2,3,4,5,6,7,8,9,10})","v":3},231,398,356,238,1223,"Northern Ireland",1223,null,null,null,null,null,null,null,"The Mount_1"]
["95WW17W1","Hawthorne","N09000001","Antrim and Newtownabbey",756,349,293,222,615,696,445,495,"Urban",333301,384417,{"$error":"#N/A"},"N06000014","South Antrim",{"$f":"LOOKUP(OFFSET($D824,0,$B$12),{0,179,357,535,713;1,2,3,4,5})","v":3},{"$f":"LOOKUP(OFFSET($D824,0,$B$12),{0,90,179,268,357,446,535,624,713,802;1,2,3,4,5,6,7,8,9,10})","v":6},358,595,715,545,2214,"Northern Ireland",2214,null,null,null,null,null,null,null,"The Mount_2"]
["95WW18W1","Hightown","N09000001","Antrim and Newtownabbey",558,533,389,360,793,125,174,517,"Urban",331269,382384,{"$error":"#N/A"},"N06000002","Belfast North",{"$f":"LOOKUP(OFFSET($D825,0,$B$12),{0,179,357,535,713;1,2,3,4,5})","v":3},{"$f":"LOOKUP(OFFSET($D825,0,$B$12),{0,90,179,268,357,446,535,624,713,802;1,2,3,4,5,6,7,8,9,10})","v":6},416,656,678,523,2273,"Northern Ireland",2273,null,null,null,null,null,null,null,"The Vow"]
["95WW19S1","Jordanstown_1","N09000001","Antrim and Newtownabbey",727,624,595,724,692,701,538,779,"Urban",334457,384705,{"$error":"#N/A"},"N06000005","East Antrim",{"$f":"LOOKUP(OFFSET($D826,0,$B$12),{0,179,357,535,713;1,2,3,4,5})","v":5},{"$f":"LOOKUP(OFFSET($D826,0,$B$12),{0,90,179,268,357,446,535,624,713,802;1,2,3,4,5,6,7,8,9,10})","v":9},291,479,619,400,1788,"Northern Ireland",1788,null,null,null,null,null,null,null,"Tobermore"]
["95WW19S2","Jordanstown_2","N09000001","Antrim and Newtownabbey",854,879,872,876,390,564,876,878,"Urban",335091,384884,{"$error":"#N/A"},"N06000005","East Antrim",{"$f":"LOOKUP(OFFSET($D827,0,$B$12),{0,179,357,535,713;1,2,3,4,5})","v":5},{"$f":"LOOKUP(OFFSET($D827,0,$B$12),{0,90,179,268,357,446,535,624,713,802;1,2,3,4,5,6,7,8,9,10})","v":10},521,515,895,206,2136,"Northern Ireland",2136,null,null,null,null,null,null,null,"Tollymore_1"]
["95WW19S3","Jordanstown_3","N09000001","Antrim and Newtownabbey",815,877,880,879,363,546,878,871,"Urban",335645,384433,{"$error":"#N/A"},"N06000005","East Antrim",{"$f":"LOOKUP(OFFSET($D828,0,$B$12),{0,179,357,535,713;1,2,3,4,5})","v":5},{"$f":"LOOKUP(OFFSET($D828,0,$B$12),{0,90,179,268,357,446,535,624,713,802;1,2,3,4,5,6,7,8,9,10})","v":10},511,528,937,341,2317,"Northern Ireland",2317,null,null,null,null,null,null,null,"Tollymore_2"]
["95WW20S1","Mallusk_1","N09000001","Antrim and Newtownabbey",733,723,740,674,240,780,454,745,"Mixed urban/rural",327918,383497,{"$error":"#N/A"},"N06000014","South Antrim",{"$f":"LOOKUP(OFFSET($D829,0,$B$12),{0,179,357,535,713;1,2,3,4,5})","v":5},{"$f":"LOOKUP(OFFSET($D829,0,$B$12),{0,90,179,268,357,446,535,624,713,802;1,2,3,4,5,6,7,8,9,10})","v":9},349,471,682,297,1799,"Northern Ireland",1799,null,null,null,null,null,null,null,"Tonagh"]
["95WW20S2","Mallusk_2","N09000001","Antrim and Newtownabbey",749,854,781,594,317,772,568,792,"Urban",329996,382233,{"$error":"#N/A"},"N06000014","South Antrim",{"$f":"LOOKUP(OFFSET($D830,0,$B$12),{0,179,357,535,713;1,2,3,4,5})","v":5},{"$f":"LOOKUP(OFFSET($D830,0,$B$12),{0,90,179,268,357,446,535,624,713,802;1,2,3,4,5,6,7,8,9,10})","v":9},1663,2362,1575,232,5832,"Northern Ireland",5832,null,null,null,null,null,null,null,"Toome"]
["95WW20S3","Mallusk_3","N09000001","Antrim and Newtownabbey",874,833,846,799,376,206,844,839,"Urban",330910,383769,{"$error":"#N/A"},"N06000014","South Antrim",{"$f":"LOOKUP(OFFSET($D831,0,$B$12),{0,179,357,535,713;1,2,3,4,5})","v":5},{"$f":"LOOKUP(OFFSET($D831,0,$B$12),{0,90,179,268,357,446,535,624,713,802;1,2,3,4,5,6,7,8,9,10})","v":10},386,531,734,210,1861,"Northern Ireland",1861,null,null,null,null,null,null,null,"Town Parks"]
["95WW21S1","Monkstown_1","N09000001","Antrim and Newtownabbey",208,123,112,55,612,160,264,117,"Urban",334762,384224,{"$error":"#N/A"},"N06000005","East Antrim",{"$f":"LOOKUP(OFFSET($D832,0,$B$12),{0,179,357,535,713;1,2,3,4,5})","v":1},{"$f":"LOOKUP(OFFSET($D832,0,$B$12),{0,90,179,268,357,446,535,624,713,802;1,2,3,4,5,6,7,8,9,10})","v":2},299,460,458,286,1503,"Northern Ireland",1503,null,null,null,null,null,null,null,"Town Parks East_1"]
["95WW21S2","Monkstown_2","N09000001","Antrim and Newtownabbey",450,469,327,285,577,320,396,462,"Urban",335071,383450,{"$error":"#N/A"},"N06000005","East Antrim",{"$f":"LOOKUP(OFFSET($D833,0,$B$12),{0,179,357,535,713;1,2,3,4,5})","v":3},{"$f":"LOOKUP(OFFSET($D833,0,$B$12),{0,90,179,268,357,446,535,624,713,802;1,2,3,4,5,6,7,8,9,10})","v":6},522,726,619,164,2030,"Northern Ireland",2030,null,null,null,null,null,null,null,"Town Parks East_2"]
["95WW22S1","Mossley_1","N09000001","Antrim and Newtownabbey",796,725,563,475,620,272,472,722,"Urban",332401,384616,{"$error":"#N/A"},"N06000014","South Antrim",{"$f":"LOOKUP(OFFSET($D834,0,$B$12),{0,179,357,535,713;1,2,3,4,5})","v":5},{"$f":"LOOKUP(OFFSET($D834,0,$B$12),{0,90,179,268,357,446,535,624,713,802;1,2,3,4,5,6,7,8,9,10})","v":9},258,422,470,201,1351,"Northern Ireland",1351,null,null,null,null,null,null,null,"Town Parks West"]
["95WW22S2","Mossley_2","N09000001","Antrim and Newtownabbey",468,182,117,38,546,774,385,193,"Urban",331777,384623,{"$error":"#N/A"},"N06000014","South Antrim",{"$f":"LOOKUP(OFFSET($D835,0,$B$12),{0,179,357,535,713;1,2,3,4,5})","v":2},{"$f":"LOOKUP(OFFSET($D835,0,$B$12),{0,90,179,268,357,446,535,624,713,802;1,2,3,4,5,6,7,8,9,10})","v":3},377,509,497,245,1628,"Northern Ireland",1628,null,null,null,null,null,null,null,"Trillick"]
["95WW23S1","Rostulla_1","N09000001","Antrim and Newtownabbey",661,519,516,463,537,588,242,628,"Urban",335649,383147,{"$error":"#N/A"},"N06000005","East Antrim",{"$f":"LOOKUP(OFFSET($D836,0,$B$12),{0,179,357,535,713;1,2,3,4,5})","v":4},{"$f":"LOOKUP(OFFSET($D836,0,$B$12),{0,90,179,268,357,446,535,624,713,802;1,2,3,4,5,6,7,8,9,10})","v":8},406,736,734,414,2291,"Northern Ireland",2291,null,null,null,null,null,null,null,"Tullagh"]
["95WW23S2","Rostulla_2","N09000001","Antrim and Newtownabbey",881,887,877,767,590,551,890,886,"Urban",336309,383861,{"$error":"#N/A"},"N06000005","East Antrim",{"$f":"LOOKUP(OFFSET($D837,0,$B$12),{0,179,357,535,713;1,2,3,4,5})","v":5},{"$f":"LOOKUP(OFFSET($D837,0,$B$12),{0,90,179,268,357,446,535,624,713,802;1,2,3,4,5,6,7,8,9,10})","v":10},226,1190,555,289,2259,"Northern Ireland",2259,null,null,null,null,null,null,null,"Tullycarnet"]
["95WW24S1","Valley_1","N09000001","Antrim and Newtownabbey",470,241,198,214,802,391,151,319,"Urban",334246,380353,{"$error":"#N/A"},"N06000002","Belfast North",{"$f":"LOOKUP(OFFSET($D838,0,$B$12),{0,179,357,535,713;1,2,3,4,5})","v":2},{"$f":"LOOKUP(OFFSET($D838,0,$B$12),{0,90,179,268,357,446,535,624,713,802;1,2,3,4,5,6,7,8,9,10})","v":4},363,515,534,355,1767,"Northern Ireland",1767,null,null,null,null,null,null,null,"Tullyhappy"]
["95WW24S2","Valley_2","N09000001","Antrim and Newtownabbey",272,179,174,75,662,475,170,184,"Urban",334018,380980,{"$error":"#N/A"},"N06000002","Belfast North",{"$f":"LOOKUP(OFFSET($D839,0,$B$12),{0,179,357,535,713;1,2,3,4,5})","v":2},{"$f":"LOOKUP(OFFSET($D839,0,$B$12),{0,90,179,268,357,446,535,624,713,802;1,2,3,4,5,6,7,8,9,10})","v":3},448,746,566,230,1989,"Northern Ireland",1989,null,null,null,null,null,null,null,"Twinbrook_1"]
["95WW25W1","Whitehouse","N09000001","Antrim and Newtownabbey",194,102,123,111,617,487,225,135,"Urban",334671,381370,{"$error":"#N/A"},"N06000002","Belfast North",{"$f":"LOOKUP(OFFSET($D840,0,$B$12),{0,179,357,535,713;1,2,3,4,5})","v":1},{"$f":"LOOKUP(OFFSET($D840,0,$B$12),{0,90,179,268,357,446,535,624,713,802;1,2,3,4,5,6,7,8,9,10})","v":2},345,557,755,524,2181,"Northern Ireland",2181,null,null,null,null,null,null,null,"Twinbrook_2"]
["95XX01S1","Ballycrochan_1","N09000011","Ards and North Down",819,817,843,822,331,826,857,863,"Urban",353150,380152,{"$error":"#N/A"},"N06000013","North Down",{"$f":"LOOKUP(OFFSET($D841,0,$B$12),{0,179,357,535,713;1,2,3,4,5})","v":5},{"$f":"LOOKUP(OFFSET($D841,0,$B$12),{0,90,179,268,357,446,535,624,713,802;1,2,3,4,5,6,7,8,9,10})","v":10},293,436,646,307,1682,"Northern Ireland",1682,null,null,null,null,null,null,null,"University"]
["95XX01S2","Ballycrochan_2","N09000011","Ards and North Down",657,786,826,806,402,887,851,830,"Urban",352708,379757,{"$error":"#N/A"},"N06000013","North Down",{"$f":"LOOKUP(OFFSET($D842,0,$B$12),{0,179,357,535,713;1,2,3,4,5})","v":5},{"$f":"LOOKUP(OFFSET($D842,0,$B$12),{0,90,179,268,357,446,535,624,713,802;1,2,3,4,5,6,7,8,9,10})","v":10},413,553,765,125,1857,"Northern Ireland",1857,null,null,null,null,null,null,null,"Upper Braniel"]
["95XX01S3","Ballycrochan_3","N09000011","Ards and North Down",618,677,648,666,508,452,770,737,"Urban",352299,379831,{"$error":"#N/A"},"N06000013","North Down",{"$f":"LOOKUP(OFFSET($D843,0,$B$12),{0,179,357,535,713;1,2,3,4,5})","v":5},{"$f":"LOOKUP(OFFSET($D843,0,$B$12),{0,90,179,268,357,446,535,624,713,802;1,2,3,4,5,6,7,8,9,10})","v":9},314,431,577,253,1575,"Northern Ireland",1575,null,null,null,null,null,null,null,"Upper Glenshane"]
["95XX02W1","Ballyholme","N09000011","Ards and North Down",651,853,869,867,725,189,701,840,"Urban",351749,382089,{"$error":"#N/A"},"N06000013","North Down",{"$f":"LOOKUP(OFFSET($D844,0,$B$12),{0,179,357,535,713;1,2,3,4,5})","v":5},{"$f":"LOOKUP(OFFSET($D844,0,$B$12),{0,90,179,268,357,446,535,624,713,802;1,2,3,4,5,6,7,8,9,10})","v":10},527,567,964,658,2716,"Northern Ireland",2716,null,null,null,null,null,null,null,"Upper Malone_1"]
["95XX03S1","Ballymaconnell_1","N09000011","Ards and North Down",738,733,733,576,502,191,785,751,"Urban",353150,381235,{"$error":"#N/A"},"N06000013","North Down",{"$f":"LOOKUP(OFFSET($D845,0,$B$12),{0,179,357,535,713;1,2,3,4,5})","v":5},{"$f":"LOOKUP(OFFSET($D845,0,$B$12),{0,90,179,268,357,446,535,624,713,802;1,2,3,4,5,6,7,8,9,10})","v":9},213,233,423,340,1208,"Northern Ireland",1208,null,null,null,null,null,null,null,"Upper Malone_2"]
["95XX03S2","Ballymaconnell_2","N09000011","Ards and North Down",669,845,852,787,384,850,889,847,"Urban",353639,381217,{"$error":"#N/A"},"N06000013","North Down",{"$f":"LOOKUP(OFFSET($D846,0,$B$12),{0,179,357,535,713;1,2,3,4,5})","v":5},{"$f":"LOOKUP(OFFSET($D846,0,$B$12),{0,90,179,268,357,446,535,624,713,802;1,2,3,4,5,6,7,8,9,10})","v":10},255,391,477,307,1429,"Northern Ireland",1429,null,null,null,null,null,null,null,"Upper Malone_3"]
["95XX04S1","Ballymagee_1","N09000011","Ards and North Down",809,844,779,772,501,609,725,864,"Urban",352336,380642,{"$error":"#N/A"},"N06000013","North Down",{"$f":"LOOKUP(OFFSET($D847,0,$B$12),{0,179,357,535,713;1,2,3,4,5})","v":5},{"$f":"LOOKUP(OFFSET($D847,0,$B$12),{0,90,179,268,357,446,535,624,713,802;1,2,3,4,5,6,7,8,9,10})","v":10},326,425,679,365,1794,"Northern Ireland",1794,null,null,null,null,null,null,null,"Upper Springfield_1"]
["95XX04S2","Ballymagee_2","N09000011","Ards and North Down",684,609,602,515,555,864,418,714,"Urban",352606,380440,{"$error":"#N/A"},"N06000013","North Down",{"$f":"LOOKUP(OFFSET($D848,0,$B$12),{0,179,357,535,713;1,2,3,4,5})","v":5},{"$f":"LOOKUP(OFFSET($D848,0,$B$12),{0,90,179,268,357,446,535,624,713,802;1,2,3,4,5,6,7,8,9,10})","v":9},376,534,650,254,1814,"Northern Ireland",1814,null,null,null,null,null,null,null,"Upper Springfield_2"]
["95XX05W1","Bangor Castle","N09000011","Ards and North Down",533,517,495,410,685,630,217,585,"Urban",351147,380771,{"$error":"#N/A"},"N06000013","North Down",{"$f":"LOOKUP(OFFSET($D849,0,$B$12),{0,179,357,535,713;1,2,3,4,5})","v":4},{"$f":"LOOKUP(OFFSET($D849,0,$B$12),{0,90,179,268,357,446,535,624,713,802;1,2,3,4,5,6,7,8,9,10})","v":7},355,617,850,735,2558,"Northern Ireland",2558,null,null,null,null,null,null,null,"Upper Springfield_3"]
["95XX06S1","Bloomfield_1_NorthDown","N09000011","Ards and North Down",301,382,332,233,568,729,147,354,"Urban",351403,379976,{"$error":"#N/A"},"N06000013","North Down",{"$f":"LOOKUP(OFFSET($D850,0,$B$12),{0,179,357,535,713;1,2,3,4,5})","v":2},{"$f":"LOOKUP(OFFSET($D850,0,$B$12),{0,90,179,268,357,446,535,624,713,802;1,2,3,4,5,6,7,8,9,10})","v":4},469,617,580,321,1987,"Northern Ireland",1987,null,null,null,null,null,null,null,"Upperlands"]
["95XX06S2","Bloomfield_2_NorthDown","N09000011","Ards and North Down",399,494,408,417,517,869,318,523,"Urban",351714,379443,{"$error":"#N/A"},"N06000013","North Down",{"$f":"LOOKUP(OFFSET($D851,0,$B$12),{0,179,357,535,713;1,2,3,4,5})","v":3},{"$f":"LOOKUP(OFFSET($D851,0,$B$12),{0,90,179,268,357,446,535,624,713,802;1,2,3,4,5,6,7,8,9,10})","v":6},499,700,699,247,2145,"Northern Ireland",2145,null,null,null,null,null,null,null,"Valley"]
["95XX07S1","Broadway_1","N09000011","Ards and North Down",563,619,758,529,588,829,669,726,"Urban",352250,381303,{"$error":"#N/A"},"N06000013","North Down",{"$f":"LOOKUP(OFFSET($D852,0,$B$12),{0,179,357,535,713;1,2,3,4,5})","v":5},{"$f":"LOOKUP(OFFSET($D852,0,$B$12),{0,90,179,268,357,446,535,624,713,802;1,2,3,4,5,6,7,8,9,10})","v":9},184,331,446,388,1348,"Northern Ireland",1348,null,null,null,null,null,null,null,"Valley_1"]
["95XX07S2","Broadway_2","N09000011","Ards and North Down",781,788,744,813,746,688,661,868,"Urban",351541,381665,{"$error":"#N/A"},"N06000013","North Down",{"$f":"LOOKUP(OFFSET($D853,0,$B$12),{0,179,357,535,713;1,2,3,4,5})","v":5},{"$f":"LOOKUP(OFFSET($D853,0,$B$12),{0,90,179,268,357,446,535,624,713,802;1,2,3,4,5,6,7,8,9,10})","v":10},236,271,448,440,1394,"Northern Ireland",1394,null,null,null,null,null,null,null,"Valley_2"]
["95XX08S1","Bryansburn_1","N09000011","Ards and North Down",679,737,845,818,772,47,745,776,"Urban",349624,381344,{"$error":"#N/A"},"N06000013","North Down",{"$f":"LOOKUP(OFFSET($D854,0,$B$12),{0,179,357,535,713;1,2,3,4,5})","v":5},{"$f":"LOOKUP(OFFSET($D854,0,$B$12),{0,90,179,268,357,446,535,624,713,802;1,2,3,4,5,6,7,8,9,10})","v":9},200,295,480,334,1310,"Northern Ireland",1310,null,null,null,null,null,null,null,"Victoria Bridge"]
["95XX08S2","Bryansburn_2","N09000011","Ards and North Down",689,686,745,807,425,807,516,789,"Urban",348853,381277,{"$error":"#N/A"},"N06000013","North Down",{"$f":"LOOKUP(OFFSET($D855,0,$B$12),{0,179,357,535,713;1,2,3,4,5})","v":5},{"$f":"LOOKUP(OFFSET($D855,0,$B$12),{0,90,179,268,357,446,535,624,713,802;1,2,3,4,5,6,7,8,9,10})","v":9},183,267,386,412,1247,"Northern Ireland",1247,null,null,null,null,null,null,null,"Victoria_Carrickfergus"]
["95XX09S1","Churchill_1","N09000011","Ards and North Down",801,649,596,711,660,727,642,798,"Urban",352689,381502,{"$error":"#N/A"},"N06000013","North Down",{"$f":"LOOKUP(OFFSET($D856,0,$B$12),{0,179,357,535,713;1,2,3,4,5})","v":5},{"$f":"LOOKUP(OFFSET($D856,0,$B$12),{0,90,179,268,357,446,535,624,713,802;1,2,3,4,5,6,7,8,9,10})","v":9},226,261,392,548,1427,"Northern Ireland",1427,null,null,null,null,null,null,null,"Victoria_Derry"]
["95XX09S2","Churchill_2","N09000011","Ards and North Down",632,684,678,801,618,657,627,788,"Urban",352525,382007,{"$error":"#N/A"},"N06000013","North Down",{"$f":"LOOKUP(OFFSET($D857,0,$B$12),{0,179,357,535,713;1,2,3,4,5})","v":5},{"$f":"LOOKUP(OFFSET($D857,0,$B$12),{0,90,179,268,357,446,535,624,713,802;1,2,3,4,5,6,7,8,9,10})","v":9},257,353,535,324,1470,"Northern Ireland",1470,null,null,null,null,null,null,null,"Wallace Park_1"]
["95XX10S1","Clandeboye_1","N09000011","Ards and North Down",121,410,409,379,413,531,290,307,"Urban",348991,379857,{"$error":"#N/A"},"N06000013","North Down",{"$f":"LOOKUP(OFFSET($D858,0,$B$12),{0,179,357,535,713;1,2,3,4,5})","v":2},{"$f":"LOOKUP(OFFSET($D858,0,$B$12),{0,90,179,268,357,446,535,624,713,802;1,2,3,4,5,6,7,8,9,10})","v":4},499,541,592,157,1789,"Northern Ireland",1789,null,null,null,null,null,null,null,"Wallace Park_2"]
["95XX10S2","Clandeboye_2","N09000011","Ards and North Down",571,792,711,636,395,836,140,702,"Urban",349417,379496,{"$error":"#N/A"},"N06000013","North Down",{"$f":"LOOKUP(OFFSET($D859,0,$B$12),{0,179,357,535,713;1,2,3,4,5})","v":4},{"$f":"LOOKUP(OFFSET($D859,0,$B$12),{0,90,179,268,357,446,535,624,713,802;1,2,3,4,5,6,7,8,9,10})","v":8},439,579,655,164,1838,"Northern Ireland",1838,null,null,null,null,null,null,null,"Waringstown_1"]
["95XX10S3","Clandeboye_3","N09000011","Ards and North Down",283,426,388,124,587,735,447,356,"Urban",349088,380178,{"$error":"#N/A"},"N06000013","North Down",{"$f":"LOOKUP(OFFSET($D860,0,$B$12),{0,179,357,535,713;1,2,3,4,5})","v":2},{"$f":"LOOKUP(OFFSET($D860,0,$B$12),{0,90,179,268,357,446,535,624,713,802;1,2,3,4,5,6,7,8,9,10})","v":4},329,413,368,201,1312,"Northern Ireland",1312,null,null,null,null,null,null,null,"Waringstown_2"]
["95XX11S1","Conlig_1","N09000011","Ards and North Down",321,551,482,402,311,838,444,497,"Urban",350219,378265,{"$error":"#N/A"},"N06000013","North Down",{"$f":"LOOKUP(OFFSET($D861,0,$B$12),{0,179,357,535,713;1,2,3,4,5})","v":3},{"$f":"LOOKUP(OFFSET($D861,0,$B$12),{0,90,179,268,357,446,535,624,713,802;1,2,3,4,5,6,7,8,9,10})","v":6},676,939,869,299,2783,"Northern Ireland",2783,null,null,null,null,null,null,null,"Washing Bay"]
["95XX11S2","Conlig_2","N09000011","Ards and North Down",523,658,456,458,308,847,353,602,"Urban",350822,378818,{"$error":"#N/A"},"N06000013","North Down",{"$f":"LOOKUP(OFFSET($D862,0,$B$12),{0,179,357,535,713;1,2,3,4,5})","v":4},{"$f":"LOOKUP(OFFSET($D862,0,$B$12),{0,90,179,268,357,446,535,624,713,802;1,2,3,4,5,6,7,8,9,10})","v":7},703,1151,784,190,2829,"Northern Ireland",2829,null,null,null,null,null,null,null,"Water Works_1"]
["95XX11S3","Conlig_3","N09000011","Ards and North Down",95,192,86,192,445,881,172,134,"Urban",351308,379214,{"$error":"#N/A"},"N06000013","North Down",{"$f":"LOOKUP(OFFSET($D863,0,$B$12),{0,179,357,535,713;1,2,3,4,5})","v":1},{"$f":"LOOKUP(OFFSET($D863,0,$B$12),{0,90,179,268,357,446,535,624,713,802;1,2,3,4,5,6,7,8,9,10})","v":2},359,604,487,177,1627,"Northern Ireland",1627,null,null,null,null,null,null,null,"Water Works_2"]
["95XX12W1","Craigavad","N09000011","Ards and North Down",728,749,858,846,221,253,609,756,"Mixed urban/rural",344062,381242,{"$error":"#N/A"},"N06000013","North Down",{"$f":"LOOKUP(OFFSET($D864,0,$B$12),{0,179,357,535,713;1,2,3,4,5})","v":5},{"$f":"LOOKUP(OFFSET($D864,0,$B$12),{0,90,179,268,357,446,535,624,713,802;1,2,3,4,5,6,7,8,9,10})","v":9},425,521,988,639,2573,"Northern Ireland",2573,null,null,null,null,null,null,null,"Water Works_3"]
["95XX13W1","Crawfordsburn","N09000011","Ards and North Down",826,823,879,850,258,413,672,824,"Mixed urban/rural",347017,381697,{"$error":"#N/A"},"N06000013","North Down",{"$f":"LOOKUP(OFFSET($D865,0,$B$12),{0,179,357,535,713;1,2,3,4,5})","v":5},{"$f":"LOOKUP(OFFSET($D865,0,$B$12),{0,90,179,268,357,446,535,624,713,802;1,2,3,4,5,6,7,8,9,10})","v":10},441,544,947,921,2853,"Northern Ireland",2853,null,null,null,null,null,null,null,"Waterside"]
["95XX14W1","Cultra","N09000011","Ards and North Down",751,864,886,871,310,43,622,762,"Urban",341173,379785,{"$f":"IF(B866=$F$27,O866,NA())","v":{"$error":"#N/A"}},"N06000013","North Down",{"$f":"LOOKUP(OFFSET($D866,0,$B$12),{0,179,357,535,713;1,2,3,4,5})","v":5},{"$f":"LOOKUP(OFFSET($D866,0,$B$12),{0,90,179,268,357,446,535,624,713,802;1,2,3,4,5,6,7,8,9,10})","v":9},437,509,847,709,2502,"Northern Ireland",{"$f":"CHOOSE($K$5,$Y866,IF($D866=$B$27,$Y866,\"\"),IF($R866=$B$27,$Y866,\"\"))","v":2502},null,null,null,null,null,null,null,"West_1"]
["95XX15W1","Dufferin","N09000011","Ards and North Down",432,256,219,196,449,806,255,317,"Urban",348416,380470,{"$error":"#N/A"},"N06000013","North Down",{"$f":"LOOKUP(OFFSET($D867,0,$B$12),{0,179,357,535,713;1,2,3,4,5})","v":2},{"$f":"LOOKUP(OFFSET($D867,0,$B$12),{0,90,179,268,357,446,535,624,713,802;1,2,3,4,5,6,7,8,9,10})","v":4},484,769,842,494,2589,"Northern Ireland",2589,null,null,null,null,null,null,null,"West_2"]
["95XX16W1","Groomsport","N09000011","Ards and North Down",672,663,702,779,337,862,730,768,"Mixed urban/rural",353975,382850,{"$error":"#N/A"},"N06000013","North Down",{"$f":"LOOKUP(OFFSET($D868,0,$B$12),{0,179,357,535,713;1,2,3,4,5})","v":5},{"$f":"LOOKUP(OFFSET($D868,0,$B$12),{0,90,179,268,357,446,535,624,713,802;1,2,3,4,5,6,7,8,9,10})","v":9},369,493,1107,1066,3035,"Northern Ireland",3035,null,null,null,null,null,null,null,"Westland"]
["95XX17S1","Harbour_1","N09000011","Ards and North Down",173,202,307,324,757,21,6,174,"Urban",350343,381727,{"$error":"#N/A"},"N06000013","North Down",{"$f":"LOOKUP(OFFSET($D869,0,$B$12),{0,179,357,535,713;1,2,3,4,5})","v":1},{"$f":"LOOKUP(OFFSET($D869,0,$B$12),{0,90,179,268,357,446,535,624,713,802;1,2,3,4,5,6,7,8,9,10})","v":2},219,567,558,229,1573,"Northern Ireland",1573,null,null,null,null,null,null,null,"Whitehead"]
["95XX17S2","Harbour_2","N09000011","Ards and North Down",495,614,751,714,773,64,178,632,"Urban",350900,382187,{"$error":"#N/A"},"N06000013","North Down",{"$f":"LOOKUP(OFFSET($D870,0,$B$12),{0,179,357,535,713;1,2,3,4,5})","v":4},{"$f":"LOOKUP(OFFSET($D870,0,$B$12),{0,90,179,268,357,446,535,624,713,802;1,2,3,4,5,6,7,8,9,10})","v":8},260,431,571,250,1512,"Northern Ireland",1512,null,null,null,null,null,null,null,"Whitehill"]
["95XX18W1","Holywood Demesne","N09000011","Ards and North Down",430,722,681,648,694,91,425,647,"Urban",339814,378744,{"$error":"#N/A"},"N06000013","North Down",{"$f":"LOOKUP(OFFSET($D871,0,$B$12),{0,179,357,535,713;1,2,3,4,5})","v":4},{"$f":"LOOKUP(OFFSET($D871,0,$B$12),{0,90,179,268,357,446,535,624,713,802;1,2,3,4,5,6,7,8,9,10})","v":8},470,883,997,590,2940,"Northern Ireland",2940,null,null,null,null,null,null,null,"Whitehouse"]
["95XX19W1","Holywood Priory","N09000011","Ards and North Down",757,804,836,855,397,375,492,816,"Urban",340650,378892,{"$error":"#N/A"},"N06000013","North Down",{"$f":"LOOKUP(OFFSET($D872,0,$B$12),{0,179,357,535,713;1,2,3,4,5})","v":5},{"$f":"LOOKUP(OFFSET($D872,0,$B$12),{0,90,179,268,357,446,535,624,713,802;1,2,3,4,5,6,7,8,9,10})","v":10},487,554,1030,656,2728,"Northern Ireland",2728,null,null,null,null,null,null,null,"Whiterock_1"]
["95XX20S1","Loughview_1","N09000011","Ards and North Down",155,283,270,304,367,628,359,250,"Mixed urban/rural",339423,377741,{"$error":"#N/A"},"N06000013","North Down",{"$f":"LOOKUP(OFFSET($D873,0,$B$12),{0,179,357,535,713;1,2,3,4,5})","v":2},{"$f":"LOOKUP(OFFSET($D873,0,$B$12),{0,90,179,268,357,446,535,624,713,802;1,2,3,4,5,6,7,8,9,10})","v":3},432,598,679,328,2036,"Northern Ireland",2036,null,null,null,null,null,null,null,"Whiterock_2"]
["95XX20S2","Loughview_2","N09000011","Ards and North Down",244,855,816,133,562,223,624,480,"Urban",339300,377960,{"$error":"#N/A"},"N06000013","North Down",{"$f":"LOOKUP(OFFSET($D874,0,$B$12),{0,179,357,535,713;1,2,3,4,5})","v":3},{"$f":"LOOKUP(OFFSET($D874,0,$B$12),{0,90,179,268,357,446,535,624,713,802;1,2,3,4,5,6,7,8,9,10})","v":6},339,693,186,89,1307,"Northern Ireland",1307,null,null,null,null,null,null,null,"Whiterock_3"]
["95XX21W1","Princetown","N09000011","Ards and North Down",711,673,819,849,572,589,595,818,"Urban",349378,381869,{"$error":"#N/A"},"N06000013","North Down",{"$f":"LOOKUP(OFFSET($D875,0,$B$12),{0,179,357,535,713;1,2,3,4,5})","v":5},{"$f":"LOOKUP(OFFSET($D875,0,$B$12),{0,90,179,268,357,446,535,624,713,802;1,2,3,4,5,6,7,8,9,10})","v":10},460,527,983,916,2886,"Northern Ireland",2886,null,null,null,null,null,null,null,"Whitespots_1"]
["95XX22W1","Rathgael","N09000011","Ards and North Down",319,528,589,453,705,428,267,532,"Urban",349796,380500,{"$error":"#N/A"},"N06000013","North Down",{"$f":"LOOKUP(OFFSET($D876,0,$B$12),{0,179,357,535,713;1,2,3,4,5})","v":3},{"$f":"LOOKUP(OFFSET($D876,0,$B$12),{0,90,179,268,357,446,535,624,713,802;1,2,3,4,5,6,7,8,9,10})","v":6},340,566,737,467,2109,"Northern Ireland",2109,null,null,null,null,null,null,null,"Whitespots_2"]
["95XX23W1","Silverstream","N09000011","Ards and North Down",479,578,411,237,611,766,302,530,"Urban",349322,380849,{"$error":"#N/A"},"N06000013","North Down",{"$f":"LOOKUP(OFFSET($D877,0,$B$12),{0,179,357,535,713;1,2,3,4,5})","v":3},{"$f":"LOOKUP(OFFSET($D877,0,$B$12),{0,90,179,268,357,446,535,624,713,802;1,2,3,4,5,6,7,8,9,10})","v":6},581,1124,983,497,3184,"Northern Ireland",3184,null,null,null,null,null,null,null,"Windsor Hill_1"]
["95XX24S1","Springhill_1","N09000011","Ards and North Down",847,790,765,795,371,740,879,855,"Urban",347930,381101,{"$error":"#N/A"},"N06000013","North Down",{"$f":"LOOKUP(OFFSET($D878,0,$B$12),{0,179,357,535,713;1,2,3,4,5})","v":5},{"$f":"LOOKUP(OFFSET($D878,0,$B$12),{0,90,179,268,357,446,535,624,713,802;1,2,3,4,5,6,7,8,9,10})","v":10},224,317,436,348,1324,"Northern Ireland",1324,null,null,null,null,null,null,null,"Windsor Hill_2"]
["95XX24S2","Springhill_2","N09000011","Ards and North Down",586,593,692,579,691,569,801,731,"Urban",348340,381239,{"$error":"#N/A"},"N06000013","North Down",{"$f":"LOOKUP(OFFSET($D879,0,$B$12),{0,179,357,535,713;1,2,3,4,5})","v":5},{"$f":"LOOKUP(OFFSET($D879,0,$B$12),{0,90,179,268,357,446,535,624,713,802;1,2,3,4,5,6,7,8,9,10})","v":9},204,341,432,405,1383,"Northern Ireland",1383,null,null,null,null,null,null,null,"Windsor_1"]
["95XX25W1","Whitehill","N09000011","Ards and North Down",178,298,300,134,655,746,211,242,"Urban",350259,380466,{"$error":"#N/A"},"N06000013","North Down",{"$f":"LOOKUP(OFFSET($D880,0,$B$12),{0,179,357,535,713;1,2,3,4,5})","v":2},{"$f":"LOOKUP(OFFSET($D880,0,$B$12),{0,90,179,268,357,446,535,624,713,802;1,2,3,4,5,6,7,8,9,10})","v":3},545,731,803,443,2522,"Northern Ireland",2522,null,null,null,null,null,null,null,"Windsor_2"]
["95YY01W1","Beragh","N09000006","Fermanagh and Omagh",423,499,399,478,108,172,620,422,"Rural",251188,368665,{"$error":"#N/A"},"N06000018","West Tyrone",{"$f":"LOOKUP(OFFSET($D881,0,$B$12),{0,179,357,535,713;1,2,3,4,5})","v":3},{"$f":"LOOKUP(OFFSET($D881,0,$B$12),{0,90,179,268,357,446,535,624,713,802;1,2,3,4,5,6,7,8,9,10})","v":5},596,795,859,411,2661,"Northern Ireland",2661,null,null,null,null,null,null,null,"Windsor_3"]
["95YY02W1","Camowen","N09000006","Fermanagh and Omagh",426,169,147,457,455,818,379,312,"Urban",246495,373254,{"$error":"#N/A"},"N06000018","West Tyrone",{"$f":"LOOKUP(OFFSET($D882,0,$B$12),{0,179,357,535,713;1,2,3,4,5})","v":2},{"$f":"LOOKUP(OFFSET($D882,0,$B$12),{0,90,179,268,357,446,535,624,713,802;1,2,3,4,5,6,7,8,9,10})","v":4},407,649,758,531,2345,"Northern Ireland",2345,null,null,null,null,null,null,null,"Windsor_4"]
["95YY03W1","Clanabogan","N09000006","Fermanagh and Omagh",392,605,534,680,20,587,855,461,"Rural",241273,366306,{"$error":"#N/A"},"N06000018","West Tyrone",{"$f":"LOOKUP(OFFSET($D883,0,$B$12),{0,179,357,535,713;1,2,3,4,5})","v":3},{"$f":"LOOKUP(OFFSET($D883,0,$B$12),{0,90,179,268,357,446,535,624,713,802;1,2,3,4,5,6,7,8,9,10})","v":6},838,918,1054,464,3273,"Northern Ireland",3273,null,null,null,null,null,null,null,"Woodburn"]
["95YY04W1","Coolnagard","N09000006","Fermanagh and Omagh",524,277,255,468,368,796,500,438,"Urban",244758,371625,{"$error":"#N/A"},"N06000018","West Tyrone",{"$f":"LOOKUP(OFFSET($D884,0,$B$12),{0,179,357,535,713;1,2,3,4,5})","v":3},{"$f":"LOOKUP(OFFSET($D884,0,$B$12),{0,90,179,268,357,446,535,624,713,802;1,2,3,4,5,6,7,8,9,10})","v":5},800,1117,1104,472,3494,"Northern Ireland",3494,null,null,null,null,null,null,null,"Woodstock_1"]
["95YY05W1","Dergmoney","N09000006","Fermanagh and Omagh",373,200,264,564,585,194,95,316,"Urban",245363,372019,{"$error":"#N/A"},"N06000018","West Tyrone",{"$f":"LOOKUP(OFFSET($D885,0,$B$12),{0,179,357,535,713;1,2,3,4,5})","v":2},{"$f":"LOOKUP(OFFSET($D885,0,$B$12),{0,90,179,268,357,446,535,624,713,802;1,2,3,4,5,6,7,8,9,10})","v":4},260,442,579,375,1655,"Northern Ireland",1655,null,null,null,null,null,null,null,"Woodstock_2"]
["95YY06W1","Dromore","N09000006","Fermanagh and Omagh",642,269,224,595,88,479,524,383,"Rural",233951,362446,{"$error":"#N/A"},"N06000018","West Tyrone",{"$f":"LOOKUP(OFFSET($D886,0,$B$12),{0,179,357,535,713;1,2,3,4,5})","v":3},{"$f":"LOOKUP(OFFSET($D886,0,$B$12),{0,90,179,268,357,446,535,624,713,802;1,2,3,4,5,6,7,8,9,10})","v":5},527,747,766,336,2376,"Northern Ireland",2376,null,null,null,null,null,null,null,"Woodstock_3"]
["95YY07W1","Drumnakilly","N09000006","Fermanagh and Omagh",355,411,324,639,75,468,827,395,"Rural",254050,374466,{"$error":"#N/A"},"N06000018","West Tyrone",{"$f":"LOOKUP(OFFSET($D887,0,$B$12),{0,179,357,535,713;1,2,3,4,5})","v":3},{"$f":"LOOKUP(OFFSET($D887,0,$B$12),{0,90,179,268,357,446,535,624,713,802;1,2,3,4,5,6,7,8,9,10})","v":5},726,963,954,374,3017,"Northern Ireland",3017,null,null,null,null,null,null,null,"Woodvale_1"]
["95YY08W1","Drumquin","N09000006","Fermanagh and Omagh",303,363,375,507,43,220,643,311,"Rural",231745,372292,{"$error":"#N/A"},"N06000018","West Tyrone",{"$f":"LOOKUP(OFFSET($D888,0,$B$12),{0,179,357,535,713;1,2,3,4,5})","v":2},{"$f":"LOOKUP(OFFSET($D888,0,$B$12),{0,90,179,268,357,446,535,624,713,802;1,2,3,4,5,6,7,8,9,10})","v":4},544,679,797,302,2322,"Northern Ireland",2322,null,null,null,null,null,null,null,"Woodvale_2"]
["95YY09W1","Drumragh","N09000006","Fermanagh and Omagh",568,187,201,542,467,115,168,323,"Urban",246674,372313,{"$error":"#N/A"},"N06000018","West Tyrone",{"$f":"LOOKUP(OFFSET($D889,0,$B$12),{0,179,357,535,713;1,2,3,4,5})","v":2},{"$f":"LOOKUP(OFFSET($D889,0,$B$12),{0,90,179,268,357,446,535,624,713,802;1,2,3,4,5,6,7,8,9,10})","v":4},299,641,806,490,2236,"Northern Ireland",2236,null,null,null,null,null,null,null,"Woodvale_3"]
["95YY10W1","Fairy Water","N09000006","Fermanagh and Omagh",525,596,675,802,15,319,862,512,"Rural",239929,375218,{"$error":"#N/A"},"N06000018","West Tyrone",{"$f":"LOOKUP(OFFSET($D890,0,$B$12),{0,179,357,535,713;1,2,3,4,5})","v":3},{"$f":"LOOKUP(OFFSET($D890,0,$B$12),{0,90,179,268,357,446,535,624,713,802;1,2,3,4,5,6,7,8,9,10})","v":6},387,607,784,379,2157,"Northern Ireland",2157,null,null,null,null,null,null,null,"Woodville_1"]
["95YY11W1","Fintona","N09000006","Fermanagh and Omagh",99,126,181,436,183,321,278,138,"Rural",243770,360321,{"$error":"#N/A"},"N06000018","West Tyrone",{"$f":"LOOKUP(OFFSET($D891,0,$B$12),{0,179,357,535,713;1,2,3,4,5})","v":1},{"$f":"LOOKUP(OFFSET($D891,0,$B$12),{0,90,179,268,357,446,535,624,713,802;1,2,3,4,5,6,7,8,9,10})","v":2},407,624,682,350,2063,"Northern Ireland",2063,null,null,null,null,null,null,null,"Woodville_2"]
["95YY12W1","Gortin","N09000006","Fermanagh and Omagh",466,621,512,702,119,607,590,573,"Mixed urban/rural",246061,380403,{"$error":"#N/A"},"N06000018","West Tyrone",{"$f":"LOOKUP(OFFSET($D892,0,$B$12),{0,179,357,535,713;1,2,3,4,5})","v":4},{"$f":"LOOKUP(OFFSET($D892,0,$B$12),{0,90,179,268,357,446,535,624,713,802;1,2,3,4,5,6,7,8,9,10})","v":7},695,930,947,439,3011,"Northern Ireland",3011,null,null,null,null,null,null,null,"Wynchurch"]
["95YY13S1","Gortrush_1","N09000006","Fermanagh and Omagh",705,364,226,432,466,675,769,529,"Urban",243813,372010,{"$error":"#N/A"},"N06000018","West Tyrone",{"$f":"LOOKUP(OFFSET($D893,0,$B$12),{0,179,357,535,713;1,2,3,4,5})","v":3},{"$f":"LOOKUP(OFFSET($D893,0,$B$12),{0,90,179,268,357,446,535,624,713,802;1,2,3,4,5,6,7,8,9,10})","v":6},353,545,443,172,1513,"Northern Ireland",1513]
["95YY13S2","Gortrush_2","N09000006","Fermanagh and Omagh",367,112,97,193,486,585,334,188,"Urban",243873,372680,{"$error":"#N/A"},"N06000018","West Tyrone",{"$f":"LOOKUP(OFFSET($D894,0,$B$12),{0,179,357,535,713;1,2,3,4,5})","v":2},{"$f":"LOOKUP(OFFSET($D894,0,$B$12),{0,90,179,268,357,446,535,624,713,802;1,2,3,4,5,6,7,8,9,10})","v":3},245,391,447,256,1339,"Northern Ireland",1339]
["95YY14S1","Killyclogher_1","N09000006","Fermanagh and Omagh",247,280,172,365,347,318,358,264,"Urban",246407,373770,{"$error":"#N/A"},"N06000018","West Tyrone",{"$f":"LOOKUP(OFFSET($D895,0,$B$12),{0,179,357,535,713;1,2,3,4,5})","v":2},{"$f":"LOOKUP(OFFSET($D895,0,$B$12),{0,90,179,268,357,446,535,624,713,802;1,2,3,4,5,6,7,8,9,10})","v":3},362,555,545,145,1607,"Northern Ireland",1607]
["95YY14S2","Killyclogher_2","N09000006","Fermanagh and Omagh",478,352,231,442,323,886,663,445,"Urban",247506,373775,{"$error":"#N/A"},"N06000018","West Tyrone",{"$f":"LOOKUP(OFFSET($D896,0,$B$12),{0,179,357,535,713;1,2,3,4,5})","v":3},{"$f":"LOOKUP(OFFSET($D896,0,$B$12),{0,90,179,268,357,446,535,624,713,802;1,2,3,4,5,6,7,8,9,10})","v":5},409,548,495,137,1590,"Northern Ireland",1590]
["95YY15S1","Lisanelly_1","N09000006","Fermanagh and Omagh",21,52,84,187,736,138,222,47,"Urban",245422,373401,{"$error":"#N/A"},"N06000018","West Tyrone",{"$f":"LOOKUP(OFFSET($D897,0,$B$12),{0,179,357,535,713;1,2,3,4,5})","v":1},{"$f":"LOOKUP(OFFSET($D897,0,$B$12),{0,90,179,268,357,446,535,624,713,802;1,2,3,4,5,6,7,8,9,10})","v":1},48,94,124,115,381,"Northern Ireland",381]
["95YY15S2","Lisanelly_2","N09000006","Fermanagh and Omagh",61,55,24,140,484,277,113,46,"Urban",244979,374057,{"$error":"#N/A"},"N06000018","West Tyrone",{"$f":"LOOKUP(OFFSET($D898,0,$B$12),{0,179,357,535,713;1,2,3,4,5})","v":1},{"$f":"LOOKUP(OFFSET($D898,0,$B$12),{0,90,179,268,357,446,535,624,713,802;1,2,3,4,5,6,7,8,9,10})","v":1},435,605,465,125,1631,"Northern Ireland",1631]
["95YY16W1","Newtownsaville","N09000006","Fermanagh and Omagh",569,513,500,607,22,280,811,452,"Rural",250546,361296,{"$error":"#N/A"},"N06000018","West Tyrone",{"$f":"LOOKUP(OFFSET($D899,0,$B$12),{0,179,357,535,713;1,2,3,4,5})","v":3},{"$f":"LOOKUP(OFFSET($D899,0,$B$12),{0,90,179,268,357,446,535,624,713,802;1,2,3,4,5,6,7,8,9,10})","v":6},537,746,811,362,2456,"Northern Ireland",2456]
["95YY17W1","Owenkillew","N09000006","Fermanagh and Omagh",179,419,424,665,9,282,813,257,"Rural",256646,382521,{"$error":"#N/A"},"N06000018","West Tyrone",{"$f":"LOOKUP(OFFSET($D900,0,$B$12),{0,179,357,535,713;1,2,3,4,5})","v":2},{"$f":"LOOKUP(OFFSET($D900,0,$B$12),{0,90,179,268,357,446,535,624,713,802;1,2,3,4,5,6,7,8,9,10})","v":3},566,763,771,312,2411,"Northern Ireland",2411]
["95YY18W1","Sixmilecross","N09000006","Fermanagh and Omagh",387,377,417,533,8,124,802,289,"Rural",258484,366830,{"$error":"#N/A"},"N06000018","West Tyrone",{"$f":"LOOKUP(OFFSET($D901,0,$B$12),{0,179,357,535,713;1,2,3,4,5})","v":2},{"$f":"LOOKUP(OFFSET($D901,0,$B$12),{0,90,179,268,357,446,535,624,713,802;1,2,3,4,5,6,7,8,9,10})","v":4},603,720,770,295,2389,"Northern Ireland",2389]
["95YY19W1","Strule","N09000006","Fermanagh and Omagh",258,101,126,231,530,295,235,168,"Urban",244148,373416,{"$error":"#N/A"},"N06000018","West Tyrone",{"$f":"LOOKUP(OFFSET($D902,0,$B$12),{0,179,357,535,713;1,2,3,4,5})","v":1},{"$f":"LOOKUP(OFFSET($D902,0,$B$12),{0,90,179,268,357,446,535,624,713,802;1,2,3,4,5,6,7,8,9,10})","v":2},276,422,444,300,1442,"Northern Ireland",1442]
["95YY20W1","Termon","N09000006","Fermanagh and Omagh",253,306,351,632,46,193,790,280,"Rural",262128,373631,{"$error":"#N/A"},"N06000018","West Tyrone",{"$f":"LOOKUP(OFFSET($D903,0,$B$12),{0,179,357,535,713;1,2,3,4,5})","v":2},{"$f":"LOOKUP(OFFSET($D903,0,$B$12),{0,90,179,268,357,446,535,624,713,802;1,2,3,4,5,6,7,8,9,10})","v":4},542,828,725,357,2452,"Northern Ireland",2452]
["95YY21W1","Trillick","N09000006","Fermanagh and Omagh",369,597,585,737,7,88,778,379,"Rural",233691,356246,{"$error":"#N/A"},"N06000018","West Tyrone",{"$f":"LOOKUP(OFFSET($D904,0,$B$12),{0,179,357,535,713;1,2,3,4,5})","v":3},{"$f":"LOOKUP(OFFSET($D904,0,$B$12),{0,90,179,268,357,446,535,624,713,802;1,2,3,4,5,6,7,8,9,10})","v":5},576,752,779,356,2463,"Northern Ireland",2463]
["95ZZ01W1","Artigarvan","N09000005","Derry City and Strabane",324,369,436,281,191,692,601,376,"Rural",238146,400664,{"$error":"#N/A"},"N06000018","West Tyrone",{"$f":"LOOKUP(OFFSET($D905,0,$B$12),{0,179,357,535,713;1,2,3,4,5})","v":3},{"$f":"LOOKUP(OFFSET($D905,0,$B$12),{0,90,179,268,357,446,535,624,713,802;1,2,3,4,5,6,7,8,9,10})","v":5},585,875,977,437,2873,"Northern Ireland",2873]
["95ZZ02W1","Ballycolman","N09000005","Derry City and Strabane",26,31,81,92,706,624,144,37,"Urban",234538,396932,{"$error":"#N/A"},"N06000018","West Tyrone",{"$f":"LOOKUP(OFFSET($D906,0,$B$12),{0,179,357,535,713;1,2,3,4,5})","v":1},{"$f":"LOOKUP(OFFSET($D906,0,$B$12),{0,90,179,268,357,446,535,624,713,802;1,2,3,4,5,6,7,8,9,10})","v":1},352,529,555,282,1718,"Northern Ireland",1718]
["95ZZ03W1","Castlederg","N09000005","Derry City and Strabane",261,74,113,260,400,506,321,152,"Rural",226384,385025,{"$error":"#N/A"},"N06000018","West Tyrone",{"$f":"LOOKUP(OFFSET($D907,0,$B$12),{0,179,357,535,713;1,2,3,4,5})","v":1},{"$f":"LOOKUP(OFFSET($D907,0,$B$12),{0,90,179,268,357,446,535,624,713,802;1,2,3,4,5,6,7,8,9,10})","v":2},374,653,649,454,2131,"Northern Ireland",2131]
["95ZZ04W1","Clare","N09000005","Derry City and Strabane",340,343,361,451,60,436,821,333,"Rural",227334,381788,{"$error":"#N/A"},"N06000018","West Tyrone",{"$f":"LOOKUP(OFFSET($D908,0,$B$12),{0,179,357,535,713;1,2,3,4,5})","v":2},{"$f":"LOOKUP(OFFSET($D908,0,$B$12),{0,90,179,268,357,446,535,624,713,802;1,2,3,4,5,6,7,8,9,10})","v":4},528,808,858,467,2660,"Northern Ireland",2660]
["95ZZ05W1","Dunnamanagh","N09000005","Derry City and Strabane",79,248,319,443,21,264,671,148,"Rural",245664,401428,{"$error":"#N/A"},"N06000018","West Tyrone",{"$f":"LOOKUP(OFFSET($D909,0,$B$12),{0,179,357,535,713;1,2,3,4,5})","v":1},{"$f":"LOOKUP(OFFSET($D909,0,$B$12),{0,90,179,268,357,446,535,624,713,802;1,2,3,4,5,6,7,8,9,10})","v":2},482,680,748,321,2231,"Northern Ireland",2231]
["95ZZ06W1","East","N09000005","Derry City and Strabane",4,3,54,14,559,127,76,1,"Urban",234979,397248,397248,"N06000018","West Tyrone",{"$f":"LOOKUP(OFFSET($D910,0,$B$12),{0,179,357,535,713;1,2,3,4,5})","v":1},{"$f":"LOOKUP(OFFSET($D910,0,$B$12),{0,90,179,268,357,446,535,624,713,802;1,2,3,4,5,6,7,8,9,10})","v":1},315,503,534,307,1659,"Northern Ireland",1659]
["95ZZ07W1","Finn","N09000005","Derry City and Strabane",81,196,310,236,180,668,571,166,"Rural",230943,391741,{"$error":"#N/A"},"N06000018","West Tyrone",{"$f":"LOOKUP(OFFSET($D911,0,$B$12),{0,179,357,535,713;1,2,3,4,5})","v":1},{"$f":"LOOKUP(OFFSET($D911,0,$B$12),{0,90,179,268,357,446,535,624,713,802;1,2,3,4,5,6,7,8,9,10})","v":2},677,940,919,382,2919,"Northern Ireland",2919]
["95ZZ08W1","Glenderg","N09000005","Derry City and Strabane",48,165,254,247,23,410,651,90,"Rural",221636,383270,{"$error":"#N/A"},"N06000018","West Tyrone",{"$f":"LOOKUP(OFFSET($D912,0,$B$12),{0,179,357,535,713;1,2,3,4,5})","v":1},{"$f":"LOOKUP(OFFSET($D912,0,$B$12),{0,90,179,268,357,446,535,624,713,802;1,2,3,4,5,6,7,8,9,10})","v":2},602,833,831,421,2688,"Northern Ireland",2688]
["95ZZ09W1","Newtownstewart","N09000005","Derry City and Strabane",314,150,240,230,162,450,312,201,"Rural",238710,384608,{"$error":"#N/A"},"N06000018","West Tyrone",{"$f":"LOOKUP(OFFSET($D913,0,$B$12),{0,179,357,535,713;1,2,3,4,5})","v":2},{"$f":"LOOKUP(OFFSET($D913,0,$B$12),{0,90,179,268,357,446,535,624,713,802;1,2,3,4,5,6,7,8,9,10})","v":3},433,671,743,399,2246,"Northern Ireland",2246]
["95ZZ10W1","North","N09000005","Derry City and Strabane",83,141,267,328,404,316,101,141,"Urban",235072,398179,{"$error":"#N/A"},"N06000018","West Tyrone",{"$f":"LOOKUP(OFFSET($D914,0,$B$12),{0,179,357,535,713;1,2,3,4,5})","v":1},{"$f":"LOOKUP(OFFSET($D914,0,$B$12),{0,90,179,268,357,446,535,624,713,802;1,2,3,4,5,6,7,8,9,10})","v":2},844,1044,1112,442,3441,"Northern Ireland",3441]
["95ZZ11W1","Plumbridge","N09000005","Derry City and Strabane",368,393,461,589,1,286,834,304,"Rural",247893,390656,{"$error":"#N/A"},"N06000018","West Tyrone",{"$f":"LOOKUP(OFFSET($D915,0,$B$12),{0,179,357,535,713;1,2,3,4,5})","v":2},{"$f":"LOOKUP(OFFSET($D915,0,$B$12),{0,90,179,268,357,446,535,624,713,802;1,2,3,4,5,6,7,8,9,10})","v":4},439,650,733,367,2189,"Northern Ireland",2189]
["95ZZ12W1","Sion Mills","N09000005","Derry City and Strabane",304,131,150,207,339,128,266,175,"Rural",233813,393165,{"$error":"#N/A"},"N06000018","West Tyrone",{"$f":"LOOKUP(OFFSET($D916,0,$B$12),{0,179,357,535,713;1,2,3,4,5})","v":1},{"$f":"LOOKUP(OFFSET($D916,0,$B$12),{0,90,179,268,357,446,535,624,713,802;1,2,3,4,5,6,7,8,9,10})","v":2},451,649,761,399,2260,"Northern Ireland",2260]
["95ZZ13W1","Slievekirk","N09000005","Derry City and Strabane",275,365,394,462,52,165,815,299,"Rural",239833,406991,{"$error":"#N/A"},"N06000018","West Tyrone",{"$f":"LOOKUP(OFFSET($D917,0,$B$12),{0,179,357,535,713;1,2,3,4,5})","v":2},{"$f":"LOOKUP(OFFSET($D917,0,$B$12),{0,90,179,268,357,446,535,624,713,802;1,2,3,4,5,6,7,8,9,10})","v":4},527,715,841,365,2448,"Northern Ireland",2448]
["95ZZ14S1","South_1","N09000005","Derry City and Strabane",374,137,175,227,427,676,400,236,"Urban",233700,396015,{"$error":"#N/A"},"N06000018","West Tyrone",{"$f":"LOOKUP(OFFSET($D918,0,$B$12),{0,179,357,535,713;1,2,3,4,5})","v":2},{"$f":"LOOKUP(OFFSET($D918,0,$B$12),{0,90,179,268,357,446,535,624,713,802;1,2,3,4,5,6,7,8,9,10})","v":3},471,626,551,269,1916,"Northern Ireland",1916]
["95ZZ14S2","South_2","N09000005","Derry City and Strabane",492,293,402,406,481,737,479,477,"Urban",234181,396133,{"$error":"#N/A"},"N06000018","West Tyrone",{"$f":"LOOKUP(OFFSET($D919,0,$B$12),{0,179,357,535,713;1,2,3,4,5})","v":3},{"$f":"LOOKUP(OFFSET($D919,0,$B$12),{0,90,179,268,357,446,535,624,713,802;1,2,3,4,5,6,7,8,9,10})","v":6},233,387,464,230,1314,"Northern Ireland",1314]
["95ZZ15W1","Victoria Bridge","N09000005","Derry City and Strabane",220,304,355,290,114,499,580,266,"Rural",235814,390844,{"$error":"#N/A"},"N06000018","West Tyrone",{"$f":"LOOKUP(OFFSET($D920,0,$B$12),{0,179,357,535,713;1,2,3,4,5})","v":2},{"$f":"LOOKUP(OFFSET($D920,0,$B$12),{0,90,179,268,357,446,535,624,713,802;1,2,3,4,5,6,7,8,9,10})","v":3},459,673,727,421,2279,"Northern Ireland",2279]
["95ZZ16S1","West_1","N09000005","Derry City and Strabane",97,264,321,244,292,747,481,205,"Urban",233355,396976,{"$error":"#N/A"},"N06000018","West Tyrone",{"$f":"LOOKUP(OFFSET($D921,0,$B$12),{0,179,357,535,713;1,2,3,4,5})","v":2},{"$f":"LOOKUP(OFFSET($D921,0,$B$12),{0,90,179,268,357,446,535,624,713,802;1,2,3,4,5,6,7,8,9,10})","v":3},542,655,613,155,1966,"Northern Ireland",1966]
["95ZZ16S2","West_2","N09000005","Derry City and Strabane",309,68,135,234,649,693,139,170,"Urban",233952,397327,{"$error":"#N/A"},"N06000018","West Tyrone",{"$f":"LOOKUP(OFFSET($D922,0,$B$12),{0,179,357,535,713;1,2,3,4,5})","v":1},{"$f":"LOOKUP(OFFSET($D922,0,$B$12),{0,90,179,268,357,446,535,624,713,802;1,2,3,4,5,6,7,8,9,10})","v":2},223,337,434,347,1341,"Northern Ireland",1341]

{"sheet":"Landing_Page","index":1,"n_rows":96,"n_cols":17,"rows_kept":96,"cut":false,"hidden":false,"merged":[[16,1,17,15],[1,1,1,15],[3,1,4,15],[19,1,20,15],[0,1,0,28],[38,1,39,15],[57,1,58,15],[76,1,77,15],[95,1,96,15],[19,16,20,28],[38,16,39,28],[57,16,58,28],[76,16,77,28],[95,16,96,28]]}
[null,"Northern Ireland Multiple Deprivation Measure 2017 Analysis Package"]
[null,"This analysis package allows users to browse the NIMDM2017 results.\nIt provides the functionality to:"]
[]
[null,"The following functionality is provided (see examples below for further instruction):"]
[]
[null,"1. Select a deprivation domain of interest to return the top 10 most deprived Super Output Areas (SOAs) in that domain."]
[null,"2. Select one of the top 10 most deprived SOAs in order to see:"]
[null,null,"How it ranks in other domains"]
[null,null,"Where it is in Northern Ireland (i.e. which Local Government District (LGD) or Parliamentary Constituency (PC))"]
[null,null,"Where it is situated on a map of Northern Ireland"]
[null,"3. Select an area (i.e. Northern Ireland or any LGD or PC) to see a summary of information, including:"]
[null,null,"The number of SOAs in the selected area and some summary information about the population size of those SOAs"]
[null,null,"The mid-2016 population estimates for the selected area (i.e. total population and age distribution)"]
[null,null,"How many of the top 100 most deprived SOAs in the selected domain are in the selected area"]
[null,"4. Select an analysis method (i.e. Quintiles or Deciles) to see what proportion of the selected area's SOAs are in each quintile or decile"]
[null,"5. Select an SOA within the selected area to see how it ranks across each of the deprivation domains"]
[]
[]
[]
[null,"Example 1: Select a deprivation domain to return the top 10 most deprived SOAs",null,null,null,null,null,null,null,null,null,null,null,null,null,null,"Where to find it on the analysis package"]
[]
[]
[]
[]
[]
[]
[]
[]
[]
[]
[]
[]
[]
[]
[]
[]
[]
[]
[null,"Example 2: Select one of the top 10 most deprived SOAs in order to see related information",null,null,null,null,null,null,null,null,null,null,null,null,null,null,"Where to find it on the analysis package"]
[]
[]
[]
[]
[]
[]
[]
[]
[]
[]
[]
[]
[]
[]
[]
[]
[]
[]
[null,"Example 3: Select an area (i.e. Northern Ireland or any LGD or PC) to see summary information",null,null,null,null,null,null,null,null,null,null,null,null,null,null,"Where to find it on the analysis package"]
[]
[]
[]
[]
[]
[]
[]
[]
[]
[]
[]
[]
[]
[]
[]
[]
[]
[]
[null,"Example 4: Select an analysis method (i.e. Quintiles or Deciles)",null,null,null,null,null,null,null,null,null,null,null,null,null,null,"Where to find it on the analysis package"]
[]
[]
[]
[]
[]
[]
[]
[]
[]
[]
[]
[]
[]
[]
[]
[]
[]
[]
[null,"Example 5: Select an SOA to see how it ranks across each of the deprivation domains",null,null,null,null,null,null,null,null,null,null,null,null,null,null,"Where to find it on the analysis package"]

{"sheet":"Main","index":2,"n_rows":35,"n_cols":26,"rows_kept":35,"cut":false,"hidden":false,"merged":[[31,6,31,7],[23,6,25,10],[19,6,22,10],[27,6,29,10],[2,17,5,20],[17,12,17,15],[2,6,4,10],[5,13,6,15],[5,6,16,10],[16,13,16,15],[14,13,14,15],[15,13,15,15],[8,17,9,19],[8,20,9,20],[2,12,4,15],[7,13,7,15],[0,12,0,14],[25,22,26,24],[25,25,26,25],[21,22,22,26],[2,22,3,26],[33,12,34,20],[22,12,25,20],[19,12,21,19],[4,23,4,26],[5,23,5,26],[8,13,8,15],[9,13,9,15],[10,13,10,15],[11,13,11,15],[12,13,12,15],[13,13,13,15],[5,12,6,12]]}
["Northern Ireland Multiple Deprivation Measures 2017 (NIMDM2017)"]
[]
["Select a domain:",null,null,null,null,null,{"$f":"OFFSET(Data!$A$1,Data!$B$12,0)&\" Domain\"","v":"Multiple (MDM) Domain"},null,null,null,null,null,{"$f":"\"Top 10 most deprived SOAs in this domain (across NI):\"","v":"Top 10 most deprived SOAs in this domain (across NI):"},null,null,null,null,{"$f":"\"Select one of the 10 most deprived SOAs to see how it ranks in the other seven domains?\"","v":"Select one of the 10 most deprived SOAs to see how it ranks in the other seven domains?"},null,null,null,null,{"$f":"\"Where is \"&Data!$F$27&\" in Northern Ireland?\"","v":"Where is East in Northern Ireland?"}]
[]
[null,null,null,null,null,null,null,null,null,null,null,null,null,null,null,null,null,null,null,null,null,null,"LGD:",{"$f":"OFFSET(Data!$D$32,MATCH(Data!$F$27,Data!$B$33:$B$922,0),0)","v":"Derry City and Strabane"}]
[null,null,null,null,null,null,{"$f":"OFFSET(Data!$J$1,Data!$B$12,0)","v":"The indicators from the 7 domains were combined and weighted to provide an overall multiple deprivation measure ranking (MDM) of the 890 SOAs. The weights associated with each of the domains are highlighted below:\n\nIncome (25%)\nEmployment (25%)\nHealth & Disability (15%)\nEducation, Skills & Training (15%)\nAccess to Services (10%)\nLiving Environment (5%)\nCrime & Disorder (5%)"},null,null,null,null,null,"Rank","SOA",null,null,null,null,null,null,null,null,"PC:",{"$f":"OFFSET(Data!$R$32,MATCH(Data!$F$27,Data!$B$33:$B$922,0),0)","v":"West Tyrone"}]
[]
[null,null,null,null,null,null,null,null,null,null,null,null,1,{"$f":"Data!W2","v":"East"}]
[null,null,null,null,null,null,null,null,null,null,null,null,2,{"$f":"Data!W3","v":"Water Works_2"},null,null,null,"Domain",null,null,"Rank"]
[null,null,null,null,null,null,null,null,null,null,null,null,3,{"$f":"Data!W4","v":"Crevagh_2"}]
[null,null,null,null,null,null,null,null,null,null,null,null,4,{"$f":"Data!W5","v":"Ardoyne_2"},null,null,null,{"$f":"Data!V14","v":"Income"},null,null,{"$f":"Data!W14","v":4}]
[null,null,null,null,null,null,null,null,null,null,null,null,5,{"$f":"Data!W6","v":"Strand_1_Derry"},null,null,null,{"$f":"Data!V15","v":"Employment"},null,null,{"$f":"Data!W15","v":3}]
[null,null,null,null,null,null,null,null,null,null,null,null,6,{"$f":"Data!W7","v":"The Diamond"},null,null,null,{"$f":"Data!V16","v":"Health and Disability"},null,null,{"$f":"Data!W16","v":54}]
[null,null,null,null,null,null,null,null,null,null,null,null,7,{"$f":"Data!W8","v":"New Lodge_2"},null,null,null,{"$f":"Data!V17","v":"Education, Skills & Training"},null,null,{"$f":"Data!W17","v":14}]
[null,null,null,null,null,null,null,null,null,null,null,null,8,{"$f":"Data!W9","v":"Woodvale_1"},null,null,null,{"$f":"Data!V18","v":"Access to Services"},null,null,{"$f":"Data!W18","v":559}]
[null,null,null,null,null,null,null,null,null,null,null,null,9,{"$f":"Data!W10","v":"Ardoyne_3"},null,null,null,{"$f":"Data!V19","v":"Living Environment"},null,null,{"$f":"Data!W19","v":127}]
[null,null,null,null,null,null,null,null,null,null,null,null,10,{"$f":"Data!W11","v":"Creggan Central_1"},null,null,null,{"$f":"Data!V20","v":"Crime & Disorder"},null,null,{"$f":"Data!W20","v":76}]
[]
[]
["Select an area type:",null,null,null,null,null,{"$f":"OFFSET(Data!$S$1,Data!$B$26,0)&CHOOSE(Data!$K$5,\"\",\" LGD\",\" PC\")","v":"Northern Ireland"},null,null,null,null,null,{"$f":"\"Select an analysis method for further information\"","v":"Select an analysis method for further information"},null,null,null,null,null,null,null,null,null,"SOA selection"]
[]
[{"$f":"IF(Data!$K$5=1,\"\",\"Select an area:\")","v":""},null,null,null,null,null,null,null,null,null,null,null,null,null,null,null,null,null,null,null,null,null,{"$f":"\"Select an SOA within \"&Data!$B$27&CHOOSE(Data!$K$5,\"\",\" LGD\",\" PC\")&\" to see its MDM rankings across all the domains\"","v":"Select an SOA within Northern Ireland to see its MDM rankings across all the domains"}]
[null,null,null,null,null,null,null,null,null,null,null,null,{"$f":"\"The chart below shows the proportion of SOAs in \"&Data!$B$27&CHOOSE(Data!$K$5,\"\",\" LGD\",\" PC\")&\", broken down into \"&Data!$J$27&\" for the \"&OFFSET(Data!$A$1,Data!$B$12,0)&\" domain\"","v":"The chart below shows the proportion of SOAs in Northern Ireland, broken down into Quintiles for the Multiple (MDM) domain"}]
[null,null,null,null,null,null,{"$f":"\"There are \"&Data!$B$30&\" SOAs in this area.  In terms of population they range in size from \"&TEXT(Data!$D$30,\"#,#\")&\" to \"&TEXT(Data!$D$29,\"#,#\")&\" people with an average size of \"&TEXT(Data!$D$31,\"#,#\")&\" (according to the mid-2016 estimates).\"","v":"There are 890 SOAs in this area.  In terms of population they range in size from 381 to 5,832 people with an average size of 2,092 (according to the mid-2016 estimates)."}]
[]
[null,null,null,null,null,null,null,null,null,null,null,null,null,null,null,null,null,null,null,null,null,null,"Domain",null,null,"Rank"]
[]
[null,null,null,null,null,null,{"$f":"\"Overall, the mid-2016 population of \"&Data!$B$27&CHOOSE(Data!$K$5,\"\",\" LGD\",\" PC\")&\" was \"&TEXT(OFFSET(Data!$AE$1,MATCH(Data!$B$27,Data!$Z$2:$Z$30,0),0),\"#,0\")&\". The age distribution is given in the table below.\"","v":"Overall, the mid-2016 population of Northern Ireland was 1,862,137. The age distribution is given in the table below."},null,null,null,null,null,null,null,null,null,null,null,null,null,null,null,{"$f":"Data!A2","v":"Income"},null,null,{"$f":"Data!J16","v":451}]
[null,null,null,null,null,null,null,null,null,null,null,null,null,null,null,null,null,null,null,null,null,null,{"$f":"Data!A3","v":"Employment"},null,null,{"$f":"Data!J17","v":353}]
[null,null,null,null,null,null,null,null,null,null,null,null,null,null,null,null,null,null,null,null,null,null,{"$f":"Data!A4","v":"Health and Disability"},null,null,{"$f":"Data!J18","v":315}]
[null,null,null,null,null,null,"Age group",null,null,"Population","Proportion",null,{"$f":"CHOOSE(Data!$J$26,\"Most deprived SOAs\",\"Most deprived SOAs\",\"Urban SOAs\")","v":"Most deprived SOAs"},null,null,null,{"$f":"CHOOSE(Data!$J$26,\"\",\"\",\"Mixed SOAs\")","v":""},null,null,null,{"$f":"CHOOSE(Data!$J$26,\"Least deprived SOAs\",\"Least deprived SOAs\",\"Rural SOAs\")","v":"Least deprived SOAs"},null,{"$f":"Data!A5","v":"Education, Skills & Training"},null,null,{"$f":"Data!J19","v":362}]
[null,null,null,null,null,null,"Children (aged 0-15)",null,null,{"$f":"TEXT(OFFSET(Data!$AA$1,MATCH(Data!$B$27,Data!$Z$2:$Z$30,0),0),\"#,0\")","v":"388,001"},{"$f":"J32/$J$35","v":0.20836329443000165},null,null,null,null,null,null,null,null,null,null,null,{"$f":"Data!A6","v":"Access to Services"},null,null,{"$f":"Data!J20","v":442}]
[null,null,null,null,null,null,"Working age (16-64)",null,null,{"$f":"TEXT(OFFSET(Data!$AB$1,MATCH(Data!$B$27,Data!$Z$2:$Z$30,0),0)+OFFSET(Data!$AC$1,MATCH(Data!$B$27,Data!$Z$2:$Z$30,0),0),\"#,0\")","v":"1,176,381"},{"$f":"J33/$J$35","v":0.63173708486539926},null,{"$f":"\"Top 100 most deprived SOAs in the \"&OFFSET(Data!$A$1,Data!$B$12,0)&\" domain\"","v":"Top 100 most deprived SOAs in the Multiple (MDM) domain"},null,null,null,null,null,null,null,null,null,{"$f":"Data!A7","v":"Living Environment"},null,null,{"$f":"Data!J21","v":425}]
[null,null,null,null,null,null,"Older people (aged 65+)",null,null,{"$f":"TEXT(OFFSET(Data!$AD$1,MATCH(Data!$B$27,Data!$Z$2:$Z$30,0),0),\"#,0\")","v":"297,755"},{"$f":"J34/$J$35","v":0.15989962070459907},null,{"$f":"CHOOSE(Data!$K$5,\"Information not applicable for Northern Ireland\",\"Within the \"&OFFSET(Data!$A$1,Data!$B$12,0)&\" domain, \"&Data!$B$31&\" of the top 100 most deprived areas in Northern Ireland are in \"&Data!$B$27&CHOOSE(Data!$K$5,\"\",\" LGD\",\" PC\"),\"Within the \"&OFFSET(Data!$A$1,Data!$B$12,0)&\" domain, \"&Data!$B$31&\" of the top 100 most deprived areas in Northern Ireland are in \"&Data!$B$27&CHOOSE(Data!$K$5,\"\",\" LGD\",\" PC\"))","v":"Information not applicable for Northern Ireland"},null,null,null,null,null,null,null,null,null,{"$f":"Data!A8","v":"Crime & Disorder"},null,null,{"$f":"Data!J22","v":391}]
[null,null,null,null,null,null,"Total population",null,null,{"$f":"TEXT(OFFSET(Data!$AE$1,MATCH(Data!$B$27,Data!$Z$2:$Z$30,0),0),\"#,0\")","v":"1,862,137"},{"$f":"J35/$J$35","v":1},null,null,null,null,null,null,null,null,null,null,null,{"$f":"Data!A9","v":"Multiple (MDM)"},null,null,{"$f":"Data!J23","v":424}]