{"text_format":"1","workbook":"xlsx","n_sheets":3,"sheets":["Data","Landing_Page","Main"],"not_rendered":{"charts":3,"images":36,"macros":1,"external_links":0,"defined_names":5,"comments":0,"pivot_tables":0},"unopened":[],"bounds":{"document_bytes":16777216,"sheet_cells":100000,"rows_first":2000,"rows_last":500,"rows_between":2000,"halvings":0,"cell_chars":16384,"cell_head_chars":4096},"cells_cut":0,"cells_raw":0,"read":"whole","date_system":"1900"}

{"sheet":"Data","index":0,"n_rows":922,"n_cols":64,"rows_kept":922,"cut":false,"hidden":true,"merged":[]}
["domain","slice","rank","label","start angle","most deprived","name","Not selected","rank of most deprived in not selected","Domain info","Area selection","LGD_name","PC_name","LGD_code","PC_code","map1","map2","map3","Area dropdown source","map",null,"rank in this domain","Top10",null,null,null,"0-15yrs","16-39yrs","40-64yrs","65+","Total","share of top 100",null,null,0,{"$f":"COUNTA(OFFSET(AJ3,0,0,890,1))","v":72},{"$f":"COUNTA(OFFSET(AK3,0,0,890,1))","v":86},87,65,72,84,174,67,59,75,49,46,58,58,50,45,50,41,54,48,43,50,52,46,49,52,52,54,42]
["Income",45,0.25,{"$f":"A2&\"\n \"&TEXT(C2,\"0%\")","v":"Income\n 25%"},{"$f":"E3+45","v":337.5},{"$f":"INDEX($A$33:$A$922,MATCH(1,OFFSET($D$33,0,MATCH($A2,$E$32:$L$32,0),890,1),0))","v":"95VV08W1"},{"$f":"INDEX($B$33:$B$922,MATCH(1,OFFSET($D$33,0,MATCH($A2,$E$32:$L$32,0),890,1),0))","v":"Creggan"},{"$f":"IF($B$12<=ROW()-1,A3,A2)","v":"Income"},{"$f":"OFFSET(OFFSET($A$15,0,$B$12),MATCH(H2,$A$16:$A$23,0),0)","v":4},"The purpose of the Income Deprivation Domain is to identify the proportion of the population on low income at the small area level.\n\nThe Income Domain consists of one indicator, namely the proportion of the population living in households whose equivalised income is below 60 per cent of the NI median.","Northern Ireland","Antrim and Newtownabbey","Belfast East","N09000001","N06000001",2058,29,19,{"$f":"IF($K$5=1,$K$2,IF($K$5=2,L2,M2))","v":"Northern Ireland"},{"$f":"OFFSET($O2,0,$K$5)","v":2058},null,1,{"$f":"OFFSET($B$32,MATCH(V2,OFFSET($D$33,0,$B$12,890,1),0),0)","v":"East"},null,null,"Northern Ireland",{"$f":"SUM(AA3:AA13)","v":388001},{"$f":"SUM(AB3:AB13)","v":582157},594224,297755,1862137,{"$f":"COUNTIFS($Z$33:$Z$922,Z2,OFFSET($D$33,0,$B$12,890,1),\"<=100\")","v":100},null,null,"Northern Ireland","Antrim and Newtownabbey","Ards and North Down","Armagh City, Banbridge and Craigavon","Mid and East Antrim","Causeway Coast and Glens","Newry, Mourne and Down","Belfast","Lisburn and Castlereagh","Mid Ulster","Derry City and Strabane","Fermanagh and Omagh","Belfast East","Belfast North","Belfast South","Belfast West","East Antrim","East Londonderry","Fermanagh & South Tyrone","Foyle","Lagan Valley","Mid Ulster","Newry & Armagh","North Antrim","North Down","South Antrim","South Down","Strangford","Upper Bann","West Tyrone"]
["Employment",45,0.25,{"$f":"A3&\"\n \"&TEXT(C3,\"0%\")","v":"Employment\n 25%"},292.5,{"$f":"INDEX($A$33:$A$922,MATCH(1,OFFSET($D$33,0,MATCH($A3,$E$32:$L$32,0),890,1),0))","v":"95GG35S2"},{"$f":"INDEX($B$33:$B$922,MATCH(1,OFFSET($D$33,0,MATCH($A3,$E$32:$L$32,0),890,1),0))","v":"New Lodge_2"},"Employment",{"$f":"OFFSET(OFFSET($A$15,0,$B$12),MATCH(H3,$A$16:$A$23,0),0)","v":3},"The purpose of the Employment Deprivation Domain is to identify the proportion of the working age population excluded from work at the small area level.\n\nThe Employment Deprivation Domain consists of one indicator, namely, the proportion of the working age population (i.e. those aged 18-64 for both males and females) in receipt of at least one of some selected benefits. A measure of hidden unemployment (i.e. those who are not in receipt of any of the above selected benefits and have not received income from employment) has also been incorporated into this indicator.\n","Local Government Districts","Ards and North Down","Belfast North","N09000011","N06000002",null,30,20,"Northern Ireland",{"$f":"OFFSET($O3,0,$K$5)","v":0},null,2,{"$f":"OFFSET($B$32,MATCH(V3,OFFSET($D$33,0,$B$12,890,1),0),0)","v":"Water Works_2"},null,null,"Antrim and Newtownabbey",29648,42882,45701,22801,141032,{"$f":"COUNTIFS($D$33:$D$922,Z3,OFFSET($D$33,0,$B$12,890,1),\"<=100\")","v":1},null,null,"Abbey Park","Abbey_1","Ballycrochan_1","Abbey Park","Academy","Aghanloo_1","Annalong_1","Andersonstown_1","Ballinderry_1","Altmore","Altnagelvin_1","Ballinamallard","Ballyhackamore_1","Abbey_1","Ballynafeigh_1","Andersonstown_1","Antiville","Aghanloo_1","Augher","Altnagelvin_1","Ballinderry_1","Altmore","Abbey Park","Academy","Ballycrochan_1","Aldergrove_1","Annalong_1","Ballygowan_1","Aghagallon_1","Artigarvan"]
["Health and Disability",45,0.15,"Health and Disability\n 15%",247.5,"95GG48S2","Whiterock_2","Health and Disability",54,"The purpose of the Health Deprivation and Disability Domain is to identify rates of premature deaths, and proportions of the population’s quality of life impaired by poor health or disability at the small area level.\n\nThe Health Deprivation and Disability Domain consists of nine indicators, including one combined mental health indicator.","Parliamentary Constituencies","Armagh City, Banbridge and Craigavon","Belfast South","N09000002","N06000003",null,2047,21,"Northern Ireland",0,null,3,"Crevagh_2",null,null,"Ards and North Down",29983,43067,54092,32451,159593,{"$f":"COUNTIFS($D$33:$D$922,Z4,OFFSET($D$33,0,$B$12,890,1),\"<=100\")","v":3},null,null,"Abbey_1","Abbey_2","Ballycrochan_2","Aghagallon_1","Ahoghill_1","Aghanloo_2","Annalong_2","Andersonstown_2","Ballinderry_2","Ardboe","Altnagelvin_2","Belcoo and Garrison","Ballyhackamore_2","Abbey_2","Ballynafeigh_2","Andersonstown_2","Ballycarry","Aghanloo_2","Aughnacloy","Altnagelvin_2","Ballinderry_2","Ardboe","Ballybot","Ahoghill_1","Ballycrochan_2","Aldergrove_2","Annalong_2","Ballygowan_2","Aghagallon_2","Ballycolman"]
["Education, Skills & Training",45,0.15,"Education, Skills & Training\n 15%",202.5,"95GG35S3","New Lodge_3","Education, Skills & Training",14,"The purpose of the Education, Skills and Training Deprivation Domain is to identify the prevalence of poor educational outcomes for children and low levels of qualifications for working age adults at the small area level.\n\nThe Education, Skills and Training Deprivation Domain consists of eight indicators.",1,"Belfast","Belfast West","N09000008","N06000004",null,2050,22,"Northern Ireland",0,null,4,"Ardoyne_2",null,null,"Armagh City, Banbridge and Craigavon",46804,65612,66161,31683,210260,8,null,null,"Abbey_2","Aldergrove_1","Ballycrochan_3","Aghagallon_2","Ahoghill_2","Agivey","Ardglass_1","Andersonstown_3","Ballyhanwood_1","Augher","Altnagelvin_3","Belleek and Boa","Ballyhackamore_3","Ardoyne_1","Ballynafeigh_3","Andersonstown_3","Ballyloran","Agivey","Ballinamallard","Altnagelvin_3","Ballymacash_1","Ballymaguigan","Ballymartrim","Ahoghill_2","Ballycrochan_3","Aldergrove_3","Ardglass_1","Ballymaglave_1","Annagh_1","Beragh"]
["Access to Services",45,0.1,"Access to Services\n 10%",157.5,"95ZZ11W1","Plumbridge","Access to Services",559,"The purpose of the Access to Services Domain – formerly known as the Proximity to Services Domain – is to measure the extent to which people have poor physical and online access to key services at the small area level.\n\nThe Access to Services Domain consists of three indicators. The services to be included in the public and private transport travel time indicators includes one addition to the original proposals, i.e. day nursery and crèche.",null,"Causeway Coast and Glens","East Antrim","N09000004","N06000005",null,2051,14,"Northern Ireland",0,null,5,"Strand_1_Derry",null,null,"Mid and East Antrim",26361,39453,46660,25347,137821,3,null,null,"Academy","Aldergrove_2","Ballygowan_1","Annagh_1","Antiville","Armoy_&_Moss-side and Moyarget","Ardglass_2","Ardoyne_1","Ballyhanwood_2","Aughnacloy","Artigarvan","Beragh","Ballyhanwood_1","Ardoyne_2","Beechill_1","Beechmount_1","Blackcave","Atlantic","Ballygawley","Ballynashallog_1","Ballymacash_2","Bellaghy","Bessbrook","Ardeevin","Ballyholme","Balloo","Ardglass_2","Ballymaglave_2","Annagh_2","Camowen"]
["Living Environment",45,0.05,"Living Environment\n 5%",112.5,"95GG12S2","Botanic_2","Living Environment",127,"The purpose of the Living Environment Domain is to identify, at the small area level, the prevalence of shortcomings in the quality of housing, access to suitable housing, and the outdoor physical environment.\n\nThe Living Environment Domain consists of nine indicators, grouped into three sub domains:\n- Housing quality\n- Housing access\n- Outdoor physical environment",null,"Derry City and Strabane","East Londonderry","N09000010","N06000006",null,2052,26,"Northern Ireland",0,null,6,"The Diamond",null,null,"Causeway Coast and Glens",28555,42271,47695,25004,143525,3,null,null,"Aghagallon_1","Aldergrove_3","Ballygowan_2","Annagh_2","Ardeevin","Atlantic","Audley's Acre","Ardoyne_2","Ballymacash_1","Ballygawley","Ballycolman","Boho Cleenish and Letterbreen","Ballyhanwood_2","Ardoyne_3","Beechill_2","Beechmount_2","Blackhead","Ballykelly","Ballysaggart","Ballynashallog_2","Ballymacbrennan_1","Castledawson_1","Callan Bridge","Armoy_&_Moss-side and Moyarget","Ballymaconnell_1","Ballyclare North_1","Audley's Acre","Ballynahinch East","Ballybay","Castlederg"]
["Crime & Disorder",45,0.05,"Crime & Disorder\n 5%",{"$f":"E9+45","v":67.5},"95MM28W1","The Diamond","Crime & Disorder",76,"The purpose of the Crime and Disorder Domain is to identify the rate of crime and disorder at the small area level. \n\nThe Crime and Disorder Domain will consist of six indicators, grouped into two sub domains:\n- Crime\n- Disorder",null,"Fermanagh and Omagh","Fermanagh & South Tyrone","N09000003","N06000007",null,2053,23,"Northern Ireland",0,null,7,"New Lodge_2",null,null,"Newry, Mourne and Down",40187,54738,56313,26578,177816,8,null,null,"Aghagallon_2","Balloo","Ballyholme","Ballybay","Ballee","Ballyhoe and Corkey","Ballybot","Ardoyne_3","Ballymacash_2","Ballymaguigan","Ballynashallog_1","Brookeborough","Ballymacarrett_1","Ballyhenry_1","Beechill_3","Beechmount_3","Bluefield_1","Ballysally_1","Belcoo and Garrison","Beechwood","Ballymacbrennan_2","Castledawson_2","Camlough","Ballee","Ballymaconnell_2","Ballyclare North_2","Ballymote","Ballyrainey","Ballydown_1","Clanabogan"]
["Multiple (MDM)",45,null,{"$f":"A9","v":"Multiple (MDM)"},22.5,"95ZZ06W1","East",null,null,"The indicators from the 7 domains were combined and weighted to provide an overall multiple deprivation measure ranking (MDM) of the 890 SOAs. The weights associated with each of the domains are highlighted below:\n\nIncome (25%)\nEmployment (25%)\nHealth & Disability (15%)\nEducation, Skills & Training (15%)\nAccess to Services (10%)\nLiving Environment (5%)\nCrime & Disorder (5%)",null,"Lisburn and Castlereagh","Foyle","N09000007","N06000008",null,2054,24,"Northern Ireland",0,null,8,"Woodvale_1",null,null,"Belfast",66953,122780,100339,49507,339579,50,null,null,"Aghanloo_1","Ballyclare North_1","Ballymaconnell_1","Ballydown_1","Ballycarry","Ballykelly","Ballymaglave_1","Ballyhackamore_1","Ballymacbrennan_1","Ballysaggart","Ballynashallog_2","Camowen","Ballymacarrett_2","Ballyhenry_2","Blackstaff_1","Clonard_1","Bluefield_2","Ballysally_2","Belleek and Boa","Brandywell","Ballymacoss_1","Coagh","Carrigatuke","Ballyhoe and Corkey","Ballymagee_1","Ballyclare South_1","Ballyward","Ballywalter_1","Ballydown_2","Clare"]
[" ",null,null,null,null,null,null,null,null,null,null,"Mid and East Antrim","Lagan Valley","N09000009","N06000009",null,2055,25,"Northern Ireland",0,null,9,"Ardoyne_3",null,null,"Lisburn and Castlereagh",28181,41796,47095,24109,141181,0,null,null,"Aghanloo_2","Ballyclare North_2","Ballymaconnell_2","Ballydown_2","Ballykeel","Ballylough_&_Bushmills","Ballymaglave_2","Ballyhackamore_2","Ballymacbrennan_2","Bellaghy","Banagher","Castlecoole_1","Ballymacarrett_3","Ballysillan_1","Blackstaff_2","Clonard_2","Boneybefore","Banagher","Benburb","Carn Hill_1","Ballymacoss_2","Coalisland North","Charlemont","Ballykeel","Ballymagee_2","Ballyclare South_2","Bannside","Ballywalter_2","Ballyoran","Coolnagard"]
["domain selection",null,null,"Angle for wheel",null,null,null,null,null,null,null,"Mid Ulster","Mid Ulster","N09000005","N06000010",null,2056,27,"Northern Ireland",0,null,10,"Creggan Central_1",null,null,"Mid Ulster",33531,47550,44161,20147,145389,1,null,null,"Agivey","Ballyclare South_1","Ballymagee_1","Ballymartrim","Ballyloran","Ballysally_1","Ballymote","Ballyhackamore_3","Ballymacoss_1","Benburb","Beechwood","Castlecoole_2","Belmont_1","Ballysillan_2","Botanic_1","Collin Glen_1","Burleigh Hill_1","Castlerock_1","Boho Cleenish and Letterbreen","Carn Hill_2","Ballymacoss_3","Coalisland South","Creggan","Ballylough_&_Bushmills","Bangor Castle","Ballycraigy","Binnian","Bradshaw's Brae_1","Banbridge West","Dergmoney"]
["angle",8,null,{"$f":"OFFSET($E$1,$B$12,0)","v":22.5},null,null,null,null,null,null,null,"Newry, Mourne and Down","Newry & Armagh","N09000006","N06000011",null,2057,28,"Northern Ireland",0,null,null,null,null,null,"Derry City and Strabane",32806,47493,48338,21505,150142,20,null,null,"Ahoghill_1","Ballyclare South_2","Ballymagee_2","Ballyoran","Ballyloughan","Ballysally_2","Ballynahinch East","Ballymacarrett_1","Ballymacoss_2","Caledon","Brandywell","Clanabogan","Belmont_2","Ballysillan_3","Botanic_2","Collin Glen_2","Burleigh Hill_2","Castlerock_2","Brookeborough","Caw","Blaris_1","Coalisland West and Newmills","Crossmaglen","Ballyloughan","Bloomfield_1_NorthDown","Ballyduff_1","Burren and Kilbroney_1","Bradshaw's Brae_2","Bleary_1","Dromore"]
["existing",8,null,null,null,null,null,null,null,null,null,null,"North Antrim",null,"N06000012",null,null,17,"Northern Ireland",0,null,"other domains","how selected SOA ranks",null,null,"Fermanagh and Omagh",24992,34515,37669,18623,115799,3,null,null,"Ahoghill_2","Ballycraigy","Ballyrainey","Banbridge West","Blackcave","Benvardin","Ballyward","Ballymacarrett_2","Ballymacoss_3","Castlecaulfield","Carn Hill_1","Coolnagard","Belmont_3","Bellevue_1","Botanic_3","Collin Glen_3","Carncastle","Central_Coleraine","Caledon","Clondermot_1","Blaris_2","Donaghmore","Daisy Hill_1","Benvardin","Bloomfield_2_NorthDown","Ballyduff_2","Burren and Kilbroney_2","Carrowdore_1","Bleary_2","Drumnakilly"]
[null,null,null,null,null,null,null,null,null,null,null,null,"North Down",null,"N06000013",null,null,2060,"Northern Ireland",0,null,{"$f":"H2","v":"Income"},{"$f":"OFFSET(OFFSET($D$32,0,MATCH(V14,$E$32:$L$32,0)),MATCH($F$27,$B$33:$B$922,0),0)","v":4},null,null,"Belfast East",17889,30252,30582,16182,94905,{"$f":"COUNTIFS($R$33:$R$922,Z14,OFFSET($D$33,0,$B$12,890,1),\"<=100\")","v":5},null,null,"Aldergrove_1","Ballyduff_1","Ballywalter_1","Bannside","Blackhead","Bonamargy and Rathlin_&_Glenshesk","Bessbrook","Ballymacarrett_3","Beechill_1","Castledawson_1","Carn Hill_2","Dergmoney","Bloomfield_1_Belfast","Bellevue_2","Botanic_4","Derryaghy_1","Carnlough","Churchland","Castlecaulfield","Clondermot_2","Derryaghy_3","Draperstown","Daisy Hill_2","Bonamargy and Rathlin_&_Glenshesk","Broadway_1","Ballynure_1","Castlewellan_1","Carrowdore_2","Brownstown_1","Drumquin"]
["ranks for most deprived soa in each domain",{"$f":"A2","v":"Income"},{"$f":"A3","v":"Employment"},{"$f":"A4","v":"Health and Disability"},{"$f":"A5","v":"Education, Skills & Training"},{"$f":"A6","v":"Access to Services"},{"$f":"A7","v":"Living Environment"},{"$f":"A8","v":"Crime & Disorder"},{"$f":"A9","v":"Multiple (MDM)"},"selected rank",null,null,"South Antrim",null,"N06000014",null,null,18,"Northern Ireland",0,null,{"$f":"H3","v":"Employment"},{"$f":"OFFSET(OFFSET($D$32,0,MATCH(V15,$E$32:$L$32,0)),MATCH($F$27,$B$33:$B$922,0),0)","v":3},null,null,"Belfast North",21899,33218,32065,16652,103834,{"$f":"COUNTIFS($R$33:$R$922,Z15,OFFSET($D$33,0,$B$12,890,1),\"<=100\")","v":19},null,null,"Aldergrove_2","Ballyduff_2","Ballywalter_2","Bleary_1","Bluefield_1","Carnany","Binnian","Ballynafeigh_1","Beechill_2","Castledawson_2","Castlederg","Derrygonnelly","Bloomfield_2_Belfast","Bellevue_3","Botanic_5","Derryaghy_2","Central_Larne","Claudy_1","Castlecoole_1","Creggan Central_1","Dromara_1","Dunnamore","Demesne_1","Broughshane_1","Broadway_2","Ballynure_2","Castlewellan_2","Central_Ards","Brownstown_2","Drumragh"]
{"$rows_left_out":908}
{"sheet":"Landing_Page","index":1,"n_rows":96,"n_cols":17,"rows_kept":96,"cut":false,"hidden":false,"merged":[[16,1,17,15],[1,1,1,15],[3,1,4,15],[19,1,20,15],[0,1,0,28],[38,1,39,15],[57,1,58,15],[76,1,77,15],[95,1,96,15],[19,16,20,28],[38,16,39,28],[57,16,58,28],[76,16,77,28],[95,16,96,28]]}
[null,"Northern Ireland Multiple Deprivation Measure 2017 Analysis Package"]
[null,"This analysis package allows users to browse the NIMDM2017 results.\nIt provides the functionality to:"]
[]
[null,"The following functionality is provided (see examples below for further instruction):"]
[]
[null,"1. Select a deprivation domain of interest to return the top 10 most deprived Super Output Areas (SOAs) in that domain."]
[null,"2. Select one of the top 10 most deprived SOAs in order to see:"]
[null,null,"How it ranks in other domains"]
[null,null,"Where it is in Northern Ireland (i.e. which Local Government District (LGD) or Parliamentary Constituency (PC))"]
[null,null,"Where it is situated on a map of Northern Ireland"]
[null,"3. Select an area (i.e. Northern Ireland or any LGD or PC) to see a summary of information, including:"]
[null,null,"The number of SOAs in the selected area and some summary information about the population size of those SOAs"]
[null,null,"The mid-2016 population estimates for the selected area (i.e. total population and age distribution)"]
[null,null,"How many of the top 100 most deprived SOAs in the selected domain are in the selected area"]
[null,"4. Select an analysis method (i.e. Quintiles or Deciles) to see what proportion of the selected area's SOAs are in each quintile or decile"]
{"$rows_left_out":82}
{"sheet":"Main","index":2,"n_rows":35,"n_cols":26,"rows_kept":35,"cut":false,"hidden":false,"merged":[[31,6,31,7],[23,6,25,10],[19,6,22,10],[27,6,29,10],[2,17,5,20],[17,12,17,15],[2,6,4,10],[5,13,6,15],[5,6,16,10],[16,13,16,15],[14,13,14,15],[15,13,15,15],[8,17,9,19],[8,20,9,20],[2,12,4,15],[7,13,7,15],[0,12,0,14],[25,22,26,24],[25,25,26,25],[21,22,22,26],[2,22,3,26],[33,12,34,20],[22,12,25,20],[19,12,21,19],[4,23,4,26],[5,23,5,26],[8,13,8,15],[9,13,9,15],[10,13,10,15],[11,13,11,15],[12,13,12,15],[13,13,13,15],[5,12,6,12]]}
["Northern Ireland Multiple Deprivation Measures 2017 (NIMDM2017)"]
[]
["Select a domain:",null,null,null,null,null,{"$f":"OFFSET(Data!$A$1,Data!$B$12,0)&\" Domain\"","v":"Multiple (MDM) Domain"},null,null,null,null,null,{"$f":"\"Top 10 most deprived SOAs in this domain (across NI):\"","v":"Top 10 most deprived SOAs in this domain (across NI):"},null,null,null,null,{"$f":"\"Select one of the 10 most deprived SOAs to see how it ranks in the other seven domains?\"","v":"Select one of the 10 most deprived SOAs to see how it ranks in the other seven domains?"},null,null,null,null,{"$f":"\"Where is \"&Data!$F$27&\" in Northern Ireland?\"","v":"Where is East in Northern Ireland?"}]
[]
[null,null,null,null,null,null,null,null,null,null,null,null,null,null,null,null,null,null,null,null,null,null,"LGD:",{"$f":"OFFSET(Data!$D$32,MATCH(Data!$F$27,Data!$B$33:$B$922,0),0)","v":"Derry City and Strabane"}]
[null,null,null,null,null,null,{"$f":"OFFSET(Data!$J$1,Data!$B$12,0)","v":"The indicators from the 7 domains were combined and weighted to provide an overall multiple deprivation measure ranking (MDM) of the 890 SOAs. The weights associated with each of the domains are highlighted below:\n\nIncome (25%)\nEmployment (25%)\nHealth & Disability (15%)\nEducation, Skills & Training (15%)\nAccess to Services (10%)\nLiving Environment (5%)\nCrime & Disorder (5%)"},null,null,null,null,null,"Rank","SOA",null,null,null,null,null,null,null,null,"PC:",{"$f":"OFFSET(Data!$R$32,MATCH(Data!$F$27,Data!$B$33:$B$922,0),0)","v":"West Tyrone"}]
[]
[null,null,null,null,null,null,null,null,null,null,null,null,1,{"$f":"Data!W2","v":"East"}]
[null,null,null,null,null,null,null,null,null,null,null,null,2,{"$f":"Data!W3","v":"Water Works_2"},null,null,null,"Domain",null,null,"Rank"]
[null,null,null,null,null,null,null,null,null,null,null,null,3,{"$f":"Data!W4","v":"Crevagh_2"}]
[null,null,null,null,null,null,null,null,null,null,null,null,4,{"$f":"Data!W5","v":"Ardoyne_2"},null,null,null,{"$f":"Data!V14","v":"Income"},null,null,{"$f":"Data!W14","v":4}]
[null,null,null,null,null,null,null,null,null,null,null,null,5,{"$f":"Data!W6","v":"Strand_1_Derry"},null,null,null,{"$f":"Data!V15","v":"Employment"},null,null,{"$f":"Data!W15","v":3}]
[null,null,null,null,null,null,null,null,null,null,null,null,6,{"$f":"Data!W7","v":"The Diamond"},null,null,null,{"$f":"Data!V16","v":"Health and Disability"},null,null,{"$f":"Data!W16","v":54}]
[null,null,null,null,null,null,null,null,null,null,null,null,7,{"$f":"Data!W8","v":"New Lodge_2"},null,null,null,{"$f":"Data!V17","v":"Education, Skills & Training"},null,null,{"$f":"Data!W17","v":14}]
[null,null,null,null,null,null,null,null,null,null,null,null,8,{"$f":"Data!W9","v":"Woodvale_1"},null,null,null,{"$f":"Data!V18","v":"Access to Services"},null,null,{"$f":"Data!W18","v":559}]
{"$rows_left_out":20}