{"text_format":"1","workbook":"xlsx","n_sheets":9,"sheets":["Data","Landing","Population Comparison","Population Proportion","Population Pyramid","Dependency Ratios","Population Share","Households","LGDs"],"not_rendered":{"charts":15,"images":3,"macros":1,"external_links":0,"defined_names":33,"comments":0,"pivot_tables":0},"unopened":[],"bounds":{"document_bytes":16777216,"sheet_cells":100000,"rows_first":2000,"rows_last":500,"rows_between":2000,"halvings":0,"cell_chars":16384,"cell_head_chars":4096},"cells_cut":0,"cells_raw":0,"read":"whole","date_system":"1900"}

{"sheet":"Data","index":0,"n_rows":567,"n_cols":95,"rows_kept":567,"cut":false,"hidden":true,"merged":[]}
["Sex","Age",1971,1972,1973,1974,1975,1976,1977,1978,1979,1980,1981,1982,1983,1984,1985,1986,1987,1988,1989,1990,1991,1992,1993,1994,1995,1996,1997,1998,1999,2000,2001,2002,2003,2004,2005,2006,2007,2008,2009,2010,2011,2012,2013,2014,2015,2016,2017,2018,2019,2020,2021,2022,2023,2024,2025,2026,2027,2028,2029,2030,2031,2032,2033,2034,2035,2036,2037,2038,2039,2040,2041,2042,2043,2044,2045,2046,2047,2048,2049,2050,2051,2052,2053,2054,2055,2056,2057,2058,2059,2060,2061,2062,2063]
["Males","0",15886,15862,15215,14569,13849,13412,13192,13124,13551,14126,13861,13627,13803,13775,14163,14208,14335,13988,13617,13250,13251,13191,12565,12295,12257,12296,12450,12025,11903,11493,11142,10847,10950,11315,11539,11592,12279,12954,12973,12722,12943,12980,12523,12440,12393,12736,12195,11858,11626,11503,11395,11271,11167,11088,11007,10920,10839,10765,10705,10661,10634,10623,10629,10656,10703,10769,10853,10946,11039,11125,11198,11255,11292,11298,11282,11243,11189,11116,11029,10932,10832,10730,10633,10539,10450,10372,10300,10241,10192,10152,10125,10108,10100]
["Males","1",15957,15621,15543,15023,14378,13708,13274,13052,13012,13481,14304,13802,13543,13718,13723,14046,14075,14178,13873,13492,13389,13313,13185,12536,12353,12341,12305,12445,12132,11872,11475,11067,10801,10854,11384,11637,11759,12407,13026,13099,12827,12987,13091,12651,12548,12546,12836,12340,11964,11731,11604,11491,11362,11259,11176,11095,11008,10926,10852,10792,10748,10721,10710,10716,10743,10790,10857,10941,11035,11128,11215,11288,11345,11382,11388,11372,11333,11279,11205,11118,11022,10921,10819,10722,10627,10538,10461,10389,10329,10279,10239,10213,10196]
["Males","2",16038,15742,15346,15376,14878,14266,13595,13173,12963,12972,13659,14232,13806,13523,13682,13734,13969,13965,14065,13814,13474,13426,13379,13230,12566,12437,12423,12356,12424,12158,12026,11540,11136,10888,10959,11473,11718,11852,12466,13086,13148,12844,13008,13174,12723,12639,12628,12930,12448,12071,11832,11700,11581,11453,11346,11261,11180,11093,11011,10936,10878,10833,10807,10796,10802,10828,10874,10943,11027,11121,11214,11301,11375,11432,11470,11474,11458,11420,11366,11291,11203,11108,11006,10904,10807,10711,10622,10545,10473,10412,10362,10322,10296]
["Males","3",16269,15824,15468,15186,15236,14767,14160,13496,13085,12928,13137,13532,14172,13781,13455,13615,13675,13828,13820,13923,13762,13524,13426,13392,13202,12608,12453,12419,12372,12439,12017,12043,11587,11167,10953,11060,11522,11770,11877,12486,13111,13183,12865,13026,13248,12787,12685,12701,13005,12524,12142,11900,11761,11644,11511,11404,11319,11238,11150,11067,10992,10934,10888,10862,10851,10857,10883,10929,10999,11083,11177,11270,11358,11432,11489,11527,11531,11515,11477,11424,11348,11259,11164,11062,10960,10862,10766,10677,10599,10527,10466,10416,10376]
["Males","4",16187,16057,15552,15316,15050,15129,14668,14063,13410,13050,12864,13020,13448,14116,13740,13381,13514,13582,13697,13687,13838,13793,13562,13406,13370,13256,12628,12448,12422,12413,12390,12055,12052,11642,11216,11040,11164,11581,11742,11918,12514,13153,13212,12922,13067,13315,12817,12789,12766,13071,12585,12199,11953,11812,11691,11558,11451,11366,11285,11197,11114,11038,10979,10934,10907,10896,10902,10928,10974,11044,11128,11222,11315,11403,11477,11535,11574,11578,11562,11524,11471,11395,11306,11210,11108,11006,10908,10811,10722,10644,10572,10511,10461]
["Males","5",16765,16072,15883,15461,15226,14981,15057,14594,14010,13357,12854,12803,12990,13418,14092,13750,13331,13443,13542,13621,13656,13841,13798,13554,13386,13397,13243,12630,12422,12395,12378,12397,12082,12072,11735,11252,11130,11210,11564,11690,11899,12489,13097,13184,12957,13103,13359,12873,12839,12817,13118,12629,12239,11992,11847,11726,11592,11485,11400,11318,11231,11148,11072,11012,10968,10941,10930,10936,10962,11007,11077,11162,11256,11349,11437,11511,11569,11608,11613,11597,11560,11506,11429,11340,11244,11142,11040,10941,10845,10755,10676,10604,10543]
["Males","6",17051,16655,15902,15796,15376,15105,14910,14985,14496,13961,13168,12788,12757,12935,13349,14043,13699,13229,13346,13484,13556,13721,13899,13779,13550,13419,13421,13264,12641,12410,12429,12382,12407,12101,12110,11794,11322,11156,11178,11548,11655,11916,12529,13120,13223,12988,13148,13386,12914,12880,12854,13151,12659,12269,12018,11873,11751,11616,11510,11424,11342,11255,11172,11096,11036,10992,10965,10954,10960,10986,11031,11102,11186,11279,11374,11462,11536,11594,11633,11638,11622,11585,11531,11453,11364,11268,11166,11064,10965,10868,10780,10700,10628]
["Males","7",16621,16937,16479,15808,15704,15310,15032,14834,14929,14444,13778,13099,12771,12732,12892,13298,13990,13651,13155,13277,13485,13591,13724,13900,13785,13592,13410,13405,13231,12632,12314,12443,12384,12420,12195,12163,11872,11353,11183,11194,11507,11665,11914,12568,13177,13253,13016,13196,13431,12959,12920,12891,13185,12694,12300,12048,11904,11781,11646,11540,11454,11372,11284,11201,11125,11065,11021,10995,10984,10990,11015,11060,11130,11214,11308,11404,11492,11566,11624,11662,11667,11650,11614,11560,11483,11393,11299,11197,11093,10994,10897,10809,10729]
["Males","8",16074,16509,16763,16391,15721,15633,15238,14962,14778,14882,14277,13688,13060,12761,12702,12851,13226,13920,13608,13092,13238,13481,13643,13733,13921,13789,13586,13408,13417,13192,12608,12366,12472,12370,12443,12250,12239,11924,11369,11198,11159,11517,11681,11967,12614,13227,13287,13099,13245,13481,13005,12962,12931,13226,12732,12337,12085,11941,11818,11683,11576,11490,11407,11319,11236,11160,11100,11056,11030,11019,11025,11050,11095,11165,11249,11344,11439,11527,11601,11659,11697,11703,11686,11650,11596,11519,11429,11335,11233,11129,11029,10932,10845]
["Males","9",15260,15959,16334,16678,16302,15649,15562,15168,14911,14727,14720,14197,13651,13054,12773,12705,12821,13169,13889,13606,13091,13303,13449,13648,13764,13939,13786,13599,13350,13410,13266,12595,12399,12493,12417,12479,12309,12249,11952,11358,11195,11164,11547,11718,12008,12663,13253,13347,13149,13296,13528,13050,13003,12972,13265,12771,12374,12123,11980,11855,11720,11613,11526,11444,11356,11273,11197,11135,11092,11067,11056,11062,11087,11132,11201,11286,11382,11477,11565,11639,11697,11735,11741,11723,11687,11633,11556,11466,11373,11270,11167,11067,10969]
["Males","10",14762,15226,15870,16303,16628,16266,15610,15510,15116,14905,14808,14520,14154,13625,13050,12792,12689,12788,13128,13870,13640,13085,13351,13442,13679,13816,13951,13790,13560,13333,13387,13217,12582,12440,12519,12474,12534,12397,12284,11956,11363,11212,11155,11598,11752,12041,12703,13306,13394,13196,13341,13571,13090,13042,13008,13301,12807,12408,12158,12015,11890,11755,11648,11560,11478,11390,11306,11230,11170,11127,11102,11091,11097,11122,11167,11236,11320,11416,11512,11600,11674,11732,11770,11776,11758,11722,11668,11591,11502,11409,11306,11203,11101]
["Males","11",14239,14725,15136,15837,16251,16590,16224,15557,15458,15112,14991,14638,14325,14089,13566,13020,12772,12640,12734,13063,13844,13606,13140,13379,13432,13774,13844,13978,13766,13549,13343,13348,13154,12578,12481,12588,12532,12570,12426,12289,11960,11381,11238,11211,11622,11803,12085,12766,13355,13443,13242,13386,13613,13132,13081,13047,13340,12845,12447,12195,12052,11928,11792,11684,11596,11514,11427,11342,11266,11207,11164,11139,11128,11135,11160,11205,11274,11358,11454,11550,11638,11712,11771,11809,11815,11797,11761,11707,11629,11539,11446,11343,11240]
["Males","12",13713,14207,14642,15105,15787,16213,16550,16168,15506,15453,15200,14825,14498,14143,14030,13520,12987,12750,12610,12692,13044,13789,13572,13127,13430,13461,13808,13882,13955,13791,13583,13326,13338,13109,12590,12546,12655,12587,12611,12467,12293,11975,11366,11269,11253,11664,11838,12140,12811,13401,13488,13284,13425,13653,13170,13118,13084,13377,12882,12483,12231,12088,11964,11828,11720,11632,11550,11462,11378,11302,11243,11200,11175,11164,11172,11197,11242,11311,11395,11492,11586,11675,11749,11809,11847,11853,11835,11799,11745,11666,11576,11483,11380]
["Males","13",13767,13678,14123,14612,15058,15750,16172,16497,16113,15500,15546,15061,14686,14369,13957,13976,13461,12952,12739,12590,12684,12988,13750,13546,13118,13522,13450,13828,13892,13930,13733,13549,13315,13328,13087,12632,12636,12703,12599,12634,12490,12325,11988,11410,11319,11299,11686,11884,12184,12856,13445,13529,13323,13464,13690,13207,13156,13122,13415,12919,12519,12266,12125,12000,11863,11755,11667,11586,11498,11413,11337,11278,11235,11210,11199,11207,11232,11277,11346,11430,11527,11621,11710,11784,11844,11882,11889,11871,11834,11780,11702,11612,11519]
{"$rows_left_out":553}
{"sheet":"Landing","index":1,"n_rows":28,"n_cols":2,"rows_kept":28,"cut":false,"hidden":false,"merged":[[3,1,4,27],[7,1,8,15],[29,1,30,15],[10,1,10,15],[12,1,13,15],[9,1,9,15],[15,1,16,15],[18,1,19,15],[21,1,22,15],[24,1,25,15],[27,1,28,15]]}
[]
[null,"Population Statistics Analysis Package"]
[]
[null,"This package is a macro enabled Excel workbook which provides the functionality to explore population estimates and projections from 1971 through to 2063. It allows users to select relevant years of interest or population sub-groups in order to return or chart the relevant statistics."]
[]
[]
[]
[null,"The following functionality is provided:"]
[]
[null,"Population Comparison:"]
[null,"Provides the functionality to select years of interest in order to return information relating to population by sex and age."]
[null,"Population Proportion"]
[null,"Allows users to select years of interest and population sub-groups (by age) in order to update the chart which shows the proportion of the overall popualtion in each year which is made up by the selected sub-groups."]
[]
[null,"Population Pyramid"]
{"$rows_left_out":14}
{"sheet":"Population Comparison","index":2,"n_rows":22,"n_cols":19,"rows_kept":22,"cut":false,"hidden":false,"merged":[[6,5,7,5],[19,5,20,5]]}
[]
[null,"Population by age and gender"]
[null,"This section allows you to enter years of reference (current, past and future) in order to obtain population figures."]
[null,"Main age groups of interest are provided but custom age groups are also available to select below."]
[]
[]
[null,"Select current year:",null,null,null,{"$f":"Data!$B$312","v":"All"},{"$f":"Data!B309","v":2063},null,{"$f":"Data!B310","v":2062},null,{"$f":"Data!B311","v":2063},null,null,{"$f":"G7&\" to \"&I7","v":"2063 to 2062"},null,{"$f":"I7&\" to \"&K7","v":"2062 to 2063"},null,{"$f":"G7&\" to \"&K7","v":"2063 to 2063"}]
[null,null,null,null,null,null,"Population","Proportion","Population","Proportion","Population","Proportion",null,"Change","% change","Change","% change","Change","% change"]
[null,"Select previous year:",null,null,null,"Aged 0-15",{"$f":"OFFSET(Data!$B$276,MATCH(Data!$B$312,Data!$A$277:$A$300,0),Data!$B$305)","v":339449},{"$f":"G9/G$13","v":0.17208115136798455},{"$f":"OFFSET(Data!$B$276,MATCH(Data!$B$312,Data!$A$277:$A$300,0),Data!$B$306)","v":341610},{"$f":"I9/I$13","v":0.17295202645643012},{"$f":"OFFSET(Data!$B$276,MATCH(Data!$B$312,Data!$A$277:$A$300,0),Data!$B$307)","v":339449},{"$f":"K9/K$13","v":0.17208115136798455},null,{"$f":"IF(G$7<=I$7,I9-G9,\"invalid\")","v":"invalid"},{"$f":"IF(N9<>\"invalid\",(I9/G9-1),\"invalid\")","v":"invalid"},{"$f":"IF(I$7<=K$7,K9-I9,\"invalid\")","v":-2161},{"$f":"IF(P9<>\"invalid\",(K9/I9-1),\"invalid\")","v":-6.3259272269546862E-3},{"$f":"IF(G$7<=K$7,K9-G9,\"invalid\")","v":0},{"$f":"IF(R9<>\"invalid\",(K9/G9-1),\"invalid\")","v":0}]
[null,null,null,null,null,"Aged 16-64",{"$f":"OFFSET(Data!$B$276,MATCH(Data!$B$312,Data!$A$277:$A$300,0)+1,Data!$B$305)","v":1095623},{"$f":"G10/G$13","v":0.55541794880893847},{"$f":"OFFSET(Data!$B$276,MATCH(Data!$B$312,Data!$A$277:$A$300,0)+1,Data!$B$306)","v":1096617},0.55520076226272952,{"$f":"OFFSET(Data!$B$276,MATCH(Data!$B$312,Data!$A$277:$A$300,0)+1,Data!$B$307)","v":1095623},{"$f":"K10/K$13","v":0.55541794880893847},null,{"$f":"IF(G$7<=I$7,I10-G10,\"invalid\")","v":"invalid"},{"$f":"IF(N10<>\"invalid\",(I10/G10-1),\"invalid\")","v":"invalid"},{"$f":"IF(I$7<=K$7,K10-I10,\"invalid\")","v":-994},{"$f":"IF(P10<>\"invalid\",(K10/I10-1),\"invalid\")","v":-9.0642402953811096E-4},{"$f":"IF(G$7<=K$7,K10-G10,\"invalid\")","v":0},{"$f":"IF(R10<>\"invalid\",(K10/G10-1),\"invalid\")","v":0}]
[null,"Select future year:",null,null,null,"Aged 65+",{"$f":"OFFSET(Data!$B$276,MATCH(Data!$B$312,Data!$A$277:$A$300,0)+2,Data!$B$305)","v":537538},0.27250089982307701,{"$f":"OFFSET(Data!$B$276,MATCH(Data!$B$312,Data!$A$277:$A$300,0)+2,Data!$B$306)","v":536945},0.27184721128084033,{"$f":"OFFSET(Data!$B$276,MATCH(Data!$B$312,Data!$A$277:$A$300,0)+2,Data!$B$307)","v":537538},{"$f":"K11/K$13","v":0.27250089982307701},null,"invalid","invalid",593,1.1043961672052571E-3,0,0]
[null,null,null,null,null,"Aged 85+",{"$f":"OFFSET(Data!$B$276,MATCH(Data!$B$312,Data!$A$277:$A$300,0)+3,Data!$B$305)","v":117548},5.9590086230932621E-2,{"$f":"OFFSET(Data!$B$276,MATCH(Data!$B$312,Data!$A$277:$A$300,0)+3,Data!$B$306)","v":117415},5.944545588941115E-2,{"$f":"OFFSET(Data!$B$276,MATCH(Data!$B$312,Data!$A$277:$A$300,0)+3,Data!$B$307)","v":117548},{"$f":"K12/K$13","v":5.9590086230932621E-2},null,"invalid","invalid",133,1.1327343184430738E-3,0,0]
[null,"Select gender:",null,null,null,"All persons",{"$f":"OFFSET(Data!$B$276,MATCH(Data!$B$312,Data!$A$277:$A$300,0)+4,Data!$B$305)","v":1972610},1,{"$f":"OFFSET(Data!$B$276,MATCH(Data!$B$312,Data!$A$277:$A$300,0)+4,Data!$B$306)","v":1975172},1,{"$f":"OFFSET(Data!$B$276,MATCH(Data!$B$312,Data!$A$277:$A$300,0)+4,Data!$B$307)","v":1972610},{"$f":"K13/K$13","v":1},null,"invalid","invalid",-2562,-1.2971022270465982E-3,0,0]
[null,null,null,null,null,"Median age",{"$f":"OFFSET(Data!$B$276,MATCH(Data!$B$312,Data!$A$277:$A$300,0)+5,Data!$B$305)","v":45.780378229999997},null,{"$f":"OFFSET(Data!$B$276,MATCH(Data!$B$312,Data!$A$277:$A$300,0)+5,Data!$B$306)","v":45.670519990000003},null,{"$f":"OFFSET(Data!$B$276,MATCH(Data!$B$312,Data!$A$277:$A$300,0)+5,Data!$B$307)","v":45.780378229999997},null,null,{"$f":"IF(G7<=I7,I14-G14,\"invalid\")","v":"invalid"},null,{"$f":"IF(I7<=K7,K14-I14,\"invalid\")","v":0.10985823999999411},null,{"$f":"IF(G7<=K7,K14-G14,\"invalid\")","v":0}]
[]
{"$rows_left_out":8}
{"sheet":"Population Proportion","index":3,"n_rows":24,"n_cols":4,"rows_kept":24,"cut":false,"hidden":false,"merged":[]}
[]
[null,"Population Proportion"]
[null,"The following chart displays the time series for selected age groups as a proportion of the population.  Simply select the years of interest, the gender (Males, Females or All persons) and the age groups of interest."]
[null,"Alternatively you can define a custom age band by checking the \"custom\" box and entering lower and upper bounds of your age group of interest (use the same value in the lower and upper bound for single years of age)."]
[]
[null,"Select start year:"]
[]
[null,"Select end year:"]
[]
[null,"Select gender:"]
[]
[null,"Select age group:"]
[null,"(select any: check on or off)"]
[null,null,"Children (aged 0-15)"]
[null,null,"Aged 16-39"]
{"$rows_left_out":10}
{"sheet":"Population Pyramid","index":4,"n_rows":23,"n_cols":13,"rows_kept":23,"cut":false,"hidden":false,"merged":[[13,2,14,2],[13,3,14,3],[13,1,14,1]]}
[]
[null,"Population pyramids"]
[null,"This section shows how the age-sex distribution of the population changes over time in the form of population pyramids."]
[null,"It also provides population data for some pre-defined and custom age groups in the table."]
[null,"For custom ages simply enter the upper and lower bounds of the age band (0-90; 90 = 90 and above)"]
[null,"Use the \"Play\", \"Stop\" and \"Reset\" buttons to control the pyramid."]
[]
[null,"Select reference year:"]
[]
[null,"Select start year:"]
[]
[null,"Select end year:"]
[]
[null,null,"Lower bound","Upper bound",{"$f":"Data!$B$323","v":2036},null,null,{"$f":"Data!$B$322","v":2018},null,null,{"$f":"Data!$B$324","v":2043}]
[null,null,null,null,"All persons","% Male","% Female","All persons","% Male","% Female","All persons","% Male","% Female"]
{"$rows_left_out":9}
{"sheet":"Dependency Ratios","index":5,"n_rows":6,"n_cols":10,"rows_kept":6,"cut":false,"hidden":false,"merged":[]}
[]
[null,"Dependency Ratios"]
[null,"The following charts display the dependency ratios for those aged 0-15, 65+ and 16-64."]
[null,"Simply select the years and gender of interest and then, for each chart, select a numerator and denominator of interest."]
[]
[null,"Select start year:",null,null,null,"Select end year:",null,null,null,"Select gender:"]

{"sheet":"Population Share","index":6,"n_rows":15,"n_cols":3,"rows_kept":15,"cut":false,"hidden":false,"merged":[]}
[]
[null,"Population Share"]
[null,"This section provides a time series chart showing Northern Ireland's population share of selected regions in the UK."]
[]
[]
[null,"Select start year:"]
[]
[null,"Select end year:"]
[]
[null,"Select region:"]
[null,"(select any: check on or off)"]
[null,null,"United Kindom"]
[null,null,"Great Britain"]
[null,null,"England"]
[null,null,"England & Wales"]
{"$rows_left_out":1}
{"sheet":"Households","index":7,"n_rows":14,"n_cols":3,"rows_kept":14,"cut":false,"hidden":false,"merged":[]}
[]
[null,"Households"]
[null,"The following chart shows data related to the 2016-based household projections."]
[]
[null,"Select chart elements:"]
[]
[null,{"$f":"Data!$B$423&\":\"","v":"Household Size:"}]
[null,"(select any: check on or off)"]
[null,null,{"$f":"IF(Data!$B$422=1,Data!B401,IF(Data!$B$422=2,Data!B411,Data!$B$417))","v":"1 person"}]
[null,null,{"$f":"IF(Data!$B$422=1,Data!B402,IF(Data!$B$422=2,Data!B412,\"\"))","v":"2 persons"}]
[null,null,{"$f":"IF(Data!$B$422=1,Data!B403,IF(Data!$B$422=2,Data!B413,\"\"))","v":"3 persons"}]
[null,null,{"$f":"IF(Data!$B$422=1,Data!B404,IF(Data!$B$422=2,Data!B414,\"\"))","v":"4 persons"}]
[null,null,{"$f":"IF(Data!$B$422=1,Data!B405,IF(Data!$B$422=2,Data!B415,\"\"))","v":"5+ persons"}]
[null,null,{"$f":"IF(Data!$B$422=1,Data!B406,IF(Data!$B$422=2,Data!B416,\"\"))","v":"Total households"}]

{"sheet":"LGDs","index":8,"n_rows":4,"n_cols":2,"rows_kept":4,"cut":false,"hidden":false,"merged":[]}
[]
[null,"Local Government Districts"]
[null,"The following chart displays the growth of LGDs from 2001 to 2039.  The y axis is the proportion of people aged 65 and over, while the x axis represents the growth in the LGD from 2001.  The size of the bubble reflects the relative size of the LGD in terms of NI population share."]
[null,"Simply click the play button to see the change."]