{"text_format":"1","workbook":"xlsx","n_sheets":9,"sheets":["Data","Landing","Population Comparison","Population Proportion","Population Pyramid","Dependency Ratios","Population Share","Households","LGDs"],"not_rendered":{"charts":15,"images":3,"macros":1,"external_links":0,"defined_names":33,"comments":0,"pivot_tables":0},"unopened":[],"bounds":{"document_bytes":16777216,"sheet_cells":100000,"rows_first":2000,"rows_last":500,"rows_between":2000,"halvings":0,"cell_chars":16384,"cell_head_chars":4096},"cells_cut":0,"cells_raw":0,"read":"whole","date_system":"1900"}

{"sheet":"Data","index":0,"n_rows":567,"n_cols":95,"rows_kept":567,"cut":false,"hidden":true,"merged":[]}
["Sex","Age",1971,1972,1973,1974,1975,1976,1977,1978,1979,1980,1981,1982,1983,1984,1985,1986,1987,1988,1989,1990,1991,1992,1993,1994,1995,1996,1997,1998,1999,2000,2001,2002,2003,2004,2005,2006,2007,2008,2009,2010,2011,2012,2013,2014,2015,2016,2017,2018,2019,2020,2021,2022,2023,2024,2025,2026,2027,2028,2029,2030,2031,2032,2033,2034,2035,2036,2037,2038,2039,2040,2041,2042,2043,2044,2045,2046,2047,2048,2049,2050,2051,2052,2053,2054,2055,2056,2057,2058,2059,2060,2061,2062,2063]
["Males","0",15886,15862,15215,14569,13849,13412,13192,13124,13551,14126,13861,13627,13803,13775,14163,14208,14335,13988,13617,13250,13251,13191,12565,12295,12257,12296,12450,12025,11903,11493,11142,10847,10950,11315,11539,11592,12279,12954,12973,12722,12943,12980,12523,12440,12393,12736,12195,11858,11626,11503,11395,11271,11167,11088,11007,10920,10839,10765,10705,10661,10634,10623,10629,10656,10703,10769,10853,10946,11039,11125,11198,11255,11292,11298,11282,11243,11189,11116,11029,10932,10832,10730,10633,10539,10450,10372,10300,10241,10192,10152,10125,10108,10100]
["Males","1",15957,15621,15543,15023,14378,13708,13274,13052,13012,13481,14304,13802,13543,13718,13723,14046,14075,14178,13873,13492,13389,13313,13185,12536,12353,12341,12305,12445,12132,11872,11475,11067,10801,10854,11384,11637,11759,12407,13026,13099,12827,12987,13091,12651,12548,12546,12836,12340,11964,11731,11604,11491,11362,11259,11176,11095,11008,10926,10852,10792,10748,10721,10710,10716,10743,10790,10857,10941,11035,11128,11215,11288,11345,11382,11388,11372,11333,11279,11205,11118,11022,10921,10819,10722,10627,10538,10461,10389,10329,10279,10239,10213,10196]
["Males","2",16038,15742,15346,15376,14878,14266,13595,13173,12963,12972,13659,14232,13806,13523,13682,13734,13969,13965,14065,13814,13474,13426,13379,13230,12566,12437,12423,12356,12424,12158,12026,11540,11136,10888,10959,11473,11718,11852,12466,13086,13148,12844,13008,13174,12723,12639,12628,12930,12448,12071,11832,11700,11581,11453,11346,11261,11180,11093,11011,10936,10878,10833,10807,10796,10802,10828,10874,10943,11027,11121,11214,11301,11375,11432,11470,11474,11458,11420,11366,11291,11203,11108,11006,10904,10807,10711,10622,10545,10473,10412,10362,10322,10296]
["Males","3",16269,15824,15468,15186,15236,14767,14160,13496,13085,12928,13137,13532,14172,13781,13455,13615,13675,13828,13820,13923,13762,13524,13426,13392,13202,12608,12453,12419,12372,12439,12017,12043,11587,11167,10953,11060,11522,11770,11877,12486,13111,13183,12865,13026,13248,12787,12685,12701,13005,12524,12142,11900,11761,11644,11511,11404,11319,11238,11150,11067,10992,10934,10888,10862,10851,10857,10883,10929,10999,11083,11177,11270,11358,11432,11489,11527,11531,11515,11477,11424,11348,11259,11164,11062,10960,10862,10766,10677,10599,10527,10466,10416,10376]
["Males","4",16187,16057,15552,15316,15050,15129,14668,14063,13410,13050,12864,13020,13448,14116,13740,13381,13514,13582,13697,13687,13838,13793,13562,13406,13370,13256,12628,12448,12422,12413,12390,12055,12052,11642,11216,11040,11164,11581,11742,11918,12514,13153,13212,12922,13067,13315,12817,12789,12766,13071,12585,12199,11953,11812,11691,11558,11451,11366,11285,11197,11114,11038,10979,10934,10907,10896,10902,10928,10974,11044,11128,11222,11315,11403,11477,11535,11574,11578,11562,11524,11471,11395,11306,11210,11108,11006,10908,10811,10722,10644,10572,10511,10461]
["Males","5",16765,16072,15883,15461,15226,14981,15057,14594,14010,13357,12854,12803,12990,13418,14092,13750,13331,13443,13542,13621,13656,13841,13798,13554,13386,13397,13243,12630,12422,12395,12378,12397,12082,12072,11735,11252,11130,11210,11564,11690,11899,12489,13097,13184,12957,13103,13359,12873,12839,12817,13118,12629,12239,11992,11847,11726,11592,11485,11400,11318,11231,11148,11072,11012,10968,10941,10930,10936,10962,11007,11077,11162,11256,11349,11437,11511,11569,11608,11613,11597,11560,11506,11429,11340,11244,11142,11040,10941,10845,10755,10676,10604,10543]
["Males","6",17051,16655,15902,15796,15376,15105,14910,14985,14496,13961,13168,12788,12757,12935,13349,14043,13699,13229,13346,13484,13556,13721,13899,13779,13550,13419,13421,13264,12641,12410,12429,12382,12407,12101,12110,11794,11322,11156,11178,11548,11655,11916,12529,13120,13223,12988,13148,13386,12914,12880,12854,13151,12659,12269,12018,11873,11751,11616,11510,11424,11342,11255,11172,11096,11036,10992,10965,10954,10960,10986,11031,11102,11186,11279,11374,11462,11536,11594,11633,11638,11622,11585,11531,11453,11364,11268,11166,11064,10965,10868,10780,10700,10628]
["Males","7",16621,16937,16479,15808,15704,15310,15032,14834,14929,14444,13778,13099,12771,12732,12892,13298,13990,13651,13155,13277,13485,13591,13724,13900,13785,13592,13410,13405,13231,12632,12314,12443,12384,12420,12195,12163,11872,11353,11183,11194,11507,11665,11914,12568,13177,13253,13016,13196,13431,12959,12920,12891,13185,12694,12300,12048,11904,11781,11646,11540,11454,11372,11284,11201,11125,11065,11021,10995,10984,10990,11015,11060,11130,11214,11308,11404,11492,11566,11624,11662,11667,11650,11614,11560,11483,11393,11299,11197,11093,10994,10897,10809,10729]
["Males","8",16074,16509,16763,16391,15721,15633,15238,14962,14778,14882,14277,13688,13060,12761,12702,12851,13226,13920,13608,13092,13238,13481,13643,13733,13921,13789,13586,13408,13417,13192,12608,12366,12472,12370,12443,12250,12239,11924,11369,11198,11159,11517,11681,11967,12614,13227,13287,13099,13245,13481,13005,12962,12931,13226,12732,12337,12085,11941,11818,11683,11576,11490,11407,11319,11236,11160,11100,11056,11030,11019,11025,11050,11095,11165,11249,11344,11439,11527,11601,11659,11697,11703,11686,11650,11596,11519,11429,11335,11233,11129,11029,10932,10845]
["Males","9",15260,15959,16334,16678,16302,15649,15562,15168,14911,14727,14720,14197,13651,13054,12773,12705,12821,13169,13889,13606,13091,13303,13449,13648,13764,13939,13786,13599,13350,13410,13266,12595,12399,12493,12417,12479,12309,12249,11952,11358,11195,11164,11547,11718,12008,12663,13253,13347,13149,13296,13528,13050,13003,12972,13265,12771,12374,12123,11980,11855,11720,11613,11526,11444,11356,11273,11197,11135,11092,11067,11056,11062,11087,11132,11201,11286,11382,11477,11565,11639,11697,11735,11741,11723,11687,11633,11556,11466,11373,11270,11167,11067,10969]
["Males","10",14762,15226,15870,16303,16628,16266,15610,15510,15116,14905,14808,14520,14154,13625,13050,12792,12689,12788,13128,13870,13640,13085,13351,13442,13679,13816,13951,13790,13560,13333,13387,13217,12582,12440,12519,12474,12534,12397,12284,11956,11363,11212,11155,11598,11752,12041,12703,13306,13394,13196,13341,13571,13090,13042,13008,13301,12807,12408,12158,12015,11890,11755,11648,11560,11478,11390,11306,11230,11170,11127,11102,11091,11097,11122,11167,11236,11320,11416,11512,11600,11674,11732,11770,11776,11758,11722,11668,11591,11502,11409,11306,11203,11101]
["Males","11",14239,14725,15136,15837,16251,16590,16224,15557,15458,15112,14991,14638,14325,14089,13566,13020,12772,12640,12734,13063,13844,13606,13140,13379,13432,13774,13844,13978,13766,13549,13343,13348,13154,12578,12481,12588,12532,12570,12426,12289,11960,11381,11238,11211,11622,11803,12085,12766,13355,13443,13242,13386,13613,13132,13081,13047,13340,12845,12447,12195,12052,11928,11792,11684,11596,11514,11427,11342,11266,11207,11164,11139,11128,11135,11160,11205,11274,11358,11454,11550,11638,11712,11771,11809,11815,11797,11761,11707,11629,11539,11446,11343,11240]
["Males","12",13713,14207,14642,15105,15787,16213,16550,16168,15506,15453,15200,14825,14498,14143,14030,13520,12987,12750,12610,12692,13044,13789,13572,13127,13430,13461,13808,13882,13955,13791,13583,13326,13338,13109,12590,12546,12655,12587,12611,12467,12293,11975,11366,11269,11253,11664,11838,12140,12811,13401,13488,13284,13425,13653,13170,13118,13084,13377,12882,12483,12231,12088,11964,11828,11720,11632,11550,11462,11378,11302,11243,11200,11175,11164,11172,11197,11242,11311,11395,11492,11586,11675,11749,11809,11847,11853,11835,11799,11745,11666,11576,11483,11380]
["Males","13",13767,13678,14123,14612,15058,15750,16172,16497,16113,15500,15546,15061,14686,14369,13957,13976,13461,12952,12739,12590,12684,12988,13750,13546,13118,13522,13450,13828,13892,13930,13733,13549,13315,13328,13087,12632,12636,12703,12599,12634,12490,12325,11988,11410,11319,11299,11686,11884,12184,12856,13445,13529,13323,13464,13690,13207,13156,13122,13415,12919,12519,12266,12125,12000,11863,11755,11667,11586,11498,11413,11337,11278,11235,11210,11199,11207,11232,11277,11346,11430,11527,11621,11710,11784,11844,11882,11889,11871,11834,11780,11702,11612,11519]
["Males","14",13755,13728,13590,14087,14565,15020,15711,16117,16438,16101,15586,15364,14927,14541,14225,13765,13897,13385,12911,12719,12578,12633,12913,13688,13506,13111,13572,13449,13814,13891,14022,13711,13528,13293,13303,13056,12665,12691,12729,12621,12645,12540,12354,12035,11445,11352,11351,11754,11931,12232,12902,13487,13569,13365,13502,13730,13246,13195,13161,13454,12957,12558,12304,12163,12038,11901,11793,11705,11624,11536,11450,11375,11316,11273,11248,11237,11245,11269,11314,11383,11468,11564,11658,11748,11822,11882,11920,11927,11909,11871,11817,11740,11650]
["Males","15",13663,13314,13229,13286,13841,14364,14843,15548,16022,16271,15272,15378,15185,14796,14393,14079,13568,13813,13318,12873,12712,12521,12562,12842,13607,13463,13118,13605,13411,13839,13998,13987,13681,13501,13277,13312,13073,12662,12750,12750,12622,12678,12534,12381,12062,11475,11387,11396,11796,11975,12274,12941,13524,13607,13399,13537,13765,13282,13231,13197,13490,12993,12594,12341,12199,12074,11937,11829,11740,11659,11571,11485,11410,11351,11308,11283,11272,11280,11304,11349,11418,11503,11599,11693,11783,11857,11917,11955,11962,11944,11906,11852,11775]
["Males","16",13346,13227,12821,12924,13043,13644,14189,14685,15450,15855,15447,15140,15188,15031,14678,14262,13944,13381,13750,13267,12872,12596,12474,12490,12760,13531,13400,13081,13607,13381,13985,13952,13956,13639,13480,13276,13299,13052,12695,12785,12774,12628,12652,12566,12422,12100,11502,11428,11436,11836,12013,12310,12975,13559,13640,13432,13570,13798,13315,13264,13230,13523,13025,12627,12373,12231,12106,11970,11861,11773,11693,11605,11519,11444,11385,11342,11317,11306,11314,11338,11383,11452,11537,11633,11727,11817,11891,11951,11989,11996,11978,11940,11886]
["Males","17",13598,13266,13156,12932,13063,13274,13832,14433,14945,15618,15313,15430,15115,15104,14961,14643,14221,13902,13287,13787,13318,12748,12508,12379,12405,12702,13479,13331,13056,13652,13353,13990,13972,13922,13643,13490,13299,13277,13024,12715,12835,12777,12633,12656,12588,12433,12111,11534,11457,11465,11863,12038,12332,12998,13581,13661,13454,13591,13819,13336,13285,13253,13546,13047,12650,12395,12253,12127,11992,11883,11795,11715,11627,11541,11466,11407,11364,11339,11328,11336,11360,11405,11474,11559,11655,11749,11839,11913,11973,12011,12018,12001,11963]
["Males","18",12211,11652,11240,11525,12282,12560,12686,13217,13763,14210,15025,15505,15606,15246,15192,15055,14833,14353,14053,13379,14015,13439,13019,12521,11622,11629,11945,12550,12301,12163,13432,13315,13874,13985,13960,13743,13514,13329,13416,13099,12810,12859,12773,12715,12689,12610,12488,12160,11557,11480,11485,11880,12052,12346,13009,13591,13671,13464,13601,13829,13347,13296,13264,13557,13058,12661,12406,12265,12139,12004,11897,11809,11728,11641,11555,11480,11421,11378,11352,11342,11351,11375,11420,11489,11574,11670,11763,11854,11928,11987,12025,12032,12015]
["Males","19",12205,11885,11276,11016,11346,12153,12446,12573,13137,13619,14435,15042,15456,15499,15184,15055,15018,14720,14270,13981,13307,13649,13007,12236,11917,11129,11314,11477,11897,11744,11494,13032,12753,13451,13511,13480,13287,13138,13073,13116,12783,12437,12557,12430,12380,12334,12199,12124,11958,11361,11292,11293,11682,11846,12128,12786,13353,13420,13212,13355,13579,13094,13054,13023,13317,12811,12426,12181,12045,11923,11791,11687,11601,11521,11436,11352,11279,11222,11180,11155,11146,11155,11180,11224,11293,11376,11470,11561,11652,11724,11781,11818,11824]
["Males","20",13463,13315,13197,12968,12552,12945,12848,13109,13447,13971,14288,13758,14381,14698,14801,14472,14347,14140,13957,13524,13393,13035,13356,12641,11920,11817,11125,11089,11094,11617,11565,11325,12623,12301,12848,12929,12840,12778,12720,12651,12755,12291,12199,12423,12339,12295,12062,12114,11829,11670,11082,11012,11007,11387,11534,11808,12450,12997,13058,12855,12996,13213,12739,12704,12674,12962,12467,12096,11860,11729,11611,11483,11383,11299,11223,11141,11060,10989,10933,10894,10869,10862,10871,10895,10939,11006,11087,11178,11266,11355,11424,11480,11515]
["Males","21",13067,13012,12675,12651,12349,12470,12618,12582,12980,13175,13609,13620,13184,13753,14051,14136,13876,13486,13379,13287,13015,13470,13059,13186,12392,11738,11697,11051,10769,10942,11629,11494,11251,12359,12247,12742,12821,12812,12774,12715,12649,12638,12452,12112,12287,12162,12074,11978,11986,11704,11541,10951,10875,10870,11237,11379,11650,12284,12822,12880,12680,12819,13034,12565,12532,12502,12788,12298,11933,11703,11574,11457,11331,11233,11150,11077,10995,10917,10846,10790,10753,10728,10722,10733,10756,10799,10864,10945,11036,11122,11210,11278,11333]
["Males","22",12508,12611,12369,12132,12033,12268,12150,12347,12468,12722,12813,13283,13338,12930,13541,13755,13896,13447,13074,13021,13106,13216,13572,13002,12899,12341,11685,11521,10844,10671,11014,11507,11410,11293,12303,12239,12765,12804,12933,12756,12628,12683,12475,12377,12091,12201,12099,12010,11927,11934,11645,11473,10876,10803,10789,11153,11294,11564,12193,12726,12782,12585,12724,12937,12470,12438,12410,12693,12207,11844,11617,11489,11372,11249,11151,11070,10998,10916,10839,10768,10712,10676,10652,10646,10657,10679,10722,10786,10867,10958,11044,11131,11198]
["Males","23",11871,12061,11977,11835,11520,11956,11952,11887,12231,12208,12358,12566,13138,13150,12856,13440,13640,13587,13202,12802,12937,13263,13209,13397,12651,12697,12195,11462,11102,10623,10367,10954,11416,11459,11445,12341,12368,12793,12838,12884,12603,12726,12426,12377,12391,12021,12090,12097,12006,11925,11921,11622,11439,10846,10763,10751,11113,11253,11521,12149,12679,12732,12536,12675,12886,12422,12392,12365,12646,12160,11801,11577,11449,11333,11211,11113,11032,10961,10880,10804,10732,10677,10641,10618,10611,10622,10645,10688,10752,10833,10923,11007,11095]
["Males","24",11401,11427,11432,11436,11229,11449,11642,11685,11775,11972,11837,12163,12447,12990,13065,12821,13448,13365,13388,13037,12727,13251,13402,13154,13196,12599,12653,11969,11154,10946,10457,10433,10889,11605,11606,11682,12444,12452,12861,12750,12696,12660,12335,12366,12377,12292,11816,11942,12078,11987,11896,11881,11572,11392,10790,10710,10698,11058,11197,11464,12089,12615,12667,12472,12610,12821,12360,12332,12305,12585,12098,11743,11520,11394,11280,11158,11060,10981,10910,10830,10753,10682,10629,10592,10569,10563,10574,10597,10639,10704,10785,10873,10957]
["Males","25",10472,11398,11220,11081,10956,10938,10806,10992,10979,10998,11017,11057,11474,11738,12366,12441,12270,12669,12597,12643,12456,12372,12693,12893,12675,13008,12447,12436,11539,10917,10868,10488,10505,10980,11752,11717,11895,12534,12522,12731,12535,12570,12309,12273,12310,12334,12242,11813,11924,12060,11958,11857,11830,11523,11333,10734,10655,10644,11002,11141,11407,12030,12553,12605,12410,12548,12759,12301,12274,12247,12526,12041,11685,11465,11340,11226,11104,11007,10929,10857,10777,10702,10630,10579,10542,10519,10513,10524,10547,10589,10654,10735,10822]
["Males","26",10148,10612,11398,11109,10835,10851,10770,10690,10857,10790,10540,10880,11037,11427,11669,12314,12393,12149,12581,12455,12623,12750,12568,12827,12787,12813,13006,12388,12098,11454,10733,10943,10564,10582,11086,11932,12022,12073,12466,12428,12535,12442,12414,12307,12301,12327,12317,12279,11840,11950,12076,11965,11853,11827,11511,11321,10723,10645,10633,10992,11131,11397,12019,12541,12593,12398,12537,12748,12291,12264,12238,12516,12031,11675,11456,11331,11218,11097,10999,10921,10849,10769,10694,10623,10573,10535,10513,10507,10518,10542,10583,10649,10730]
["Males","27",10269,10282,10608,11294,10853,10738,10688,10653,10559,10673,10333,10416,10849,11006,11405,11593,12273,12220,12070,12505,12412,12919,12901,12786,12858,12945,12891,12959,12180,11966,11253,10882,10973,10610,10698,11310,12209,12214,12104,12276,12244,12527,12278,12400,12352,12332,12365,12379,12335,11896,11997,12115,11996,11884,11849,11535,11345,10747,10668,10655,11015,11153,11421,12043,12565,12616,12423,12561,12772,12318,12290,12264,12542,12056,11700,11481,11357,11244,11123,11024,10946,10874,10794,10720,10649,10599,10562,10540,10534,10544,10568,10610,10676]
["Males","28",10234,10405,10280,10498,11045,10750,10576,10578,10518,10373,10214,10125,10276,10710,10921,11302,11467,12013,12007,11925,12436,12618,12965,12956,12675,12915,12912,12711,12705,12109,11892,11294,10975,10889,10738,10869,11471,12398,12359,12132,12078,12171,12338,12277,12403,12373,12345,12439,12434,12389,11942,12036,12145,12026,11907,11873,11558,11368,10770,10690,10678,11038,11176,11445,12068,12590,12642,12449,12586,12799,12346,12316,12290,12568,12082,11725,11508,11382,11269,11149,11050,10970,10899,10820,10744,10674,10623,10586,10564,10558,10569,10595,10635]
["Males","29",9352,10368,10402,10173,10256,10944,10587,10467,10451,10333,9914,10054,10035,10175,10646,10877,11255,11264,11854,11861,11910,12644,12669,13062,12904,12833,12940,12792,12519,12553,12076,12053,11435,10983,10988,10838,11116,11566,12431,12355,12043,11967,12059,12276,12346,12434,12391,12349,12487,12483,12430,11975,12062,12171,12044,11925,11891,11576,11386,10788,10708,10695,11056,11194,11464,12088,12610,12662,12470,12608,12822,12368,12337,12311,12589,12105,11747,11529,11402,11289,11169,11069,10990,10918,10839,10764,10694,10642,10605,10583,10577,10588,10615]
["Males","30",8905,9179,9996,9920,9653,9855,10607,10320,10232,10200,9986,9790,10013,10009,10163,10652,10903,11167,11171,11768,11846,12045,12661,12686,12932,12968,12845,12868,12567,12440,12441,12182,12130,11345,11056,11113,11011,11273,11646,12424,12341,12030,11920,12052,12352,12386,12493,12501,12413,12552,12541,12480,12019,12105,12209,12081,11962,11928,11614,11424,10824,10745,10731,11093,11232,11502,12125,12649,12700,12510,12647,12862,12408,12377,12351,12629,12144,11786,11569,11442,11329,11208,11107,11028,10957,10878,10803,10732,10680,10644,10622,10615,10626]
["Males","31",8891,8988,9178,9938,9817,9569,9840,10550,10253,10117,9960,9895,9750,10003,10037,10179,10682,10871,11141,11109,11771,11963,12066,12631,12673,13015,12928,12867,12726,12533,12413,12437,12200,12064,11494,11157,11323,11148,11315,11616,12370,12295,11923,11910,12101,12391,12463,12625,12583,12495,12629,12610,12543,12083,12162,12266,12138,12019,11985,11671,11480,10881,10801,10787,11149,11288,11559,12183,12708,12760,12570,12707,12921,12467,12437,12412,12689,12204,11845,11628,11502,11390,11267,11166,11087,11016,10936,10862,10789,10738,10702,10680,10673]
["Males","32",8926,8977,8991,9131,9840,9733,9539,9778,10486,10135,9874,9890,9889,9725,10032,10073,10213,10662,10888,11141,11111,11833,11982,12076,12586,12820,13062,12951,12740,12660,12435,12487,12458,12256,12130,11643,11387,11402,11213,11336,11580,12290,12188,11885,11918,12105,12389,12519,12684,12641,12549,12677,12651,12586,12119,12199,12303,12174,12056,12021,11708,11517,10918,10838,10824,11185,11326,11597,12221,12747,12799,12609,12746,12961,12507,12477,12452,12730,12244,11886,11667,11541,11428,11306,11205,11127,11054,10975,10899,10826,10776,10740,10719]
["Males","33",8750,9013,8981,8941,9036,9748,9713,9482,9710,10371,9894,9819,9862,9866,9712,10045,10114,10174,10655,10904,11174,11297,11884,12064,12128,12712,12905,13158,12900,12764,12731,12477,12496,12462,12370,12191,11747,11514,11420,11237,11280,11506,12180,12154,11910,11922,12127,12440,12557,12722,12673,12577,12700,12675,12604,12138,12218,12322,12193,12075,12040,11726,11537,10937,10856,10842,11203,11345,11616,12241,12767,12820,12630,12767,12983,12528,12499,12475,12753,12267,11907,11687,11561,11448,11326,11226,11147,11073,10995,10919,10847,10797,10761]
["Males","34",8820,8836,9017,8931,8848,8953,9732,9657,9416,9593,10133,9780,9729,9774,9815,9651,10019,10036,10113,10603,10907,11231,11292,11849,12017,12179,12655,12898,13083,12904,12681,12749,12499,12542,12547,12455,12309,11849,11558,11390,11154,11251,11414,12173,12214,11924,11912,12190,12483,12599,12760,12708,12606,12729,12699,12630,12163,12242,12348,12219,12101,12064,11751,11562,10962,10879,10865,11226,11371,11642,12267,12794,12847,12657,12795,13011,12556,12527,12502,12782,12295,11935,11714,11588,11475,11354,11253,11174,11099,11022,10945,10873,10823]
["Males","35",8433,8813,8732,8864,8740,8626,8776,9509,9470,9240,9580,10074,9764,9711,9758,9829,9652,10002,10042,10117,10635,10954,11239,11260,11821,12070,12202,12668,12866,13138,13036,12767,12832,12599,12652,12654,12530,12320,11873,11573,11270,11084,11118,11395,12159,12195,11922,11965,12224,12518,12630,12786,12728,12628,12746,12717,12647,12182,12260,12366,12238,12120,12083,11769,11581,10979,10897,10883,11244,11390,11661,12287,12815,12868,12677,12815,13031,12577,12547,12523,12803,12317,11957,11735,11609,11496,11375,11273,11195,11120,11042,10965,10893]
["Males","36",8091,8476,8787,8671,8770,8608,8581,8714,9462,9444,9348,9557,10092,9788,9748,9796,9897,9655,10056,10110,10197,10719,10971,11281,11306,11919,12198,12224,12678,12870,13157,13120,12840,12918,12685,12751,12668,12611,12374,11861,11552,11244,11027,11105,11424,12166,12221,11935,11996,12253,12544,12653,12805,12748,12644,12762,12733,12664,12199,12275,12382,12255,12136,12098,11786,11597,10996,10913,10899,11260,11407,11678,12305,12833,12887,12696,12834,13051,12597,12566,12542,12822,12337,11977,11755,11627,11514,11394,11292,11213,11138,11060,10983]
["Males","37",8003,8134,8450,8727,8584,8641,8551,8518,8668,9428,9550,9291,9501,10058,9787,9738,9805,9872,9628,10063,10146,10296,10752,10948,11282,11365,11974,12196,12209,12683,12942,13144,13095,12861,12986,12786,12803,12695,12581,12310,11841,11518,11097,11008,11091,11459,12142,12272,11963,12024,12278,12566,12670,12824,12762,12658,12777,12748,12680,12215,12290,12398,12271,12151,12114,11802,11613,11012,10928,10914,11276,11423,11695,12323,12850,12906,12715,12853,13071,12616,12584,12561,12840,12356,11995,11774,11645,11532,11412,11310,11231,11157,11077]
["Males","38",7963,8044,8108,8390,8629,8451,8586,8498,8471,8630,9528,9457,9238,9431,10015,9757,9722,9739,9836,9591,10057,10218,10301,10739,10935,11327,11404,11910,12168,12196,12664,13015,13182,13194,12911,13056,12831,12781,12736,12576,12297,11760,11431,11042,11041,11085,11469,12178,12290,11980,12037,12288,12573,12679,12828,12767,12663,12782,12754,12685,12222,12295,12405,12278,12157,12121,11809,11621,11019,10934,10921,11284,11431,11702,12331,12858,12915,12724,12862,13080,12627,12594,12571,12849,12366,12006,11783,11654,11542,11422,11320,11241,11167]
["Males","39",7984,8009,8022,8052,8300,8508,8403,8518,8457,8438,8725,9466,9434,9211,9408,10003,9770,9701,9724,9844,9602,10136,10256,10360,10775,10977,11395,11406,11869,12205,12227,12680,13029,13195,13209,12953,13095,12905,12782,12728,12569,12208,11710,11422,11070,11030,11080,11493,12197,12310,11996,12050,12298,12584,12687,12836,12776,12672,12792,12763,12693,12231,12304,12414,12287,12167,12131,11819,11631,11029,10944,10931,11294,11442,11714,12341,12870,12927,12736,12874,13092,12640,12606,12583,12861,12380,12020,11796,11667,11555,11436,11333,11253]
["Males","40",8152,7886,7816,7802,7805,8029,8323,8216,8342,8274,8126,8649,9412,9390,9188,9374,9988,9739,9683,9703,9858,9636,10139,10249,10342,10803,10917,11341,11380,11827,12278,12172,12681,13053,13215,13159,12981,13153,12875,12717,12693,12535,12179,11666,11414,11068,11058,11112,11512,12217,12328,12009,12061,12309,12592,12694,12845,12785,12681,12800,12772,12703,12241,12313,12425,12296,12178,12141,11830,11642,11041,10954,10942,11306,11453,11725,12352,12883,12939,12749,12887,13105,12654,12619,12596,12875,12395,12033,11810,11681,11569,11450,11346]
["Males","41",8080,8168,7856,7775,7738,7700,7987,8272,8168,8276,8059,8065,8602,9365,9357,9168,9352,9962,9729,9674,9712,9849,9660,10145,10269,10404,10823,10937,11353,11323,11892,12271,12183,12769,13087,13233,13187,13032,13091,12897,12716,12708,12440,12177,11646,11388,11063,11072,11122,11522,12226,12333,12012,12064,12310,12591,12694,12844,12786,12682,12801,12773,12705,12243,12314,12428,12298,12181,12144,11834,11646,11044,10958,10946,11310,11457,11729,12356,12886,12944,12754,12892,13110,12660,12625,12602,12881,12402,12040,11817,11688,11576,11457]
["Males","42",8052,8084,8126,7810,7707,7637,7653,7931,8225,8098,8057,7974,8014,8553,9318,9324,9151,9303,9924,9724,9673,9765,9843,9662,10161,10323,10429,10862,10903,11336,11292,11913,12266,12253,12837,13132,13302,13224,13042,13093,12863,12674,12584,12394,12181,11645,11382,11103,11084,11132,11530,12230,12334,12015,12063,12309,12590,12693,12843,12786,12682,12801,12774,12707,12245,12315,12429,12300,12183,12146,11837,11648,11048,10962,10951,11314,11461,11733,12359,12890,12949,12758,12897,13115,12665,12630,12608,12887,12408,12048,11824,11695,11583]
["Males","43",7955,8062,8047,8077,7733,7592,7578,7604,7884,8160,7881,8000,7914,7978,8518,9295,9289,9131,9274,9919,9746,9651,9751,9793,9659,10180,10339,10476,10862,10909,11409,11317,11888,12296,12289,12849,13181,13275,13204,13045,13079,12816,12564,12510,12408,12151,11627,11380,11110,11091,11136,11530,12226,12333,12012,12059,12306,12586,12689,12839,12783,12680,12798,12771,12705,12244,12313,12428,12298,12182,12144,11837,11648,11048,10964,10953,11315,11462,11733,12361,12891,12950,12761,12900,13118,12666,12633,12610,12890,12411,12052,11829,11700]
["Males","44",8326,7958,8020,7998,7996,7628,7539,7518,7552,7812,7938,7823,7949,7851,7947,8487,9269,9253,9122,9246,9923,9734,9646,9751,9780,9680,10200,10363,10497,10877,11029,11388,11311,11853,12329,12334,12891,13222,13269,13192,13042,13055,12724,12530,12518,12406,12147,11635,11382,11111,11090,11133,11524,12220,12326,12004,12052,12299,12578,12682,12832,12776,12673,12792,12764,12698,12239,12307,12422,12293,12177,12140,11833,11645,11045,10962,10951,11312,11460,11731,12358,12889,12949,12761,12899,13117,12665,12632,12609,12890,12412,12054,11831]
["Males","45",8019,8236,7809,7871,7838,7831,7526,7432,7414,7464,7770,7891,7790,7919,7810,7931,8457,9238,9240,9130,9255,9945,9748,9653,9743,9793,9715,10216,10398,10511,10945,11017,11391,11341,11897,12358,12443,12963,13238,13292,13181,13003,13040,12707,12552,12500,12388,12166,11641,11387,11115,11091,11132,11522,12215,12321,12001,12048,12295,12575,12679,12829,12774,12671,12789,12762,12697,12239,12307,12422,12294,12178,12141,11834,11647,11047,10964,10954,11314,11462,11735,12360,12892,12952,12764,12902,13120,12669,12635,12614,12895,12417,12060]
["Males","46",7946,7977,8158,7755,7803,7743,7763,7454,7385,7368,7464,7727,7853,7759,7897,7776,7908,8422,9217,9238,9153,9274,9930,9710,9667,9755,9803,9741,10207,10423,10362,10906,10992,11392,11393,11863,12381,12487,12998,13224,13305,13164,12992,13059,12705,12531,12481,12386,12169,11644,11388,11115,11087,11129,11517,12209,12316,11996,12042,12289,12570,12675,12824,12769,12667,12785,12759,12693,12237,12304,12420,12292,12177,12140,11834,11646,11048,10966,10957,11315,11464,11736,12360,12893,12954,12766,12904,13122,12672,12637,12617,12897,12420]
["Males","47",8022,7902,7899,8090,7676,7702,7685,7696,7389,7349,7375,7406,7683,7802,7706,7853,7726,7870,8381,9187,9218,9132,9267,9920,9686,9672,9757,9823,9748,10192,10500,10322,10870,11015,11400,11441,11880,12414,12497,13019,13209,13268,13111,12970,13071,12680,12547,12486,12390,12171,11646,11389,11115,11085,11125,11514,12205,12312,11994,12039,12286,12567,12672,12821,12767,12665,12782,12758,12692,12237,12304,12420,12292,12178,12141,11836,11648,11052,10969,10961,11318,11468,11740,12363,12896,12959,12770,12909,13127,12677,12642,12623,12902]
["Males","48",8166,7961,7809,7822,7995,7568,7641,7606,7631,7333,7338,7324,7376,7662,7772,7691,7822,7685,7846,8368,9172,9251,9138,9263,9906,9688,9690,9747,9798,9766,10290,10484,10323,10848,11016,11415,11531,11883,12412,12505,13042,13180,13264,13069,12954,13063,12680,12547,12489,12393,12172,11645,11387,11114,11081,11122,11510,12201,12308,11990,12036,12283,12564,12670,12818,12764,12663,12780,12757,12691,12238,12304,12420,12293,12179,12142,11838,11650,11056,10973,10966,11322,11472,11745,12367,12899,12963,12775,12913,13133,12683,12647,12629]
["Males","49",8429,8116,7878,7736,7739,7881,7498,7550,7537,7577,7324,7311,7303,7354,7641,7751,7664,7795,7660,7830,8360,9164,9270,9137,9279,9912,9692,9688,9745,9764,9723,10239,10453,10313,10842,11046,11480,11540,11883,12401,12489,13028,13135,13214,13075,12926,13040,12689,12541,12483,12386,12162,11634,11377,11103,11071,11113,11500,12190,12297,11981,12027,12274,12555,12660,12808,12755,12654,12770,12749,12683,12231,12297,12414,12287,12174,12138,11835,11647,11054,10970,10964,11319,11469,11742,12364,12897,12960,12773,12912,13132,12682,12646]
["Males","50",8587,8294,7940,7717,7562,7562,7757,7380,7455,7443,7392,7248,7246,7231,7273,7586,7683,7592,7725,7580,7771,8324,9107,9242,9104,9275,9869,9666,9677,9725,9753,9711,10199,10402,10328,10840,11060,11485,11552,11849,12386,12450,12984,13093,13206,13059,12902,13037,12676,12528,12469,12371,12146,11619,11360,11089,11057,11099,11486,12174,12283,11967,12012,12260,12541,12648,12794,12741,12641,12758,12738,12672,12221,12288,12405,12277,12166,12131,11829,11640,11048,10963,10958,11312,11463,11735,12358,12890,12954,12768,12906,13128,12679]
["Males","51",8554,8464,8142,7794,7605,7445,7476,7652,7307,7379,7268,7335,7191,7209,7176,7209,7544,7638,7546,7671,7541,7742,8302,9075,9217,9102,9254,9843,9632,9672,9689,9726,9683,10139,10379,10343,10810,11066,11502,11552,11839,12348,12413,12954,13056,13175,12996,12866,13018,12658,12509,12449,12350,12126,11597,11340,11070,11038,11080,11468,12154,12264,11950,11994,12242,12523,12631,12776,12724,12626,12742,12723,12658,12207,12273,12390,12264,12153,12120,11818,11629,11038,10952,10948,11302,11454,11726,12348,12881,12946,12761,12898,13121]
["Males","52",7785,8420,8302,8016,7661,7470,7345,7348,7570,7221,7199,7228,7290,7152,7180,7138,7174,7522,7615,7515,7639,7541,7699,8270,9038,9214,9066,9245,9818,9617,9675,9676,9706,9663,10096,10371,10346,10769,11045,11478,11569,11802,12307,12374,12901,13018,13138,12983,12843,12992,12634,12484,12422,12325,12100,11572,11317,11047,11016,11058,11446,12130,12242,11929,11972,12220,12503,12610,12755,12704,12608,12723,12705,12640,12191,12256,12373,12249,12138,12106,11804,11616,11024,10939,10935,11289,11442,11713,12335,12869,12935,12750,12887]
["Males","53",6954,7631,8242,8163,7861,7519,7358,7232,7266,7480,7034,7130,7188,7229,7106,7134,7082,7130,7485,7582,7494,7632,7520,7657,8224,9026,9184,9043,9237,9778,9497,9651,9659,9683,9628,10049,10334,10324,10748,11016,11451,11520,11735,12255,12339,12854,12997,13094,12953,12812,12960,12602,12450,12390,12294,12069,11542,11288,11019,10990,11032,11419,12103,12214,11902,11946,12193,12476,12583,12729,12679,12583,12698,12681,12617,12169,12234,12351,12228,12117,12085,11785,11597,11007,10922,10917,11272,11426,11697,12317,12852,12917,12733]
["Males","54",7042,6815,7468,8089,8006,7710,7385,7238,7143,7140,7266,6932,7052,7121,7140,7036,7060,7009,7044,7418,7523,7492,7606,7487,7602,8205,9007,9143,8998,9203,9833,9491,9622,9625,9650,9622,10030,10311,10278,10691,10969,11414,11513,11687,12209,12303,12826,12955,13060,12918,12778,12925,12567,12416,12356,12261,12038,11513,11259,10991,10963,11005,11392,12075,12186,11875,11919,12166,12449,12556,12703,12655,12559,12674,12658,12595,12146,12212,12329,12206,12096,12065,11767,11579,10991,10904,10900,11254,11410,11681,12300,12835,12900]
["Males","55",7196,6881,6626,7266,7898,7850,7559,7240,7133,7039,7143,7191,6866,6993,7050,7065,6973,7004,6946,6974,7355,7499,7464,7565,7454,7590,8192,8957,9114,8959,9107,9780,9461,9603,9582,9616,9561,9979,10258,10249,10650,10925,11346,11475,11663,12155,12260,12786,12920,13023,12883,12742,12888,12533,12381,12322,12228,12006,11482,11230,10963,10936,10978,11366,12047,12158,11848,11893,12139,12422,12530,12677,12631,12536,12650,12635,12572,12125,12190,12309,12187,12077,12046,11750,11561,10975,10888,10885,11238,11395,11666,12283,12818]
["Males","56",7446,7057,6725,6493,7124,7749,7716,7420,7109,7022,7040,7078,7136,6817,6939,7009,7005,6916,6952,6892,6923,7327,7464,7414,7515,7416,7552,8135,8923,9057,8857,9060,9734,9442,9570,9555,9607,9541,9910,10174,10198,10593,10863,11299,11440,11610,12118,12222,12749,12881,12984,12845,12704,12850,12496,12346,12288,12194,11973,11452,11201,10934,10908,10952,11338,12017,12130,11821,11865,12111,12395,12503,12650,12605,12511,12625,12611,12549,12104,12169,12288,12167,12058,12026,11732,11544,10959,10873,10869,11223,11380,11651,12267]
["Males","57",7436,7286,6882,6587,6350,6977,7602,7537,7293,7011,7034,6974,7019,7071,6747,6862,6943,6936,6859,6884,6832,6885,7278,7410,7360,7494,7372,7488,8083,8890,8971,8825,9031,9685,9398,9546,9520,9565,9501,9836,10123,10162,10518,10793,11270,11368,11550,12073,12179,12702,12834,12936,12798,12658,12803,12452,12302,12246,12154,11934,11416,11165,10900,10875,10919,11304,11982,12095,11789,11833,12079,12361,12470,12619,12574,12480,12594,12581,12520,12077,12141,12260,12140,12032,12002,11709,11522,10938,10853,10849,11203,11360,11631]
["Males","58",7400,7271,7107,6714,6433,6187,6835,7447,7391,7147,6979,6944,6880,6949,6973,6671,6767,6835,6852,6777,6817,6796,6837,7221,7349,7320,7446,7343,7434,8028,8921,8945,8782,8980,9633,9371,9517,9496,9508,9451,9776,10084,10120,10475,10729,11189,11298,11490,12014,12118,12639,12771,12872,12736,12596,12742,12393,12245,12190,12099,11881,11366,11117,10853,10828,10873,11257,11934,12047,11743,11788,12033,12315,12424,12573,12529,12436,12550,12538,12478,12036,12101,12220,12100,11994,11965,11674,11487,10906,10820,10817,11170,11328]
["Males","59",7251,7203,7063,6922,6557,6290,6052,6673,7298,7269,7138,6889,6876,6811,6886,6880,6589,6674,6763,6762,6722,6760,6762,6780,7145,7315,7257,7396,7267,7359,7995,8849,8891,8737,8922,9568,9332,9453,9462,9438,9361,9701,9985,10079,10391,10658,11126,11245,11427,11947,12051,12568,12703,12804,12669,12529,12676,12329,12183,12129,12039,11823,11312,11064,10803,10780,10825,11208,11882,11994,11693,11739,11983,12265,12374,12523,12480,12388,12502,12491,12433,11992,12057,12176,12058,11952,11925,11636,11449,10871,10785,10783,11135]
["Males","60",7597,7573,7507,7361,7283,6825,6622,6326,6928,7166,7190,7030,6770,6792,6738,6809,6782,6512,6592,6702,6702,6676,6695,6694,6722,7074,7262,7202,7337,7221,7267,7907,8772,8832,8716,8838,9466,9260,9389,9408,9372,9292,9619,9929,9970,10302,10562,11000,11167,11346,11864,11968,12482,12619,12719,12586,12447,12595,12251,12107,12054,11966,11751,11245,10997,10740,10717,10763,11145,11815,11928,11629,11677,11920,12200,12311,12461,12419,12327,12442,12431,12375,11936,12000,12119,12003,11898,11871,11584,11399,10824,10739,10738]
["Males","61",7417,7512,7387,7318,7239,7023,6713,6411,6164,6363,7058,7065,6909,6658,6707,6643,6719,6686,6421,6511,6635,6613,6585,6584,6613,6688,7007,7197,7137,7235,7143,7200,7849,8710,8801,8647,8795,9364,9228,9337,9349,9306,9234,9548,9832,9886,10232,10502,10917,11080,11260,11774,11878,12389,12526,12627,12496,12359,12507,12167,12025,11974,11888,11674,11173,10927,10673,10651,10697,11078,11744,11858,11562,11610,11852,12132,12244,12394,12352,12261,12376,12366,12311,11875,11940,12059,11944,11840,11814,11529,11346,10774,10690]
["Males","62",7211,7295,7295,7149,7209,6970,6881,6483,6230,5613,6261,6923,6937,6817,6574,6611,6577,6639,6607,6320,6421,6533,6539,6505,6472,6523,6641,6906,7108,7078,7119,7078,7140,7786,8622,8745,8566,8719,9268,9180,9252,9275,9251,9165,9437,9736,9822,10122,10420,10829,10991,11172,11683,11786,12295,12433,12534,12405,12271,12419,12081,11943,11893,11809,11598,11100,10857,10605,10584,10630,11011,11673,11788,11495,11543,11784,12065,12176,12326,12285,12196,12311,12302,12248,11816,11881,12000,11887,11784,11758,11476,11294,10725]
["Males","63",6861,7062,7055,7040,7011,6920,6804,6644,6264,5673,5494,6103,6736,6797,6661,6434,6481,6465,6543,6496,6207,6324,6426,6418,6416,6383,6443,6587,6822,7021,7027,7047,7001,7061,7728,8505,8668,8517,8639,9146,9109,9177,9192,9189,9095,9356,9657,9722,10034,10329,10735,10898,11078,11585,11689,12195,12333,12434,12308,12176,12324,11991,11855,11806,11724,11516,11023,10782,10532,10512,10560,10939,11597,11713,11423,11471,11712,11992,12104,12254,12214,12127,12241,12233,12180,11753,11818,11937,11826,11724,11699,11419,11239]
["Males","64",6559,6730,6839,6796,6891,6702,6778,6528,6432,5670,5520,5349,5951,6587,6656,6491,6277,6348,6327,6458,6380,6087,6207,6312,6326,6355,6257,6325,6487,6709,6917,6946,6966,6924,6972,7644,8393,8579,8456,8565,9033,9031,9054,9063,9092,9003,9283,9565,9632,9939,10233,10636,10799,10978,11481,11587,12089,12228,12330,12207,12077,12224,11896,11762,11716,11635,11431,10941,10704,10457,10437,10486,10862,11519,11634,11347,11397,11636,11916,12028,12178,12140,12054,12169,12162,12110,11686,11751,11870,11761,11662,11637,11358]
["Males","65",5735,5916,6010,6104,6103,6141,6028,6039,5877,5859,5648,5380,5215,5799,6440,6471,6350,6117,6224,6193,6352,6263,5968,6074,6181,6233,6259,6170,6217,6404,6638,6806,6833,6883,6819,6880,7524,8271,8508,8382,8463,8894,8917,8915,8950,8961,8901,9164,9459,9523,9828,10120,10520,10683,10861,11360,11468,11966,12105,12208,12088,11961,12107,11785,11654,11609,11530,11328,10843,10610,10366,10348,10398,10772,11424,11539,11256,11307,11546,11825,11936,12087,12050,11966,12081,12074,12025,11604,11668,11789,11681,11584,11559]
["Males","66",5410,5507,5693,5775,5892,5862,5913,5796,5798,5693,5830,5466,5248,5070,5645,6254,6306,6196,5982,6094,6072,6227,6128,5821,5926,6046,6098,6125,6036,6127,6272,6494,6685,6722,6783,6725,6769,7401,8150,8418,8292,8360,8805,8796,8825,8853,8848,8794,9057,9347,9411,9713,10002,10400,10563,10740,11236,11344,11839,11979,12083,11966,11842,11988,11670,11542,11498,11422,11222,10743,10514,10273,10257,10307,10679,11326,11441,11162,11214,11453,11730,11842,11994,11959,11876,11992,11986,11938,11521,11585,11708,11601,11505]
["Males","67",5180,5216,5317,5451,5550,5643,5620,5680,5560,5578,5623,5624,5266,5068,4931,5436,6078,6108,6002,5790,5952,5921,6040,5956,5687,5816,5904,5966,6009,5914,6029,6129,6367,6563,6613,6686,6609,6643,7292,8020,8321,8177,8204,8689,8669,8695,8724,8749,8688,8943,9232,9296,9594,9882,10277,10440,10617,11108,11218,11709,11849,11954,11840,11720,11866,11553,11427,11385,11311,11115,10642,10416,10178,10165,10215,10585,11228,11343,11068,11121,11359,11635,11748,11900,11867,11786,11903,11898,11851,11437,11502,11626,11521]
["Males","68",4906,4940,4987,5072,5215,5314,5367,5364,5473,5339,5510,5419,5436,5067,4918,4801,5283,5887,5914,5819,5625,5758,5761,5872,5805,5550,5654,5788,5802,5875,5797,5912,5975,6235,6441,6504,6576,6489,6517,7192,7899,8187,8067,8076,8546,8534,8579,8586,8627,8564,8815,9103,9167,9462,9748,10140,10302,10479,10967,11077,11563,11703,11809,11698,11582,11728,11420,11297,11257,11186,10994,10527,10305,10071,10059,10109,10478,11115,11231,10961,11013,11250,11527,11640,11792,11762,11683,11799,11797,11751,11341,11406,11532]
["Males","69",4501,4654,4701,4725,4813,4988,5037,5107,5119,5272,5286,5270,5227,5232,4842,4744,4627,5090,5698,5725,5623,5459,5570,5568,5692,5618,5376,5494,5603,5644,5770,5664,5767,5859,6087,6310,6369,6457,6373,6396,7046,7792,8036,7917,7925,8397,8384,8445,8449,8486,8426,8674,8960,9024,9316,9600,9988,10150,10325,10809,10920,11400,11540,11646,11540,11428,11574,11272,11152,11114,11045,10858,10398,10181,9951,9941,9992,10358,10989,11105,10840,10893,11128,11405,11518,11670,11642,11565,11682,11681,11636,11234,11298]
["Males","70",4447,4251,4417,4456,4456,4537,4697,4761,4837,4879,5130,5072,5067,5035,5032,4665,4610,4464,4918,5493,5552,5406,5227,5364,5387,5499,5455,5187,5318,5441,5513,5605,5510,5619,5730,5964,6165,6225,6338,6216,6279,6922,7632,7856,7747,7765,8243,8212,8297,8298,8336,8279,8524,8806,8870,9159,9440,9824,9986,10160,10638,10749,11224,11366,11473,11370,11262,11408,11112,10995,10960,10893,10711,10260,10047,9821,9813,9865,10228,10853,10969,10709,10763,10996,11272,11386,11538,11512,11438,11555,11556,11513,11117]
["Males","71",4237,4189,4009,4160,4185,4191,4247,4435,4463,4564,4728,4876,4843,4810,4805,4835,4467,4414,4261,4717,5307,5318,5183,5025,5161,5181,5258,5247,5018,5152,5302,5374,5432,5368,5470,5603,5800,6006,6078,6196,6033,6135,6766,7467,7681,7599,7618,8085,8055,8135,8137,8176,8121,8363,8643,8707,8992,9271,9650,9813,9986,10458,10569,11039,11181,11290,11191,11086,11233,10943,10829,10797,10733,10556,10114,9905,9684,9678,9730,10090,10708,10825,10570,10626,10857,11132,11247,11398,11374,11303,11420,11422,11383]
["Males","72",3917,3977,3945,3739,3881,3903,3919,3974,4158,4211,4454,4468,4607,4577,4580,4567,4599,4219,4239,4045,4481,5080,5092,4934,4778,4975,4957,5038,5055,4827,4989,5114,5180,5236,5189,5297,5451,5625,5856,5914,6050,5884,6008,6602,7284,7489,7437,7459,7914,7883,7962,7967,8007,7955,8193,8471,8535,8816,9092,9465,9628,9801,10266,10378,10842,10984,11094,10999,10898,11045,10762,10652,10623,10563,10391,9957,9754,9537,9534,9587,9943,10554,10672,10422,10479,10709,10981,11096,11248,11226,11158,11275,11280]
["Males","73",3626,3637,3716,3676,3507,3596,3620,3645,3695,3865,4078,4168,4195,4356,4317,4308,4309,4341,4005,4020,3851,4289,4834,4828,4691,4546,4741,4760,4798,4854,4649,4773,4919,4977,5051,5038,5136,5297,5443,5680,5749,5879,5736,5863,6448,7096,7307,7257,7282,7723,7694,7775,7781,7822,7774,8008,8282,8348,8623,8895,9262,9425,9597,10056,10167,10625,10767,10878,10787,10691,10838,10564,10457,10431,10375,10208,9784,9587,9376,9375,9429,9781,10384,10502,10258,10316,10544,10814,10930,11082,11063,10998,11115]
["Males","74",3229,3377,3405,3452,3403,3220,3278,3352,3363,3414,3754,3789,3912,3954,4072,4052,4057,4069,4127,3770,3821,3657,4070,4598,4577,4459,4331,4486,4553,4570,4636,4446,4577,4697,4768,4850,4842,4958,5132,5272,5526,5563,5711,5572,5667,6281,6875,7082,7061,7084,7515,7490,7572,7580,7622,7576,7807,8077,8144,8415,8682,9044,9204,9376,9826,9938,10389,10531,10643,10557,10465,10611,10347,10245,10222,10169,10007,9594,9403,9199,9200,9255,9603,10197,10315,10077,10136,10363,10631,10747,10898,10882,10820]
["Males","75",3108,2947,3113,3114,3120,3156,2949,2983,3066,3099,3322,3481,3543,3671,3694,3786,3825,3812,3844,3866,3561,3584,3435,3819,4331,4327,4188,4095,4225,4302,4350,4424,4234,4381,4446,4583,4632,4664,4778,4950,5054,5335,5368,5561,5379,5483,6082,6641,6871,6848,6873,7294,7274,7356,7366,7410,7367,7594,7861,7927,8194,8457,8811,8970,9142,9583,9695,10138,10280,10392,10311,10224,10370,10115,10018,9998,9949,9795,9392,9208,9010,9013,9069,9412,9998,10116,9885,9945,10170,10435,10552,10703,10690]
["Males","76",2817,2824,2681,2819,2835,2849,2875,2667,2694,2794,3002,3050,3187,3265,3383,3408,3509,3533,3563,3573,3614,3337,3371,3204,3586,4077,4065,3961,3835,3961,4124,4111,4219,4033,4168,4249,4379,4430,4451,4588,4767,4841,5135,5201,5344,5199,5302,5881,6421,6640,6621,6649,7060,7043,7126,7137,7183,7143,7367,7629,7696,7958,8216,8562,8720,8890,9323,9436,9869,10012,10124,10048,9967,10112,9866,9774,9758,9713,9566,9174,8998,8807,8812,8869,9207,9783,9902,9678,9739,9963,10225,10342,10494]
["Males","77",2397,2534,2560,2426,2528,2562,2565,2584,2379,2427,2701,2754,2804,2935,3001,3087,3138,3245,3309,3337,3339,3360,3078,3158,3001,3337,3798,3779,3690,3569,3663,3893,3881,3977,3823,3958,4006,4170,4232,4277,4402,4566,4644,4936,4973,5142,4996,5072,5665,6182,6396,6382,6412,6811,6798,6881,6895,6942,6906,7125,7380,7447,7705,7959,8296,8453,8621,9044,9159,9583,9725,9837,9767,9692,9836,9599,9513,9500,9460,9320,8941,8771,8588,8596,8654,8986,9551,9670,9454,9517,9738,9996,10116]
["Males","78",2205,2132,2288,2286,2159,2264,2291,2284,2317,2134,2348,2432,2518,2543,2690,2742,2840,2889,3001,3017,3084,3088,3089,2816,2920,2794,3106,3549,3507,3400,3429,3432,3651,3644,3702,3585,3720,3788,3948,4025,4074,4177,4335,4446,4731,4775,4949,4766,4865,5429,5929,6139,6129,6161,6548,6537,6620,6637,6685,6654,6867,7116,7184,7436,7684,8013,8169,8335,8748,8864,9277,9419,9531,9466,9398,9541,9314,9234,9224,9189,9056,8690,8527,8352,8363,8422,8749,9302,9421,9214,9278,9497,9751]
["Males","79",1911,1941,1888,2018,2022,1933,1988,2045,2028,2063,2038,2124,2140,2291,2306,2415,2498,2581,2619,2693,2776,2830,2795,2799,2592,2657,2554,2892,3288,3266,3138,3185,3198,3389,3396,3473,3352,3491,3543,3741,3807,3871,3967,4145,4203,4495,4535,4705,4549,4640,5181,5662,5866,5860,5894,6268,6260,6342,6362,6411,6385,6592,6834,6903,7148,7391,7711,7865,8029,8431,8546,8948,9089,9201,9142,9081,9222,9007,8933,8927,8897,8771,8420,8265,8099,8112,8172,8493,9034,9152,8954,9020,9236]
["Males","80",1760,1676,1727,1716,1763,1796,1710,1770,1763,1766,1966,1777,1893,1902,2046,2105,2194,2225,2335,2326,2459,2496,2582,2528,2553,2365,2418,2347,2678,3013,2957,2892,2933,2996,3128,3144,3214,3121,3232,3316,3528,3592,3649,3748,3886,3976,4245,4276,4466,4313,4401,4916,5378,5576,5573,5609,5969,5965,6046,6068,6118,6097,6299,6533,6602,6840,7076,7387,7538,7699,8089,8204,8594,8733,8845,8792,8738,8878,8675,8607,8605,8580,8463,8129,7981,7824,7840,7901,8216,8742,8859,8671,8738]
["Males","81",1562,1561,1493,1525,1500,1537,1562,1515,1525,1509,1664,1758,1567,1654,1697,1799,1881,1964,1972,2082,2072,2210,2246,2310,2286,2296,2132,2196,2115,2434,2853,2672,2632,2691,2788,2873,2873,2973,2907,3007,3109,3316,3339,3442,3502,3650,3741,3969,4034,4209,4067,4153,4642,5082,5272,5273,5311,5656,5656,5736,5761,5812,5795,5991,6217,6287,6517,6745,7045,7193,7351,7727,7842,8219,8356,8468,8422,8375,8513,8323,8262,8265,8245,8136,7818,7680,7533,7552,7614,7921,8432,8547,8369]
["Males","82",1501,1363,1379,1295,1315,1296,1346,1367,1277,1270,1393,1430,1541,1375,1473,1486,1610,1641,1740,1728,1842,1839,1975,1969,2060,2040,2055,1887,1955,1910,2160,2593,2428,2393,2428,2539,2631,2602,2717,2709,2776,2883,3089,3119,3208,3268,3398,3463,3719,3774,3940,3811,3894,4356,4772,4954,4959,4999,5327,5331,5411,5438,5490,5477,5666,5883,5953,6175,6395,6684,6829,6983,7345,7458,7822,7957,8068,8029,7989,8125,7948,7894,7902,7887,7787,7486,7359,7222,7244,7307,7604,8099,8213]
["Males","83",1068,1282,1165,1182,1100,1112,1098,1142,1142,1069,1186,1218,1220,1331,1196,1256,1328,1394,1482,1482,1503,1623,1609,1715,1728,1829,1795,1845,1668,1724,1714,1931,2311,2187,2134,2199,2282,2343,2360,2503,2453,2570,2636,2826,2875,2979,3018,3126,3216,3449,3502,3659,3542,3622,4055,4447,4621,4628,4669,4980,4987,5066,5095,5148,5139,5321,5529,5599,5812,6024,6301,6440,6590,6937,7050,7399,7531,7642,7610,7577,7711,7547,7500,7513,7503,7412,7130,7014,6887,6912,6976,7264,7741]
["Males","84",888,862,1096,982,995,913,914,922,948,946,983,1024,1028,1015,1143,1036,1088,1114,1215,1358,1282,1308,1423,1418,1479,1498,1594,1548,1583,1463,1468,1522,1712,2052,1960,1890,1978,2054,2117,2136,2293,2243,2349,2418,2565,2622,2745,2744,2875,2953,3170,3222,3369,3265,3340,3744,4108,4273,4284,4326,4618,4629,4706,4737,4790,4785,4959,5157,5225,5430,5632,5896,6032,6177,6508,6619,6952,7081,7191,7166,7140,7271,7122,7082,7099,7095,7014,6751,6646,6530,6558,6622,6899]
["Males","85",650,709,700,922,798,840,766,748,744,793,886,882,915,925,910,924,957,962,1008,1043,1076,1115,1086,1238,1201,1269,1275,1358,1338,1335,1304,1266,1328,1518,1809,1749,1684,1762,1828,1879,1909,2031,1999,2119,2186,2350,2381,2475,2497,2611,2685,2884,2935,3072,2980,3051,3423,3760,3914,3929,3971,4243,4257,4332,4364,4417,4417,4581,4769,4837,5031,5222,5472,5604,5745,6058,6165,6481,6608,6717,6699,6680,6808,6674,6641,6663,6664,6593,6349,6255,6151,6180,6246]
["Males","86",547,497,571,540,750,658,689,621,588,583,712,722,725,742,752,767,789,761,788,844,866,942,962,915,1051,1050,1071,1063,1158,1115,1127,1131,1079,1132,1317,1577,1506,1479,1550,1616,1688,1679,1789,1811,1922,1921,2086,2117,2223,2238,2344,2413,2594,2642,2769,2689,2755,3095,3404,3547,3564,3606,3857,3873,3945,3978,4031,4035,4189,4366,4433,4615,4795,5030,5157,5291,5585,5689,5986,6110,6216,6205,6193,6318,6199,6174,6200,6206,6145,5922,5840,5747,5779]
["Males","87",359,405,369,431,383,612,533,542,477,467,545,571,589,587,597,621,643,617,612,654,707,715,798,803,763,878,864,900,880,974,948,957,953,920,972,1137,1354,1314,1274,1354,1426,1467,1456,1574,1587,1707,1665,1832,1877,1966,1982,2078,2142,2304,2349,2465,2396,2458,2764,3044,3176,3195,3237,3465,3483,3552,3585,3637,3645,3788,3953,4019,4189,4357,4577,4698,4825,5098,5198,5475,5596,5699,5695,5690,5810,5707,5689,5719,5730,5679,5479,5408,5327]
["Males","88",334,252,308,257,304,247,500,409,406,370,430,431,460,469,465,490,515,503,502,504,533,576,598,679,674,648,720,713,707,711,794,806,808,784,776,826,968,1114,1123,1086,1163,1227,1259,1240,1379,1383,1480,1411,1599,1633,1713,1731,1818,1876,2021,2060,2166,2107,2164,2438,2688,2808,2827,2868,3074,3095,3160,3193,3244,3255,3387,3539,3602,3760,3916,4119,4233,4353,4605,4701,4957,5073,5172,5175,5176,5291,5203,5193,5226,5242,5201,5023,4963]
["Males","89",272,254,180,208,157,203,140,394,309,325,348,342,341,358,370,379,401,395,403,407,411,420,461,470,575,553,538,576,563,547,598,645,649,658,646,645,675,807,904,944,930,985,1042,1056,1060,1195,1189,1265,1211,1367,1399,1470,1488,1565,1617,1745,1780,1874,1825,1877,2118,2339,2447,2467,2506,2689,2711,2773,2805,2854,2868,2988,3127,3187,3332,3476,3661,3768,3879,4110,4202,4436,4546,4642,4650,4657,4766,4692,4689,4724,4745,4713,4557]
["Males",90,685,656,641,528,468,367,284,297,666,743,966,988,1011,1001,1037,1049,999,1079,1048,966,1142,1195,1224,1227,1238,1346,1434,1535,1551,1588,1604,1695,1764,1867,1974,2041,2036,2109,2215,2503,2676,2890,3030,3267,3466,3566,3747,3857,4085,4187,4399,4598,4821,5018,5243,5472,5770,6045,6347,6554,6768,7145,7646,8154,8591,8984,9462,9877,10272,10623,10955,11244,11593,12011,12422,12899,13436,14058,14685,15317,16060,16775,17589,18381,19141,19795,20354,20926,21344,21697,22031,22339,22582]
["Females","0",15485,14646,14041,13534,12854,12567,12768,12769,13261,13581,13388,13126,12987,13057,13210,13393,13429,13380,12731,12680,12647,12482,12061,12013,11574,11372,11978,11549,11328,10755,10399,10450,10340,10631,10986,11101,11544,12283,12276,12242,12421,12327,12108,11815,11856,11750,11491,11298,11069,10951,10849,10730,10631,10557,10478,10397,10319,10248,10191,10151,10125,10114,10120,10146,10190,10252,10332,10420,10509,10591,10660,10713,10750,10757,10742,10704,10653,10582,10499,10407,10313,10215,10123,10034,9949,9874,9805,9751,9702,9666,9640,9623,9615]
["Females","1",15432,15144,14251,13793,13318,12675,12404,12609,12694,13165,13566,13344,13065,12944,13030,13126,13293,13325,13247,12734,12603,12676,12496,12057,12027,11690,11426,11987,11490,11330,10752,10377,10405,10299,10678,11034,11224,11701,12417,12387,12339,12518,12482,12184,11937,11952,11897,11630,11393,11164,11042,10936,10813,10714,10635,10557,10477,10399,10326,10269,10229,10203,10192,10198,10225,10269,10332,10412,10500,10590,10672,10741,10794,10831,10838,10824,10786,10735,10664,10581,10488,10394,10296,10204,10114,10030,9955,9886,9831,9782,9746,9720,9703]
["Females","2",15540,15134,14786,14034,13614,13169,12544,12284,12565,12626,13168,13470,13298,13008,12886,13006,13019,13165,13197,13104,12783,12564,12717,12499,12048,12122,11678,11451,11925,11462,11352,10794,10420,10464,10395,10770,11071,11324,11774,12493,12452,12386,12537,12556,12295,12017,12023,11987,11737,11499,11265,11138,11028,10904,10799,10721,10641,10561,10483,10410,10354,10313,10287,10278,10284,10310,10354,10418,10498,10585,10676,10758,10828,10881,10918,10925,10911,10873,10822,10751,10667,10574,10480,10382,10289,10200,10115,10040,9970,9916,9867,9830,9803]
["Females","3",15566,15253,14786,14577,13855,13473,13042,12427,12245,12502,12609,13073,13432,13289,12966,12862,12972,12909,13063,13108,13045,12821,12601,12727,12505,12137,12097,11702,11490,11892,11424,11413,10818,10455,10518,10495,10840,11122,11351,11802,12489,12462,12379,12586,12607,12368,12033,12079,12061,11810,11568,11329,11199,11089,10960,10855,10777,10696,10616,10537,10464,10407,10367,10341,10332,10338,10364,10409,10473,10553,10640,10731,10814,10883,10938,10975,10982,10968,10930,10879,10806,10723,10630,10535,10437,10344,10254,10169,10095,10024,9970,9921,9884]
["Females","4",15418,15282,14909,14585,14404,13718,13350,12927,12389,12180,12235,12535,13032,13410,13279,12931,12814,12922,12814,12984,13085,13055,12850,12596,12746,12613,12175,12060,11706,11516,11921,11502,11462,10834,10540,10602,10593,10861,11052,11355,11850,12484,12468,12427,12642,12659,12396,12124,12139,12121,11864,11618,11376,11246,11131,11003,10897,10819,10737,10656,10578,10505,10448,10407,10381,10372,10378,10404,10449,10513,10593,10681,10772,10855,10924,10980,11017,11025,11011,10973,10921,10848,10765,10672,10577,10478,10386,10295,10210,10136,10064,10010,9961]
["Females","5",15711,15297,15105,14815,14495,14335,13650,13277,12890,12382,12249,12170,12508,13003,13382,13275,12876,12756,12891,12739,12961,13127,13066,12841,12622,12803,12595,12185,12037,11704,11277,11897,11520,11456,10894,10621,10654,10668,10826,11020,11312,11839,12504,12508,12457,12678,12703,12426,12179,12194,12172,11912,11661,11419,11285,11170,11042,10935,10856,10775,10694,10615,10542,10485,10444,10417,10408,10415,10441,10486,10550,10630,10718,10810,10893,10961,11019,11056,11063,11050,11012,10960,10887,10803,10709,10615,10516,10423,10332,10248,10174,10102,10048]
["Females","6",16110,15593,15122,15016,14728,14427,14271,13579,13241,12887,12456,12126,12074,12416,12898,13283,13172,12724,12632,12800,12648,13025,13151,13058,12830,12681,12794,12568,12221,11998,11687,11313,11905,11502,11507,10962,10669,10696,10661,10824,10926,11284,11831,12538,12506,12474,12737,12764,12468,12219,12231,12207,11944,11693,11447,11312,11197,11068,10962,10883,10802,10721,10642,10569,10512,10470,10443,10435,10442,10468,10512,10577,10657,10744,10836,10920,10988,11046,11083,11090,11077,11039,10987,10913,10829,10736,10642,10541,10448,10358,10274,10200,10127]
["Females","7",15888,15993,15417,15033,14928,14656,14363,14200,13542,13235,12967,12398,12108,12063,12395,12873,13246,13138,12669,12602,12820,12738,13050,13163,13063,12890,12699,12797,12500,12214,12074,11707,11358,11937,11559,11566,11021,10753,10712,10662,10819,10943,11325,11882,12575,12556,12543,12765,12809,12513,12261,12270,12244,11980,11726,11480,11345,11230,11101,10995,10915,10834,10753,10673,10600,10543,10501,10474,10466,10473,10499,10543,10608,10688,10775,10868,10952,11020,11078,11115,11122,11108,11070,11018,10944,10860,10767,10673,10572,10479,10388,10304,10231]
["Females","8",15256,15774,15819,15331,14945,14858,14587,14287,14160,13538,13326,12873,12364,12092,12041,12376,12827,13192,13108,12617,12604,12865,12823,13071,13158,13122,12889,12721,12754,12474,12098,12084,11724,11440,11940,11622,11634,11056,10770,10710,10655,10830,10975,11377,11922,12603,12605,12596,12818,12862,12563,12308,12314,12288,12021,11767,11521,11385,11270,11141,11035,10955,10874,10793,10712,10639,10581,10540,10513,10505,10512,10537,10581,10646,10727,10814,10907,10991,11059,11117,11154,11161,11147,11110,11057,10983,10900,10807,10713,10611,10518,10427,10343]
["Females","9",14962,15138,15598,15730,15243,14875,14793,14518,14246,14159,13635,13241,12801,12336,12072,12023,12339,12768,13144,13081,12603,12645,12899,12862,13115,13221,13111,12878,12705,12756,12513,12119,12110,11759,11518,11974,11701,11673,11065,10765,10694,10664,10842,10988,11385,11980,12646,12663,12642,12864,12905,12603,12346,12351,12323,12056,11802,11555,11418,11303,11174,11069,10988,10907,10827,10747,10673,10615,10573,10546,10538,10545,10570,10614,10681,10762,10849,10941,11025,11094,11152,11189,11196,11182,11145,11091,11017,10935,10840,10746,10644,10552,10461]
["Females","10",14457,14919,15041,15562,15680,15207,14834,14743,14475,14226,14146,13493,13212,12768,12334,12084,12022,12326,12747,13138,13117,12687,12720,12932,12939,13169,13199,13140,12840,12702,12696,12483,12137,12131,11814,11597,12035,11776,11691,11066,10776,10727,10686,10883,11023,11429,12005,12704,12705,12684,12903,12942,12638,12381,12383,12355,12089,11833,11586,11450,11335,11206,11100,11018,10937,10859,10779,10704,10646,10604,10577,10569,10576,10601,10645,10712,10793,10881,10972,11056,11126,11183,11220,11228,11214,11177,11123,11049,10967,10871,10777,10676,10584]
["Females","11",13971,14417,14827,15004,15515,15643,15167,14785,14704,14455,14214,14051,13395,13208,12747,12352,12102,12035,12337,12749,13163,13131,12776,12804,12957,13016,13194,13200,13148,12831,12797,12697,12451,12136,12180,11882,11691,12078,11832,11701,11067,10785,10736,10740,10921,11057,11462,12043,12746,12747,12724,12943,12978,12674,12415,12417,12389,12123,11867,11620,11484,11369,11240,11134,11051,10970,10892,10813,10738,10678,10636,10609,10601,10609,10634,10678,10745,10827,10915,11005,11089,11159,11217,11254,11262,11248,11211,11157,11083,11001,10904,10810,10709]
["Females","12",13500,13933,14328,14791,14957,15479,15600,15115,14746,14682,14444,14131,13946,13269,13167,12697,12326,12081,12017,12319,12753,13157,13118,12812,12882,13010,13093,13179,13194,13177,12766,12786,12677,12432,12198,12221,11938,11783,12118,11858,11736,11082,10826,10789,10803,10955,11101,11502,12088,12792,12792,12766,12983,13017,12712,12452,12454,12426,12161,11904,11657,11521,11406,11278,11171,11087,11006,10929,10850,10775,10715,10673,10646,10638,10646,10671,10715,10782,10865,10953,11043,11127,11196,11255,11292,11300,11286,11249,11195,11121,11039,10941,10848]
["Females","13",13556,13458,13842,14293,14740,14923,15439,15548,15074,14726,14677,14421,14085,13868,13162,13151,12655,12316,12086,12028,12345,12735,13157,13112,12858,12951,13043,13149,13184,13185,13185,12771,12779,12671,12405,12256,12279,11968,11830,12117,11879,11741,11108,10887,10811,10847,11004,11186,11551,12137,12840,12839,12810,13028,13059,12755,12494,12496,12468,12203,11945,11698,11561,11446,11319,11211,11128,11047,10970,10890,10814,10755,10713,10687,10679,10687,10712,10756,10823,10906,10994,11084,11168,11238,11297,11334,11342,11328,11291,11237,11163,11081,10983]
["Females","14",13417,13513,13366,13806,14248,14708,14883,15387,15504,15054,14727,14620,14413,14036,13774,13046,13115,12600,12305,12086,12042,12371,12735,13136,13111,12969,13006,13081,13191,13199,13219,13179,12772,12765,12680,12415,12329,12334,12031,11878,12139,11901,11780,11127,10912,10864,10887,11037,11227,11594,12179,12882,12878,12849,13066,13097,12793,12530,12532,12504,12240,11981,11734,11596,11481,11355,11246,11163,11082,11005,10925,10848,10789,10747,10721,10713,10721,10746,10790,10858,10942,11030,11120,11204,11274,11333,11370,11378,11364,11327,11274,11200,11118]
["Females","15",12468,13075,13116,13132,13610,14091,14563,14753,15296,15344,14226,14649,14557,14387,13963,13660,12899,13055,12529,12273,12078,12084,12390,12719,13096,13140,13023,13074,13085,13247,13262,13211,13161,12764,12750,12683,12441,12343,12385,12063,11921,12159,11918,11822,11137,10921,10877,10941,11067,11258,11623,12206,12907,12903,12873,13090,13121,12817,12554,12556,12528,12263,12004,11757,11619,11504,11378,11269,11186,11105,11028,10948,10870,10811,10769,10744,10736,10744,10769,10813,10881,10965,11053,11143,11227,11298,11357,11394,11401,11388,11351,11298,11223]
["Females","16",11951,12131,12684,12878,12940,13450,13948,14430,14664,15134,14520,14253,14618,14530,14393,13927,13575,12785,13032,12496,12294,12073,12133,12399,12702,13085,13112,13082,13110,13052,13284,13255,13208,13159,12774,12764,12692,12445,12371,12392,12089,11937,12184,11943,11849,11163,10941,10927,10970,11095,11284,11647,12228,12930,12924,12894,13111,13141,12838,12575,12577,12548,12284,12025,11778,11639,11525,11398,11289,11207,11126,11049,10969,10891,10832,10790,10765,10757,10765,10790,10834,10902,10986,11074,11164,11248,11319,11378,11415,11422,11409,11372,11319]
["Females","17",11982,11618,11749,12460,12698,12796,13329,13834,14359,14517,14318,14519,14263,14553,14474,14366,13850,13456,12646,12983,12458,12277,12072,12126,12357,12658,13014,13044,13083,13130,13019,13288,13257,13197,13134,12778,12789,12686,12440,12397,12434,12091,11939,12213,11974,11870,11165,10985,10955,10998,11122,11309,11669,12250,12950,12944,12914,13132,13162,12859,12596,12598,12569,12306,12046,11799,11660,11546,11419,11311,11229,11148,11071,10991,10913,10853,10811,10786,10778,10786,10811,10856,10924,11008,11096,11186,11269,11340,11399,11436,11443,11430,11393]
["Females","18",12195,11629,11213,11499,12252,12522,12642,13179,13731,14176,13688,14318,14528,14271,14490,14420,14333,13761,13339,12512,12961,12498,12363,11958,11338,11686,11826,11977,11971,12245,12760,12879,13112,13257,13215,13182,12846,12826,12768,12486,12506,12454,12071,11974,12284,11916,11892,11197,11013,10984,11023,11144,11328,11687,12265,12964,12957,12927,13146,13175,12872,12610,12612,12583,12320,12061,11815,11676,11562,11434,11328,11246,11166,11089,11009,10930,10870,10828,10803,10795,10803,10828,10873,10942,11026,11114,11204,11285,11357,11416,11453,11460,11447]
["Females","19",12181,11851,11236,10976,11301,12095,12380,12517,13089,13568,13376,13588,14193,14412,14146,14298,14215,14133,13535,13100,12324,12531,11980,11591,11444,11081,11228,11266,11330,11456,11358,12395,12361,12768,12872,12782,12840,12549,12517,12438,12234,12103,11755,11308,11225,11551,11056,11199,10872,10701,10673,10708,10821,11002,11348,11913,12593,12561,12531,12754,12773,12472,12221,12232,12202,11942,11693,11455,11326,11216,11092,10990,10913,10835,10761,10683,10608,10550,10511,10488,10481,10489,10515,10558,10626,10708,10793,10880,10959,11028,11085,11120,11126]
["Females","20",12047,11465,11079,10762,10620,11010,11856,12177,12442,13032,13184,12891,13127,13699,13906,13650,13694,13536,13532,12937,12626,12078,12294,11730,11392,11355,10794,11062,11011,11116,11247,11180,12039,11983,12280,12420,12388,12458,12136,12063,12097,11736,11510,11569,11121,11092,11039,10830,10762,10448,10281,10247,10273,10383,10547,10878,11422,12068,12028,12000,12217,12234,11942,11705,11719,11691,11442,11205,10979,10856,10752,10633,10536,10463,10388,10318,10244,10174,10119,10082,10061,10055,10064,10089,10130,10196,10275,10356,10439,10514,10580,10634,10668]
["Females","21",12025,11328,10685,10588,10381,10310,10742,11630,12073,12351,12608,12553,12375,12615,13125,13337,13048,12925,12820,12905,12476,12586,12125,12240,11652,11335,11239,10839,10932,10935,11032,11257,11175,11918,11962,12304,12488,12510,12453,12206,12091,11998,12029,11564,11539,11061,10959,11083,10717,10651,10332,10160,10116,10142,10242,10402,10729,11264,11900,11857,11831,12045,12063,11774,11542,11556,11529,11285,11052,10829,10708,10606,10488,10394,10321,10247,10179,10107,10036,9983,9947,9927,9921,9931,9956,9995,10060,10139,10220,10300,10375,10440,10493]
["Females","22",11843,11300,10543,10196,10206,10065,10047,10522,11528,11983,11919,12285,12327,12236,12442,12917,13078,12732,12569,12517,12790,12508,12674,12186,12159,11763,11318,11170,10830,10899,10929,11054,11288,11231,11989,12089,12543,12715,12695,12568,12238,12152,12191,12131,11747,11584,11118,11058,11113,10749,10672,10344,10161,10117,10131,10231,10392,10718,11250,11886,11844,11818,12031,12049,11762,11530,11544,11518,11275,11041,10820,10698,10597,10479,10385,10312,10239,10170,10099,10028,9975,9941,9920,9913,9925,9949,9987,10052,10132,10213,10292,10367,10432]
["Females","23",11519,11122,10520,10053,9822,9901,9798,9830,10422,11435,11540,11682,12159,12263,12210,12413,12779,12873,12573,12391,12521,12715,12442,12574,12009,12105,11630,11211,10917,10702,10748,11028,11128,11409,11448,12213,12413,12747,12810,12798,12560,12351,12289,12295,12246,11794,11655,11240,11148,11203,10827,10738,10398,10214,10158,10173,10273,10434,10759,11294,11931,11888,11862,12076,12094,11807,11574,11589,11563,11320,11087,10865,10742,10641,10523,10428,10355,10282,10214,10142,10071,10018,9985,9963,9956,9968,9992,10031,10096,10176,10258,10337,10412]
["Females","24",11177,10802,10345,10030,9672,9517,9639,9576,9732,10331,10988,11362,11623,12133,12246,12273,12384,12643,12780,12529,12467,12643,12839,12502,12613,12156,12139,11592,11161,10922,10506,10874,11087,11372,11677,11773,12519,12589,12883,12880,12729,12635,12290,12323,12404,12242,11746,11639,11293,11202,11245,10858,10758,10419,10222,10168,10182,10282,10443,10769,11305,11939,11897,11871,12085,12103,11816,11583,11599,11573,11330,11098,10875,10753,10652,10534,10439,10365,10293,10225,10152,10083,10029,9996,9975,9968,9980,10004,10043,10108,10188,10269,10349]
["Females","25",10530,10870,10446,10120,9848,9521,9372,9505,9514,9724,10526,10763,11237,11518,12005,12161,12181,12210,12460,12633,12534,12352,12545,12734,12402,12573,12042,12055,11415,11015,10908,10641,10978,11230,11639,11953,12185,12735,12751,12866,12813,12659,12491,12282,12278,12380,12218,11752,11652,11306,11207,11238,10841,10742,10392,10196,10142,10156,10257,10417,10743,11278,11912,11868,11841,12056,12074,11788,11555,11572,11546,11304,11073,10849,10728,10628,10511,10414,10341,10270,10202,10128,10060,10006,9973,9951,9944,9956,9980,10019,10084,10164,10245]
["Females","26",10454,10235,10529,10241,9955,9708,9402,9263,9470,9536,9945,10429,10793,11291,11543,12046,12168,12201,12241,12483,12801,12718,12564,12636,12763,12544,12669,12169,12069,11485,10933,11012,10767,11038,11468,11986,12393,12498,12810,12767,12777,12763,12595,12544,12305,12293,12412,12265,11785,11684,11330,11221,11243,10847,10737,10389,10191,10137,10152,10253,10413,10738,11274,11907,11863,11836,12051,12070,11784,11551,11567,11542,11300,11070,10847,10725,10626,10509,10412,10339,10268,10201,10126,10058,10004,9971,9950,9942,9954,9978,10016,10082,10162]
["Females","27",10495,10157,9894,10326,10075,9814,9585,9299,9228,9490,9752,9822,10404,10805,11282,11537,11986,12101,12214,12258,12574,12953,12832,12659,12724,12882,12649,12729,12235,12118,11457,11091,11061,10896,11232,11799,12415,12700,12570,12739,12711,12771,12697,12601,12593,12325,12341,12476,12322,11842,11733,11370,11253,11275,10871,10759,10413,10213,10160,10175,10276,10435,10760,11298,11931,11887,11861,12075,12094,11809,11574,11591,11565,11324,11094,10871,10750,10651,10533,10437,10364,10293,10226,10150,10083,10029,9995,9974,9966,9978,10001,10041,10106]
["Females","28",10326,10195,9814,9690,10156,9935,9693,9475,9261,9247,9705,9637,9779,10397,10798,11283,11474,11897,12055,12254,12383,12719,13098,12894,12714,12831,12953,12671,12774,12339,12185,11556,11186,11126,11108,11483,12139,12695,12861,12653,12646,12679,12693,12756,12609,12607,12341,12427,12537,12383,11893,11774,11404,11287,11300,10896,10785,10439,10238,10185,10198,10301,10460,10787,11325,11958,11915,11889,12104,12123,11837,11602,11619,11593,11350,11121,10897,10776,10676,10559,10464,10391,10319,10252,10176,10108,10053,10020,9999,9991,10003,10026,10066]
["Females","29",9220,10026,9852,9606,9525,10015,9814,9585,9441,9280,9452,9621,9622,9774,10398,10832,11264,11417,11856,12065,12415,12550,12838,13209,12964,12885,12954,13001,12671,12763,12296,12281,11669,11237,11273,11287,11746,12363,12834,12932,12615,12583,12611,12666,12828,12641,12655,12384,12483,12593,12432,11934,11806,11436,11311,11324,10919,10808,10460,10261,10206,10219,10322,10482,10809,11347,11982,11941,11915,12129,12149,11864,11629,11645,11618,11375,11144,10920,10799,10699,10581,10486,10413,10341,10274,10199,10131,10076,10043,10022,10014,10025,10049]
["Females","30",8784,9071,9839,9743,9507,9444,9939,9744,9539,9455,9463,9405,9667,9694,9830,10482,10894,11291,11449,11907,12239,12520,12671,12937,13271,13073,12985,13016,12972,12715,12806,12389,12363,11772,11377,11418,11511,11891,12446,12903,12955,12589,12491,12599,12672,12825,12707,12721,12432,12531,12635,12466,11959,11831,11454,11328,11341,10936,10825,10477,10277,10222,10234,10337,10497,10826,11364,12000,11960,11934,12148,12169,11883,11648,11664,11637,11394,11163,10938,10818,10717,10599,10502,10429,10357,10291,10215,10147,10093,10059,10037,10031,10043]
["Females","31",8835,8633,8885,9731,9650,9431,9374,9865,9705,9556,9641,9464,9450,9760,9777,9922,10548,10955,11362,11527,12065,12329,12614,12744,13015,13384,13088,13091,13045,13039,12706,12870,12404,12402,11933,11507,11616,11610,11966,12497,12957,12875,12563,12505,12599,12631,12888,12797,12764,12475,12568,12664,12488,11981,11845,11469,11341,11354,10950,10838,10490,10290,10233,10246,10349,10510,10839,11377,12014,11976,11949,12163,12185,11899,11663,11679,11653,11409,11178,10954,10831,10731,10612,10514,10442,10369,10304,10226,10160,10104,10070,10049,10042]
["Females","32",8853,8688,8451,8778,9631,9570,9361,9305,9833,9723,9745,9633,9523,9502,9831,9855,9971,10598,11031,11443,11634,12095,12370,12670,12782,13158,13493,13159,13101,13089,13078,12798,12915,12478,12538,12060,11745,11730,11729,11948,12515,12901,12777,12517,12526,12570,12626,12926,12826,12793,12498,12585,12675,12499,11987,11850,11474,11344,11357,10953,10840,10492,10291,10235,10247,10351,10512,10841,11380,12018,11983,11956,12169,12192,11904,11667,11683,11658,11413,11182,10957,10834,10735,10615,10516,10445,10372,10306,10228,10162,10106,10072,10051]
["Females","33",8474,8700,8501,8350,8680,9552,9492,9290,9270,9850,9914,9674,9614,9536,9482,9848,9850,9947,10597,11058,11518,11666,12152,12408,12698,12887,13216,13557,13147,13150,13132,13100,12869,13010,12609,12616,12240,11912,11773,11715,11888,12477,12855,12767,12540,12510,12575,12704,12953,12852,12814,12513,12594,12684,12504,11991,11854,11478,11347,11360,10955,10840,10492,10292,10235,10248,10351,10514,10842,11382,12022,11987,11960,12173,12196,11909,11672,11687,11662,11417,11185,10960,10836,10737,10617,10519,10448,10374,10308,10229,10163,10108,10073]
["Females","34",8530,8328,8520,8392,8257,8602,9482,9421,9256,9286,10043,9887,9679,9646,9583,9518,9878,9871,9975,10649,11167,11570,11716,12201,12443,12809,12931,13307,13599,13224,13286,13212,13167,12912,13083,12708,12772,12381,11984,11782,11687,11833,12440,12855,12798,12565,12542,12646,12744,12993,12888,12843,12538,12619,12703,12524,12009,11872,11496,11364,11376,10970,10856,10507,10306,10250,10263,10366,10531,10858,11399,12040,12005,11978,12191,12214,11928,11691,11706,11681,11436,11203,10978,10852,10753,10633,10534,10463,10390,10324,10245,10178,10122]
["Females","35",8560,8461,8227,8468,8334,8208,8555,9431,9358,9276,9491,10007,9871,9656,9634,9601,9492,9866,9864,9981,10698,11204,11613,11752,12239,12517,12904,12993,13335,13613,13278,13340,13259,13180,13060,13180,12804,12801,12406,11960,11757,11666,11802,12446,12804,12805,12566,12609,12675,12774,13018,12909,12858,12554,12629,12714,12534,12019,11881,11506,11373,11385,10980,10864,10514,10313,10257,10270,10373,10538,10865,11407,12051,12016,11988,12202,12225,11940,11702,11717,11691,11447,11214,10987,10859,10761,10640,10541,10471,10397,10332,10252,10185]
["Females","36",8264,8490,8359,8171,8412,8291,8162,8508,9382,9378,9481,9460,10044,9902,9675,9680,9651,9504,9910,9920,10058,10763,11249,11627,11784,12269,12662,12843,13027,13394,13527,13304,13323,13261,13211,13106,13238,12872,12799,12356,11934,11736,11624,11802,12468,12801,12822,12592,12628,12694,12789,13029,12917,12865,12557,12632,12716,12536,12020,11884,11509,11374,11386,10981,10864,10514,10312,10257,10269,10372,10538,10865,11409,12053,12020,11991,12205,12229,11943,11704,11719,11693,11449,11215,10989,10861,10763,10642,10542,10472,10397,10333,10252]
["Females","37",8133,8194,8390,8304,8120,8369,8247,8115,8456,9399,9584,9460,9444,10074,9923,9691,9699,9680,9519,9962,10001,10085,10797,11272,11642,11826,12334,12610,12859,13053,13537,13568,13346,13354,13325,13271,13189,13275,12897,12771,12352,11930,11705,11638,11787,12528,12809,12845,12619,12655,12718,12809,13046,12934,12877,12569,12644,12728,12550,12033,11895,11519,11386,11398,10992,10873,10522,10320,10265,10278,10381,10548,10874,11419,12065,12033,12003,12217,12242,11956,11717,11732,11705,11461,11227,11001,10871,10774,10653,10554,10483,10408,10344]
["Females","38",8326,8059,8091,8329,8251,8077,8321,8200,8061,8478,9610,9529,9448,9420,10086,9929,9667,9684,9695,9525,10019,10012,10128,10824,11273,11726,11908,12329,12625,12874,12953,13521,13614,13405,13410,13396,13374,13228,13299,12884,12767,12340,11905,11704,11666,11799,12554,12854,12874,12648,12680,12739,12827,13065,12949,12891,12584,12659,12744,12566,12048,11910,11534,11401,11412,11004,10887,10536,10333,10278,10291,10394,10561,10887,11434,12082,12050,12020,12234,12259,11973,11734,11749,11721,11478,11243,11017,10887,10790,10669,10569,10498,10422]
["Females","39",8180,8252,7955,8028,8269,8204,8030,8274,8151,8077,8665,9566,9522,9460,9409,10126,9948,9669,9710,9749,9574,10051,10019,10125,10812,11304,11800,11892,12344,12656,12903,12947,13487,13642,13425,13480,13476,13397,13263,13311,12871,12736,12338,11912,11698,11693,11836,12593,12880,12899,12672,12699,12756,12845,13079,12963,12904,12597,12673,12757,12579,12062,11923,11548,11414,11425,11017,10900,10549,10346,10292,10304,10406,10574,10901,11448,12095,12065,12035,12249,12274,11990,11750,11765,11736,11493,11258,11030,10901,10804,10682,10584,10511]
["Females","40",8408,8145,8188,7914,7990,8237,8166,7990,8245,8154,8194,8652,9564,9526,9485,9418,10165,9976,9686,9755,9820,9610,10078,10006,10146,10836,11330,11807,11894,12344,12727,12879,12967,13473,13681,13446,13513,13551,13388,13266,13322,12855,12695,12356,11899,11719,11711,11863,12617,12906,12923,12694,12716,12773,12859,13093,12977,12918,12612,12687,12771,12594,12076,11937,11562,11427,11438,11031,10915,10562,10359,10305,10316,10418,10587,10915,11462,12110,12081,12050,12264,12290,12005,11765,11780,11752,11509,11273,11045,10916,10818,10696,10599]
["Females","41",8444,8368,8076,8157,7870,7962,8203,8128,7957,8246,8270,8177,8673,9575,9542,9525,9426,10211,10018,9727,9826,9819,9622,10106,10013,10191,10874,11358,11815,11882,12308,12711,12867,12949,13525,13702,13484,13561,13549,13413,13280,13280,12813,12686,12314,11906,11729,11731,11879,12632,12922,12936,12702,12725,12779,12865,13099,12984,12927,12620,12695,12779,12602,12085,11945,11569,11434,11445,11037,10921,10568,10366,10311,10322,10425,10594,10922,11469,12118,12089,12059,12272,12299,12014,11774,11789,11761,11518,11283,11053,10925,10826,10703]
["Females","42",8297,8403,8298,8046,8111,7841,7931,8160,8096,7955,8361,8213,8159,8665,9551,9537,9524,9404,10236,10041,9757,9870,9794,9632,10115,10025,10199,10894,11361,11817,12029,12306,12697,12849,12971,13548,13780,13509,13585,13553,13415,13258,13262,12823,12701,12315,11920,11770,11744,11893,12642,12932,12942,12708,12729,12784,12870,13104,12990,12933,12626,12700,12785,12608,12090,11951,11576,11439,11451,11043,10926,10574,10371,10317,10327,10431,10600,10928,11475,12124,12097,12066,12280,12307,12021,11782,11798,11769,11525,11290,11060,10933,10834]
["Females","43",8333,8257,8335,8266,8001,8074,7804,7888,8128,8095,8066,8325,8181,8141,8654,9535,9520,9526,9379,10250,10077,9813,9890,9795,9624,10142,10045,10206,10884,11388,11885,11982,12290,12670,12871,12977,13557,13808,13511,13596,13545,13393,13221,13266,12843,12709,12308,11924,11786,11758,11904,12651,12938,12948,12713,12734,12789,12875,13109,12995,12938,12633,12706,12791,12614,12097,11957,11582,11446,11458,11050,10933,10581,10377,10323,10333,10437,10607,10936,11482,12132,12104,12073,12288,12315,12029,11790,11806,11777,11533,11299,11069,10940]
["Females","44",8612,8296,8192,8291,8225,7959,8031,7762,7848,8119,8201,8016,8288,8133,8108,8630,9495,9481,9508,9344,10257,10082,9808,9909,9786,9644,10133,10056,10201,10877,11369,11846,11950,12286,12662,12898,13012,13572,13824,13531,13589,13534,13395,13220,13279,12848,12713,12325,11934,11796,11764,11908,12653,12940,12948,12714,12734,12789,12875,13109,12996,12939,12634,12708,12793,12616,12100,11958,11585,11450,11461,11052,10936,10584,10380,10325,10335,10439,10609,10938,11485,12136,12109,12076,12292,12320,12032,11793,11810,11781,11537,11303,11073]
["Females","45",8649,8514,8169,8108,8222,8169,7905,7972,7721,7812,8083,8151,7996,8256,8095,8090,8596,9463,9460,9511,9347,10275,10092,9811,9931,9785,9661,10118,10062,10221,10912,11357,11808,11910,12293,12662,12908,13034,13568,13833,13524,13574,13531,13384,13226,13261,12863,12754,12337,11945,11806,11771,11914,12658,12944,12952,12718,12739,12794,12880,13115,13002,12945,12641,12715,12798,12621,12106,11964,11592,11457,11468,11058,10943,10590,10387,10332,10342,10446,10616,10945,11492,12144,12117,12084,12300,12328,12039,11802,11819,11789,11545,11312]
["Females","46",8405,8542,8379,8092,8031,8156,8114,7850,7928,7692,7779,8043,8121,7979,8232,8063,8075,8582,9445,9452,9517,9349,10285,10081,9836,9938,9786,9683,10125,10075,10176,10866,11336,11772,11894,12296,12692,12935,13052,13565,13837,13535,13573,13518,13369,13209,13253,12840,12759,12341,11947,11807,11770,11912,12654,12941,12950,12716,12737,12793,12879,13113,13000,12944,12640,12713,12796,12621,12107,11964,11592,11457,11468,11058,10943,10591,10387,10333,10343,10447,10618,10947,11493,12146,12120,12087,12302,12331,12041,11804,11821,11791,11547]
["Females","47",8700,8310,8418,8298,8020,7970,8089,8051,7810,7892,7651,7731,8018,8112,7965,8207,8033,8054,8566,9430,9464,9501,9335,10300,10075,9887,9956,9772,9714,10118,10096,10150,10864,11318,11777,11901,12290,12680,12938,13048,13529,13806,13487,13546,13514,13357,13214,13237,12837,12755,12336,11941,11799,11762,11902,12644,12931,12940,12706,12727,12784,12870,13105,12992,12935,12632,12705,12790,12615,12100,11958,11586,11452,11462,11051,10937,10585,10381,10328,10338,10442,10613,10942,11488,12141,12116,12083,12299,12327,12037,11800,11817,11787]
["Females","48",8757,8605,8186,8335,8219,7945,7907,8017,8005,7779,7863,7619,7685,7986,8086,7938,8181,7994,8013,8542,9402,9434,9501,9328,10298,10089,9901,9943,9743,9724,10194,10074,10138,10839,11308,11781,11908,12294,12697,12943,13049,13502,13808,13494,13543,13488,13359,13226,13238,12838,12755,12334,11938,11797,11757,11897,12640,12927,12936,12702,12724,12781,12865,13102,12990,12934,12631,12705,12790,12615,12099,11957,11585,11451,11463,11052,10937,10586,10381,10329,10339,10443,10613,10944,11489,12142,12118,12085,12301,12329,12039,11802,11819]
["Females","49",9003,8657,8475,8108,8251,8143,7866,7845,7963,7965,7739,7824,7588,7649,7959,8063,7906,8144,7941,7993,8535,9422,9423,9472,9329,10311,10102,9912,9949,9717,9697,10163,10069,10144,10813,11291,11752,11917,12265,12688,12924,13014,13481,13795,13459,13532,13497,13385,13229,13241,12840,12755,12333,11937,11794,11755,11895,12638,12924,12934,12700,12722,12779,12863,13102,12990,12934,12632,12705,12791,12617,12100,11958,11587,11453,11465,11055,10940,10589,10384,10332,10342,10446,10616,10947,11491,12145,12122,12089,12305,12333,12043,11807]
["Females","50",9204,8845,8470,8360,8007,8157,8049,7784,7808,7937,8035,7706,7788,7552,7601,7920,8033,7865,8107,7900,7962,8559,9422,9421,9443,9351,10314,10113,9922,9947,9783,9675,10115,10048,10132,10785,11286,11754,11881,12246,12636,12912,12985,13468,13761,13424,13513,13489,13379,13222,13233,12831,12745,12323,11925,11783,11745,11885,12627,12913,12924,12691,12713,12770,12854,13094,12981,12926,12625,12698,12784,12610,12093,11951,11581,11447,11459,11051,10935,10585,10379,10328,10338,10442,10612,10944,11488,12141,12118,12086,12302,12330,12040]
["Females","51",9140,9052,8663,8342,8254,7916,8070,7964,7737,7778,8001,8010,7696,7768,7531,7578,7903,8008,7838,8095,7877,7941,8553,9406,9412,9439,9340,10310,10102,9922,10003,9766,9665,10060,10031,10141,10805,11271,11721,11840,12216,12610,12898,12983,13445,13766,13396,13493,13477,13366,13208,13218,12816,12730,12307,11909,11769,11731,11870,12612,12900,12910,12677,12699,12756,12842,13081,12970,12914,12613,12686,12772,12599,12083,11941,11571,11438,11450,11043,10926,10577,10371,10321,10331,10435,10605,10937,11480,12134,12111,12080,12296,12324]
["Females","52",8354,8975,8858,8547,8236,8152,7825,7974,7922,7707,7841,7990,7979,7681,7742,7501,7529,7869,7971,7808,8078,7865,7923,8528,9375,9389,9427,9349,10279,10084,9796,9982,9734,9636,10038,10006,10130,10776,11244,11697,11809,12211,12619,12878,12978,13444,13740,13393,13482,13465,13353,13194,13204,12802,12716,12293,11895,11756,11718,11857,12599,12887,12897,12666,12687,12745,12832,13071,12960,12904,12603,12676,12763,12589,12074,11934,11564,11431,11443,11037,10921,10573,10366,10316,10327,10431,10601,10932,11475,12130,12107,12076,12291]
["Females","53",7613,8195,8788,8734,8421,8122,8050,7726,7916,7885,7763,7818,7993,7967,7677,7717,7475,7484,7840,7942,7801,8075,7844,7888,8519,9381,9378,9390,9329,10265,10021,9777,9950,9690,9634,10001,9983,10117,10736,11215,11638,11777,12182,12615,12879,12951,13404,13721,13383,13470,13453,13340,13180,13191,12789,12702,12281,11884,11745,11707,11847,12587,12876,12886,12656,12677,12735,12823,13061,12952,12895,12595,12669,12756,12582,12069,11928,11559,11426,11439,11034,10917,10570,10363,10313,10324,10428,10599,10931,11473,12128,12105,12075]
["Females","54",7603,7461,8016,8651,8617,8312,8016,7942,7688,7868,7936,7714,7775,7976,7927,7643,7670,7402,7419,7790,7896,7793,8043,7815,7870,8494,9372,9367,9348,9308,10295,9980,9759,9904,9680,9632,9960,9957,10102,10715,11200,11615,11750,12178,12613,12848,12910,13386,13705,13367,13452,13434,13322,13162,13172,12771,12685,12265,11869,11731,11693,11833,12572,12861,12873,12644,12665,12723,12811,13049,12940,12883,12584,12658,12746,12571,12060,11920,11552,11419,11432,11028,10912,10566,10359,10310,10321,10425,10596,10927,11469,12124,12101]
["Females","55",7904,7468,7302,7891,8537,8528,8213,7928,7879,7664,7957,7912,7712,7778,7983,7919,7634,7642,7371,7381,7790,7875,7787,8037,7794,7866,8486,9369,9351,9290,9364,10257,9943,9756,9879,9646,9601,9938,9933,10095,10659,11172,11578,11719,12137,12581,12834,12870,13364,13681,13342,13427,13409,13297,13137,13147,12748,12662,12243,11849,11711,11674,11814,12552,12841,12854,12626,12646,12705,12794,13031,12922,12867,12569,12642,12730,12556,12047,11907,11540,11407,11420,11017,10901,10556,10350,10301,10312,10417,10588,10919,11459,12114]
["Females","56",8432,7770,7310,7192,7776,8416,8408,8109,7859,7826,7722,7930,7872,7703,7756,7974,7886,7605,7599,7331,7343,7773,7854,7755,8007,7795,7836,8458,9327,9333,9122,9348,10221,9929,9750,9844,9609,9571,9910,9906,10079,10614,11134,11524,11668,12081,12548,12814,12839,13330,13646,13308,13392,13375,13262,13103,13113,12716,12630,12214,11820,11683,11647,11786,12524,12813,12826,12599,12619,12678,12767,13004,12897,12842,12545,12619,12707,12533,12025,11885,11520,11388,11401,10999,10883,10538,10333,10284,10295,10400,10571,10902,11442]
["Females","57",8282,8289,7602,7181,7082,7666,8286,8282,8041,7790,7872,7669,7896,7827,7665,7728,7949,7817,7573,7546,7299,7342,7755,7837,7731,7994,7773,7804,8416,9294,9372,9131,9327,10178,9912,9740,9801,9567,9536,9846,9850,10029,10579,11107,11487,11619,12041,12516,12779,12800,13290,13605,13268,13353,13336,13224,13065,13075,12680,12596,12181,11791,11652,11617,11757,12493,12782,12795,12569,12589,12649,12738,12975,12869,12814,12519,12593,12681,12507,12001,11863,11498,11366,11380,10979,10864,10519,10315,10266,10277,10382,10552,10884]
["Females","58",8314,8110,8095,7478,7071,6969,7549,8163,8203,7983,7845,7810,7616,7867,7794,7626,7686,7903,7759,7531,7501,7293,7306,7716,7818,7725,7970,7749,7765,8380,9304,9350,9129,9314,10124,9878,9692,9738,9529,9500,9783,9809,9991,10555,11063,11466,11597,12026,12484,12745,12765,13254,13567,13233,13317,13300,13189,13032,13042,12649,12564,12152,11764,11626,11592,11732,12466,12755,12769,12544,12564,12625,12715,12952,12847,12792,12498,12571,12659,12485,11982,11845,11480,11349,11364,10964,10849,10506,10303,10254,10264,10368,10540]
["Females","59",8046,8151,7925,7948,7350,6962,6859,7431,8066,8137,8034,7788,7764,7567,7819,7750,7558,7637,7876,7712,7494,7486,7253,7276,7682,7805,7687,7943,7727,7725,8288,9251,9314,9125,9293,10065,9840,9660,9698,9474,9451,9759,9788,9965,10497,11033,11441,11554,11992,12446,12705,12726,13212,13525,13192,13276,13260,13150,12994,13005,12614,12530,12119,11733,11597,11563,11703,12435,12723,12739,12515,12536,12596,12686,12924,12820,12766,12473,12546,12635,12462,11961,11824,11460,11329,11344,10947,10831,10489,10287,10239,10250,10355]
["Females","60",8254,7992,8078,7866,7876,7293,6917,6793,7357,7983,8174,7963,7752,7720,7509,7781,7703,7523,7608,7845,7688,7465,7444,7223,7250,7674,7789,7639,7914,7682,7695,8228,9216,9268,9114,9257,10005,9777,9626,9644,9430,9399,9703,9746,9910,10442,10980,11390,11509,11943,12395,12653,12675,13159,13472,13140,13225,13210,13100,12946,12957,12569,12486,12076,11692,11558,11524,11664,12395,12682,12698,12477,12498,12558,12649,12886,12784,12731,12439,12512,12601,12429,11931,11793,11430,11301,11317,10920,10805,10465,10264,10216,10228]
["Females","61",7907,8184,7900,7971,7776,7789,7200,6826,6706,7264,8079,8081,7896,7710,7679,7453,7736,7650,7467,7559,7793,7646,7412,7405,7198,7220,7620,7758,7615,7852,7641,7658,8201,9156,9244,9115,9229,9941,9721,9595,9589,9380,9354,9669,9678,9853,10404,10922,11337,11453,11886,12335,12592,12615,13097,13410,13080,13165,13151,13043,12890,12902,12516,12434,12027,11645,11512,11479,11619,12347,12633,12651,12432,12453,12513,12605,12841,12740,12688,12398,12471,12561,12390,11894,11757,11395,11267,11284,10888,10773,10436,10235,10188]
["Females","62",7738,7826,8082,7826,7878,7661,7679,7087,6727,6609,7297,7983,8019,7839,7683,7649,7408,7698,7602,7419,7521,7752,7592,7355,7342,7151,7187,7562,7727,7552,7775,7607,7610,8168,9103,9196,9079,9167,9875,9678,9526,9536,9350,9281,9600,9611,9807,10361,10868,11278,11394,11824,12271,12528,12551,13032,13345,13017,13103,13090,12983,12832,12844,12459,12380,11975,11595,11464,11431,11570,12297,12583,12601,12384,12406,12466,12558,12795,12695,12643,12356,12428,12519,12349,11855,11720,11360,11231,11248,10854,10740,10406,10205]
["Females","63",7511,7647,7717,7968,7702,7756,7541,7552,6981,6629,6629,7182,7895,7937,7780,7601,7587,7341,7648,7524,7365,7451,7665,7511,7297,7319,7112,7162,7481,7685,7567,7717,7550,7547,8126,9042,9123,9045,9130,9809,9623,9466,9493,9307,9223,9565,9537,9726,10306,10808,11215,11331,11757,12202,12460,12484,12963,13275,12950,13036,13024,12919,12769,12782,12400,12323,11921,11543,11413,11380,11520,12244,12531,12550,12334,12356,12417,12509,12747,12648,12597,12311,12383,12474,12306,11815,11680,11322,11194,11212,10820,10705,10373]
["Females","64",7443,7400,7521,7599,7848,7563,7632,7404,7445,6862,6629,6524,7084,7813,7874,7719,7540,7525,7300,7589,7470,7299,7386,7550,7449,7235,7267,7089,7108,7430,7592,7507,7664,7500,7486,8072,8966,9075,8999,9032,9746,9566,9394,9427,9241,9166,9494,9467,9667,10241,10741,11146,11262,11685,12129,12385,12410,12888,13200,12878,12964,12953,12850,12702,12716,12336,12260,11862,11487,11358,11325,11465,12187,12473,12493,12280,12303,12364,12456,12695,12596,12545,12262,12334,12425,12260,11771,11637,11281,11154,11172,10782,10668]
["Females","65",7277,7288,7230,7368,7431,7675,7392,7455,7252,7298,6796,6516,6427,6958,7711,7786,7638,7452,7445,7205,7532,7386,7233,7296,7444,7363,7135,7208,7042,7029,7415,7523,7439,7591,7437,7424,8012,8886,9000,8955,8968,9673,9480,9313,9347,9161,9117,9423,9404,9599,10169,10668,11068,11184,11605,12048,12303,12329,12804,13115,12798,12883,12873,12772,12626,12641,12265,12191,11795,11423,11295,11265,11405,12123,12409,12430,12219,12243,12304,12397,12634,12538,12488,12206,12279,12371,12206,11721,11588,11234,11108,11126,10739]
["Females","66",7042,7104,7106,7070,7218,7274,7510,7223,7301,7140,7257,6662,6396,6317,6834,7591,7679,7534,7369,7367,7121,7442,7303,7135,7195,7364,7308,7072,7128,6982,6996,7344,7439,7365,7507,7362,7365,7939,8793,8920,8900,8898,9579,9403,9223,9266,9103,9035,9353,9331,9523,10090,10585,10983,11099,11518,11958,12214,12240,12713,13023,12710,12794,12786,12687,12544,12560,12186,12114,11722,11353,11227,11197,11337,12051,12337,12359,12151,12175,12237,12330,12568,12473,12424,12145,12218,12310,12147,11665,11533,11182,11057,11075]
["Females","67",6685,6875,6928,6951,6895,7050,7121,7336,7077,7164,7074,7102,6545,6290,6200,6691,7480,7569,7426,7274,7283,7033,7333,7219,7033,7102,7253,7234,6982,7042,6837,6906,7231,7375,7284,7431,7276,7289,7868,8711,8843,8821,8812,9477,9315,9149,9160,9003,8962,9273,9251,9442,10005,10497,10894,11010,11425,11865,12119,12146,12617,12927,12616,12702,12694,12597,12458,12474,12104,12033,11645,11279,11155,11125,11266,11976,12263,12286,12080,12105,12168,12261,12498,12405,12357,12080,12154,12247,12084,11606,11476,11128,11004]
["Females","68",6396,6479,6664,6752,6775,6726,6853,6957,7167,6905,7066,6932,6956,6426,6160,6076,6557,7324,7458,7330,7171,7158,6949,7233,7121,6919,6984,7146,7135,6886,6979,6751,6815,7122,7275,7203,7351,7199,7208,7792,8614,8763,8754,8727,9386,9204,9062,9075,8922,8878,9186,9164,9353,9913,10401,10796,10912,11324,11761,12014,12043,12511,12821,12512,12600,12593,12498,12362,12378,12013,11944,11560,11197,11077,11047,11189,11894,12181,12204,12000,12027,12090,12185,12420,12330,12283,12008,12083,12176,12014,11541,11412,11067]
["Females","69",6147,6221,6298,6483,6593,6593,6526,6666,6784,7014,6820,6920,6786,6818,6298,6040,5965,6405,7200,7336,7214,7053,7020,6823,7100,7030,6820,6860,7023,7041,6811,6841,6647,6730,7019,7202,7110,7258,7121,7105,7705,8487,8661,8658,8627,9273,9106,8972,8981,8826,8781,9087,9066,9254,9808,10291,10684,10800,11209,11644,11896,11926,12391,12699,12396,12483,12478,12385,12252,12269,11909,11842,11462,11104,10985,10957,11099,11799,12085,12110,11910,11937,12000,12096,12330,12242,12196,11924,12001,12093,11933,11466,11338]
["Females","70",6087,5974,6044,6094,6298,6392,6400,6335,6479,6614,6910,6677,6790,6645,6673,6156,5912,5836,6251,7039,7226,7077,6904,6894,6690,6970,6906,6707,6727,6880,6964,6706,6723,6547,6626,6901,7080,7019,7178,7028,7012,7620,8378,8561,8538,8507,9125,8992,8865,8870,8718,8675,8978,8958,9144,9694,10173,10563,10679,11084,11517,11768,11799,12261,12567,12269,12356,12353,12263,12132,12151,11796,11731,11355,11002,10885,10859,11001,11696,11980,12007,11810,11837,11901,11998,12232,12146,12101,11833,11910,12003,11845,11383]
["Females","71",5920,5852,5742,5826,5877,6087,6189,6184,6128,6291,6493,6709,6502,6651,6473,6507,6007,5752,5703,6100,6888,7058,6893,6758,6717,6544,6811,6758,6582,6608,6751,6832,6561,6617,6418,6527,6806,6965,6878,7075,6924,6920,7520,8285,8435,8414,8410,8991,8876,8746,8753,8604,8562,8861,8842,9027,9573,10047,10433,10549,10952,11381,11631,11663,12122,12426,12134,12222,12221,12133,12006,12025,11675,11613,11242,10895,10779,10755,10897,11587,11870,11898,11704,11732,11797,11894,12128,12044,12001,11735,11813,11906,11752]
["Females","72",5449,5694,5628,5555,5619,5670,5882,5969,5986,5946,6172,6287,6497,6316,6467,6291,6313,5854,5599,5550,5914,6724,6881,6731,6596,6560,6405,6672,6608,6450,6428,6587,6669,6428,6499,6295,6406,6678,6816,6745,6975,6800,6825,7396,8165,8287,8265,8297,8862,8744,8617,8624,8479,8439,8734,8717,8901,9441,9910,10293,10409,10808,11233,11483,11516,11971,12273,11986,12075,12076,11991,11867,11888,11544,11484,11118,10777,10663,10641,10783,11468,11749,11779,11588,11617,11683,11781,12014,11932,11891,11629,11707,11801]
["Females","73",5036,5174,5428,5404,5361,5366,5451,5645,5726,5778,5799,5954,6063,6275,6112,6265,6077,6095,5693,5425,5383,5755,6518,6669,6566,6427,6408,6241,6523,6447,6330,6271,6443,6510,6299,6375,6191,6284,6551,6704,6599,6848,6672,6735,7258,8009,8153,8119,8164,8715,8600,8477,8485,8344,8305,8597,8582,8765,9298,9761,10140,10256,10651,11072,11322,11356,11805,12106,11824,11914,11917,11835,11714,11738,11401,11343,10982,10648,10536,10516,10658,11337,11615,11648,11460,11490,11557,11656,11889,11808,11769,11513,11589]
["Females","74",5024,4808,4951,5146,5163,5115,5122,5209,5424,5498,5610,5561,5713,5850,6029,5907,6040,5874,5894,5492,5257,5223,5591,6296,6451,6359,6197,6187,6070,6353,6310,6152,6124,6277,6347,6163,6213,6053,6160,6422,6553,6483,6737,6566,6583,7119,7845,7985,7977,8015,8557,8448,8327,8338,8200,8163,8452,8439,8620,9145,9603,9978,10094,10484,10901,11150,11185,11629,11928,11652,11743,11748,11670,11552,11578,11248,11192,10838,10511,10401,10382,10525,11196,11474,11508,11324,11355,11423,11523,11755,11676,11639,11388]
["Females","75",4814,4704,4497,4642,4818,4918,4838,4858,4987,5118,5156,5374,5340,5501,5602,5761,5680,5801,5683,5653,5301,5062,5037,5400,6088,6212,6157,5998,5979,5924,6131,6116,5955,5954,6080,6152,6009,6060,5916,6030,6269,6386,6351,6594,6390,6437,6954,7669,7826,7813,7852,8385,8280,8164,8175,8041,8007,8292,8281,8460,8977,9429,9799,9915,10301,10712,10960,10997,11436,11731,11463,11555,11562,11488,11374,11401,11078,11025,10679,10358,10252,10235,10378,11041,11317,11353,11173,11206,11275,11375,11606,11530,11495]
["Females","76",4347,4476,4378,4189,4338,4485,4640,4549,4592,4709,4834,4932,5133,5113,5245,5346,5480,5451,5590,5469,5437,5096,4882,4823,5195,5885,5983,5932,5782,5730,5815,5922,5931,5732,5782,5880,5977,5856,5878,5754,5910,6102,6199,6191,6416,6233,6276,6786,7497,7644,7633,7673,8196,8095,7984,7996,7867,7836,8116,8107,8284,8793,9237,9602,9718,10099,10505,10750,10789,11223,11515,11254,11347,11357,11286,11177,11206,10891,10841,10502,10188,10086,10071,10214,10869,11142,11180,11005,11040,11109,11210,11440,11367]
["Females","77",4002,4039,4178,4049,3884,4030,4209,4374,4275,4298,4435,4561,4709,4861,4868,4976,5099,5225,5203,5313,5245,5202,4876,4668,4629,4963,5621,5701,5718,5576,5420,5608,5714,5710,5553,5559,5677,5744,5670,5731,5574,5747,5918,6022,6001,6231,6053,6120,6616,7302,7446,7438,7479,7989,7894,7788,7802,7678,7649,7924,7917,8092,8593,9029,9388,9506,9882,10281,10524,10565,10991,11281,11028,11121,11134,11068,10964,10995,10687,10641,10310,10003,9906,9893,10036,10681,10953,10992,10823,10859,10929,11031,11260]
["Females","78",3593,3691,3738,3856,3732,3612,3739,3938,4117,4013,4077,4177,4321,4464,4601,4624,4747,4866,4959,4947,5032,4994,4969,4644,4449,4394,4732,5372,5434,5447,5479,5200,5375,5487,5463,5367,5356,5484,5545,5490,5548,5396,5582,5718,5851,5824,6056,5854,5948,6424,7092,7233,7227,7269,7767,7676,7575,7591,7472,7446,7716,7711,7884,8375,8804,9156,9274,9645,10036,10277,10320,10739,11026,10782,10875,10891,10830,10731,10764,10465,10423,10100,9801,9709,9698,9841,10477,10747,10788,10623,10661,10732,10836]
["Females","79",3136,3294,3402,3413,3530,3451,3307,3458,3665,3838,3796,3802,3926,4049,4291,4321,4375,4478,4588,4660,4685,4765,4742,4712,4397,4269,4162,4504,5113,5128,5202,5226,4969,5110,5240,5239,5123,5149,5273,5326,5301,5359,5177,5380,5523,5673,5595,5850,5668,5752,6214,6862,7001,6997,7040,7525,7439,7344,7362,7249,7226,7490,7488,7658,8138,8557,8903,9020,9384,9769,10006,10051,10463,10746,10511,10605,10624,10568,10474,10510,10221,10183,9870,9581,9493,9485,9627,10252,10519,10562,10403,10443,10515]
["Females","80",2768,2887,3059,3125,3114,3229,3172,3044,3168,3382,3774,3510,3542,3650,3807,4036,4088,4101,4237,4300,4404,4433,4442,4454,4434,4135,4040,3941,4284,4826,4740,4909,4956,4722,4853,4964,4956,4905,4938,5050,5126,5084,5148,4969,5162,5294,5451,5380,5639,5456,5538,5985,6613,6749,6748,6792,7263,7184,7095,7115,7007,6987,7246,7247,7414,7881,8289,8628,8745,9101,9478,9711,9759,10164,10442,10218,10312,10332,10282,10194,10234,9955,9922,9619,9340,9256,9251,9393,10006,10271,10315,10163,10205]
["Females","81",2521,2499,2635,2804,2804,2831,2926,2868,2755,2905,3338,3490,3225,3279,3379,3523,3849,3787,3813,3930,4013,4122,4170,4168,4191,4150,3869,3794,3711,4029,4715,4458,4634,4658,4423,4587,4684,4691,4678,4705,4799,4867,4843,4935,4723,4950,5047,5207,5163,5403,5230,5311,5741,6346,6479,6481,6526,6981,6908,6825,6847,6746,6729,6982,6985,7149,7603,8000,8330,8446,8794,9163,9392,9442,9839,10112,9899,9993,10017,9972,9890,9932,9664,9636,9344,9076,8997,8996,9137,9736,9997,10044,9901]
["Females","82",2650,2276,2268,2373,2530,2517,2545,2646,2572,2466,2826,3040,3231,2963,2994,3124,3261,3637,3499,3533,3647,3734,3817,3847,3844,3922,3862,3636,3498,3455,3744,4370,4189,4339,4364,4181,4328,4394,4390,4431,4487,4553,4596,4591,4660,4522,4715,4815,4969,4918,5149,4986,5066,5478,6059,6188,6192,6238,6676,6610,6534,6558,6464,6451,6696,6701,6862,7301,7686,8008,8122,8461,8820,9046,9098,9485,9751,9550,9645,9672,9633,9557,9602,9347,9323,9044,8788,8716,8718,8857,9443,9698,9748]
["Females","83",2023,2362,2009,2004,2114,2264,2212,2270,2354,2310,2398,2572,2752,2979,2713,2729,2861,3004,3447,3196,3268,3352,3445,3522,3546,3544,3581,3566,3332,3212,3157,3497,4063,3905,4039,4102,3951,4024,4094,4121,4136,4226,4284,4338,4320,4439,4262,4445,4567,4704,4658,4879,4727,4805,5197,5751,5877,5884,5930,6350,6290,6221,6247,6161,6152,6389,6397,6553,6976,7349,7661,7774,8103,8451,8672,8726,9102,9363,9174,9269,9300,9267,9197,9245,9003,8984,8719,8476,8411,8416,8554,9124,9374]
["Females","84",1739,1763,2121,1746,1747,1872,1966,1949,1981,2085,2242,2172,2349,2486,2753,2498,2500,2635,2747,3283,2903,3022,3076,3090,3183,3245,3230,3281,3276,3037,2955,2911,3222,3713,3618,3746,3803,3685,3708,3772,3833,3886,3941,4018,4033,4043,4139,3983,4184,4290,4420,4380,4589,4448,4524,4895,5421,5543,5553,5599,6000,5946,5885,5913,5834,5829,6058,6069,6221,6624,6985,7286,7398,7716,8052,8268,8324,8688,8943,8766,8862,8896,8869,8807,8858,8630,8616,8367,8137,8078,8087,8224,8776]
["Females","85",1335,1500,1545,1871,1499,1484,1634,1698,1689,1747,2065,2100,2072,2145,2264,2354,2434,2464,2589,2659,2689,2654,2728,2782,2773,2877,2919,2941,2926,2937,2815,2673,2667,2943,3409,3345,3423,3500,3407,3395,3456,3539,3541,3679,3735,3731,3755,3835,3717,3893,3996,4119,4085,4282,4151,4224,4574,5069,5186,5198,5245,5624,5577,5523,5553,5482,5481,5701,5715,5862,6247,6592,6881,6992,7299,7621,7829,7887,8239,8486,8324,8420,8458,8437,8383,8437,8225,8215,7981,7766,7714,7727,7862]
["Females","86",1164,1113,1297,1333,1624,1274,1256,1411,1451,1469,1736,1771,1805,1818,1890,2032,2102,2104,2186,2267,2394,2437,2376,2457,2490,2491,2555,2619,2609,2601,2663,2559,2380,2432,2646,3066,3046,3121,3144,3133,3105,3156,3240,3220,3359,3438,3410,3417,3543,3423,3589,3687,3802,3773,3958,3839,3909,4235,4697,4809,4824,4870,5226,5185,5139,5170,5108,5111,5321,5338,5480,5845,6173,6449,6558,6850,7159,7360,7420,7756,7994,7848,7943,7984,7971,7924,7981,7786,7782,7564,7366,7322,7339]
["Females","87",869,974,940,1077,1104,1423,1041,1044,1170,1209,1446,1467,1497,1557,1579,1672,1779,1789,1847,1894,1946,2114,2186,2079,2170,2217,2166,2211,2284,2298,2277,2364,2277,2122,2189,2379,2749,2737,2831,2841,2874,2818,2828,2941,2897,3075,3088,3070,3118,3222,3115,3270,3362,3470,3446,3618,3511,3578,3879,4305,4411,4428,4474,4805,4771,4732,4765,4712,4719,4917,4938,5074,5417,5725,5988,6093,6370,6664,6858,6919,7239,7467,7337,7432,7476,7470,7431,7490,7313,7315,7115,6934,6896]
["Females","88",684,683,805,749,871,910,1238,851,856,983,1158,1206,1222,1272,1331,1376,1449,1500,1550,1585,1673,1715,1829,1932,1800,1911,1946,1865,1917,1975,1995,2013,2050,1996,1882,1954,2104,2394,2451,2529,2549,2562,2491,2577,2640,2603,2760,2748,2764,2796,2893,2799,2942,3028,3129,3109,3267,3173,3236,3510,3899,3998,4018,4063,4367,4340,4308,4342,4299,4310,4495,4519,4648,4968,5256,5503,5605,5866,6143,6329,6391,6693,6910,6796,6891,6938,6938,6908,6969,6810,6818,6636,6473]
["Females","89",539,534,548,615,599,713,709,1064,656,686,915,953,996,1024,1073,1144,1171,1214,1285,1305,1385,1475,1456,1580,1693,1556,1644,1662,1561,1592,1695,1746,1734,1795,1746,1665,1699,1800,2050,2200,2235,2209,2302,2189,2254,2327,2297,2412,2443,2445,2475,2564,2483,2613,2691,2784,2768,2911,2830,2888,3136,3486,3578,3599,3643,3919,3899,3874,3909,3875,3889,4061,4088,4209,4505,4771,5001,5100,5343,5603,5779,5842,6124,6329,6232,6326,6375,6382,6361,6423,6283,6296,6134]
["Females",90,1579,1568,1605,1530,1562,1586,1726,1842,2443,2490,2934,3001,3155,3274,3409,3477,3610,3678,3724,3756,4360,4612,4879,4986,5259,5511,5615,5795,5744,5643,5640,5872,6127,6209,6489,6656,6702,6793,6955,7350,7754,8150,8307,8771,8975,9165,9296,9281,9578,9744,9884,10022,10220,10314,10512,10753,11041,11276,11602,11810,12034,12440,13097,13743,14312,14826,15503,16060,16503,16904,17212,17482,17869,18230,18655,19298,20105,21024,21919,22917,24019,25133,26150,27284,28444,29353,30215,30993,31663,32221,32755,33090,33390]
["All","0",31371,30508,29256,28103,26703,25979,25960,25893,26812,27707,27249,26753,26790,26832,27373,27601,27764,27368,26348,25930,25898,25673,24626,24308,23831,23668,24428,23574,23231,22248,21541,21297,21290,21946,22525,22693,23823,25237,25249,24964,25364,25307,24631,24255,24249,24486,23686,23156,22695,22454,22244,22001,21798,21645,21485,21317,21158,21013,20896,20812,20759,20737,20749,20802,20893,21021,21185,21366,21548,21716,21858,21968,22042,22055,22024,21947,21842,21698,21528,21339,21145,20945,20756,20573,20399,20246,20105,19992,19894,19818,19765,19731,19715]
["All","1",31389,30765,29794,28816,27696,26383,25678,25661,25706,26646,27870,27146,26608,26662,26753,27172,27368,27503,27120,26226,25992,25989,25681,24593,24380,24031,23731,24432,23622,23202,22227,21444,21206,21153,22062,22671,22983,24108,25443,25486,25166,25505,25573,24835,24485,24498,24733,23970,23357,22895,22646,22427,22175,21973,21811,21652,21485,21325,21178,21061,20977,20924,20902,20914,20968,21059,21189,21353,21535,21718,21887,22029,22139,22213,22226,22196,22119,22014,21869,21699,21510,21315,21115,20926,20741,20568,20416,20275,20160,20061,19985,19933,19899]
["All","2",31578,30876,30132,29410,28492,27435,26139,25457,25528,25598,26827,27702,27104,26531,26568,26740,26988,27130,27262,26918,26257,25990,26096,25729,24614,24559,24101,23807,24349,23620,23378,22334,21556,21352,21354,22243,22789,23176,24240,25579,25600,25230,25545,25730,25018,24656,24651,24917,24185,23570,23097,22838,22609,22357,22145,21982,21821,21654,21494,21346,21232,21146,21094,21074,21086,21138,21228,21361,21525,21706,21890,22059,22203,22313,22388,22399,22369,22293,22188,22042,21870,21682,21486,21286,21096,20911,20737,20585,20443,20328,20229,20152,20099]
["All","3",31835,31077,30254,29763,29091,28240,27202,25923,25330,25430,25746,26605,27604,27070,26421,26477,26647,26737,26883,27031,26807,26345,26027,26119,25707,24745,24550,24121,23862,24331,23441,23456,22405,21622,21471,21555,22362,22892,23228,24288,25600,25645,25244,25612,25855,25155,24718,24780,25066,24334,23710,23229,22960,22733,22471,22259,22096,21934,21766,21604,21456,21341,21255,21203,21183,21195,21247,21338,21472,21636,21817,22001,22172,22315,22427,22502,22513,22483,22407,22303,22154,21982,21794,21597,21397,21206,21020,20846,20694,20551,20436,20337,20260]
["All","4",31605,31339,30461,29901,29454,28847,28018,26990,25799,25230,25099,25555,26480,27526,27019,26312,26328,26504,26511,26671,26923,26848,26412,26002,26116,25869,24803,24508,24128,23929,24311,23557,23514,22476,21756,21642,21757,22442,22794,23273,24364,25637,25680,25349,25709,25974,25213,24913,24905,25192,24449,23817,23329,23058,22822,22561,22348,22185,22022,21853,21692,21543,21427,21341,21288,21268,21280,21332,21423,21557,21721,21903,22087,22258,22401,22515,22591,22603,22573,22497,22392,22243,22071,21882,21685,21484,21294,21106,20932,20780,20636,20521,20422]
["All","5",32476,31369,30988,30276,29721,29316,28707,27871,26900,25739,25103,24973,25498,26421,27474,27025,26207,26199,26433,26360,26617,26968,26864,26395,26008,26200,25838,24815,24459,24099,23655,24294,23602,23528,22629,21873,21784,21878,22390,22710,23211,24328,25601,25692,25414,25781,26062,25299,25018,25011,25290,24541,23900,23411,23132,22896,22634,22420,22256,22093,21925,21763,21614,21497,21412,21358,21338,21351,21403,21493,21627,21792,21974,22159,22330,22472,22588,22664,22676,22647,22572,22466,22316,22143,21953,21757,21556,21364,21177,21003,20850,20706,20591]
["All","6",33161,32248,31024,30812,30104,29532,29181,28564,27737,26848,25624,24914,24831,25351,26247,27326,26871,25953,25978,26284,26204,26746,27050,26837,26380,26100,26215,25832,24862,24408,24116,23695,24312,23603,23617,22756,21991,21852,21839,22372,22581,23200,24360,25658,25729,25462,25885,26150,25382,25099,25085,25358,24603,23962,23465,23185,22948,22684,22472,22307,22144,21976,21814,21665,21548,21462,21408,21389,21402,21454,21543,21679,21843,22023,22210,22382,22524,22640,22716,22728,22699,22624,22518,22366,22193,22004,21808,21605,21413,21226,21054,20900,20755]
["All","7",32509,32930,31896,30841,30632,29966,29395,29034,28471,27679,26745,25497,24879,24795,25287,26171,27236,26789,25824,25879,26305,26329,26774,27063,26848,26482,26109,26202,25731,24846,24388,24150,23742,24357,23754,23729,22893,22106,21895,21856,22326,22608,23239,24450,25752,25809,25559,25961,26240,25472,25181,25161,25429,24674,24026,23528,23249,23011,22747,22535,22369,22206,22037,21874,21725,21608,21522,21469,21450,21463,21514,21603,21738,21902,22083,22272,22444,22586,22702,22777,22789,22758,22684,22578,22427,22253,22066,21870,21665,21473,21285,21113,20960]
["All","8",31330,32283,32582,31722,30666,30491,29825,29249,28938,28420,27603,26561,25424,24853,24743,25227,26053,27112,26716,25709,25842,26346,26466,26804,27079,26911,26475,26129,26171,25666,24706,24450,24196,23810,24383,23872,23873,22980,22139,21908,21814,22347,22656,23344,24536,25830,25892,25695,26063,26343,25568,25270,25245,25514,24753,24104,23606,23326,23088,22824,22611,22445,22281,22112,21948,21799,21681,21596,21543,21524,21537,21587,21676,21811,21976,22158,22346,22518,22660,22776,22851,22864,22833,22760,22653,22502,22329,22142,21946,21740,21547,21359,21188]
["All","9",30222,31097,31932,32408,31545,30524,30355,29686,29157,28886,28355,27438,26452,25390,24845,24728,25160,25937,27033,26687,25694,25948,26348,26510,26879,27160,26897,26477,26055,26166,25779,24714,24509,24252,23935,24453,24010,23922,23017,22123,21889,21828,22389,22706,23393,24643,25899,26010,25791,26160,26433,25653,25349,25323,25588,24827,24176,23678,23398,23158,22894,22682,22514,22351,22183,22020,21870,21750,21665,21613,21594,21607,21657,21746,21882,22048,22231,22418,22590,22733,22849,22924,22937,22905,22832,22724,22573,22401,22213,22016,21811,21619,21430]
["All","10",29219,30145,30911,31865,32308,31473,30444,30253,29591,29131,28954,28013,27366,26393,25384,24876,24711,25114,25875,27008,26757,25772,26071,26374,26618,26985,27150,26930,26400,26035,26083,25700,24719,24571,24333,24071,24569,24173,23975,23022,22139,21939,21841,22481,22775,23470,24708,26010,26099,25880,26244,26513,25728,25423,25391,25656,24896,24241,23744,23465,23225,22961,22748,22578,22415,22249,22085,21934,21816,21731,21679,21660,21673,21723,21812,21948,22113,22297,22484,22656,22800,22915,22990,23004,22972,22899,22791,22640,22469,22280,22083,21879,21685]
["All","11",28210,29142,29963,30841,31766,32233,31391,30342,30162,29567,29205,28689,27720,27297,26313,25372,24874,24675,25071,25812,27007,26737,25916,26183,26389,26790,27038,27178,26914,26380,26140,26045,25605,24714,24661,24470,24223,24648,24258,23990,23027,22166,21974,21951,22543,22860,23547,24809,26101,26190,25966,26329,26591,25806,25496,25464,25729,24968,24314,23815,23536,23297,23032,22818,22647,22484,22319,22155,22004,21885,21800,21748,21729,21744,21794,21883,22019,22185,22369,22555,22727,22871,22988,23063,23077,23045,22972,22864,22712,22540,22350,22153,21949]
["All","12",27213,28140,28970,29896,30744,31692,32150,31283,30252,30135,29644,28956,28444,27412,27197,26217,25313,24831,24627,25011,25797,26946,26690,25939,26312,26471,26901,27061,27149,26968,26349,26112,26015,25541,24788,24767,24593,24370,24729,24325,24029,23057,22192,22058,22056,22619,22939,23642,24899,26193,26280,26050,26408,26670,25882,25570,25538,25803,25043,24387,23888,23609,23370,23106,22891,22719,22556,22391,22228,22077,21958,21873,21821,21802,21818,21868,21957,22093,22260,22445,22629,22802,22945,23064,23139,23153,23121,23048,22940,22787,22615,22424,22228]
["All","13",27323,27136,27965,28905,29798,30673,31611,32045,31187,30226,30223,29482,28771,28237,27119,27127,26116,25268,24825,24618,25029,25723,26907,26658,25976,26473,26493,26977,27076,27115,26918,26320,26094,25999,25492,24888,24915,24671,24429,24751,24369,24066,23096,22297,22130,22146,22690,23070,23735,24993,26285,26368,26133,26492,26749,25962,25650,25618,25883,25122,24464,23964,23686,23446,23182,22966,22795,22633,22468,22303,22151,22033,21948,21897,21878,21894,21944,22033,22169,22336,22521,22705,22878,23022,23141,23216,23231,23199,23125,23017,22865,22693,22502]
["All","14",27172,27241,26956,27893,28813,29728,30594,31504,31942,31155,30313,29984,29340,28577,27999,26811,27012,25985,25216,24805,24620,25004,25648,26824,26617,26080,26578,26530,27005,27090,27241,26890,26300,26058,25983,25471,24994,25025,24760,24499,24784,24441,24134,23162,22357,22216,22238,22791,23158,23826,25081,26369,26447,26214,26568,26827,26039,25725,25693,25958,25197,24539,24038,23759,23519,23256,23039,22868,22706,22541,22375,22223,22105,22020,21969,21950,21966,22015,22104,22241,22410,22594,22778,22952,23096,23215,23290,23305,23273,23198,23091,22940,22768]
["All","15",26131,26389,26345,26418,27451,28455,29406,30301,31318,31615,29498,30027,29742,29183,28356,27739,26467,26868,25847,25146,24790,24605,24952,25561,26703,26603,26141,26679,26496,27086,27260,27198,26842,26265,26027,25995,25514,25005,25135,24813,24543,24837,24452,24203,23199,22396,22264,22337,22863,23233,23897,25147,26431,26510,26272,26627,26886,26099,25785,25753,26018,25256,24598,24098,23818,23578,23315,23098,22926,22764,22599,22433,22280,22162,22077,22027,22008,22024,22073,22162,22299,22468,22652,22836,23010,23155,23274,23349,23363,23332,23257,23150,22998]
["All","16",25297,25358,25505,25802,25983,27094,28137,29115,30114,30989,29967,29393,29806,29561,29071,28189,27519,26166,26782,25763,25166,24669,24607,24889,25462,26616,26512,26163,26717,26433,27269,27207,27164,26798,26254,26040,25991,25497,25066,25177,24863,24565,24836,24509,24271,23263,22443,22355,22406,22931,23297,23957,25203,26489,26564,26326,26681,26939,26153,25839,25807,26071,25309,24652,24151,23870,23631,23368,23150,22980,22819,22654,22488,22335,22217,22132,22082,22063,22079,22128,22217,22354,22523,22707,22891,23065,23210,23329,23404,23418,23387,23312,23205]
["All","17",25580,24884,24905,25392,25761,26070,27161,28267,29304,30135,29631,29949,29378,29657,29435,29009,28071,27358,25933,26770,25776,25025,24580,24505,24762,25360,26493,26375,26139,26782,26372,27278,27229,27119,26777,26268,26088,25963,25464,25112,25269,24868,24572,24869,24562,24303,23276,22519,22412,22463,22985,23347,24001,25248,26531,26605,26368,26723,26981,26195,25881,25851,26115,25353,24696,24194,23913,23673,23411,23194,23024,22863,22698,22532,22379,22260,22175,22125,22106,22122,22171,22261,22398,22567,22751,22935,23108,23253,23372,23447,23461,23431,23356]
["All","18",24406,23281,22453,23024,24534,25082,25328,26396,27494,28386,28713,29823,30134,29517,29682,29475,29166,28114,27392,25891,26976,25937,25382,24479,22960,23315,23771,24527,24272,24408,26192,26194,26986,27242,27175,26925,26360,26155,26184,25585,25316,25313,24844,24689,24973,24526,24380,23357,22570,22464,22508,23024,23380,24033,25274,26555,26628,26391,26747,27004,26219,25906,25876,26140,25378,24722,24221,23941,23701,23438,23225,23055,22894,22730,22564,22410,22291,22206,22155,22137,22154,22203,22293,22431,22600,22784,22967,23139,23285,23403,23478,23492,23462]
["All","19",24386,23736,22512,21992,22647,24248,24826,25090,26226,27187,27811,28630,29649,29911,29330,29353,29233,28853,27805,27081,25631,26180,24987,23827,23361,22210,22542,22743,23227,23200,22852,25427,25114,26219,26383,26262,26127,25687,25590,25554,25017,24540,24312,23738,23605,23885,23255,23323,22830,22062,21965,22001,22503,22848,23476,24699,25946,25981,25743,26109,26352,25566,25275,25255,25519,24753,24119,23636,23371,23139,22883,22677,22514,22356,22197,22035,21887,21772,21691,21643,21627,21644,21695,21782,21919,22084,22263,22441,22611,22752,22866,22938,22950]
["All","20",25510,24780,24276,23730,23172,23955,24704,25286,25889,27003,27472,26649,27508,28397,28707,28122,28041,27676,27489,26461,26019,25113,25650,24371,23312,23172,21919,22151,22105,22733,22812,22505,24662,24284,25128,25349,25228,25236,24856,24714,24852,24027,23709,23992,23460,23387,23101,22944,22591,22118,21363,21259,21280,21770,22081,22686,23872,25065,25086,24855,25213,25447,24681,24409,24393,24653,23909,23301,22839,22585,22363,22116,21919,21762,21611,21459,21304,21163,21052,20976,20930,20917,20935,20984,21069,21202,21362,21534,21705,21869,22004,22114,22183]
["All","21",25092,24340,23360,23239,22730,22780,23360,24212,25053,25526,26217,26173,25559,26368,27176,27473,26924,26411,26199,26192,25491,26056,25184,25426,24044,23073,22936,21890,21701,21877,22661,22751,22426,24277,24209,25046,25309,25322,25227,24921,24740,24636,24481,23676,23826,23223,23033,23061,22703,22355,21873,21111,20991,21012,21479,21781,22379,23548,24722,24737,24511,24864,25097,24339,24074,24058,24317,23583,22985,22532,22282,22063,21819,21627,21471,21324,21174,21024,20882,20773,20700,20655,20643,20664,20712,20794,20924,21084,21256,21422,21585,21718,21826]
["All","22",24351,23911,22912,22328,22239,22333,22197,22869,23996,24705,24732,25568,25665,25166,25983,26672,26974,26179,25643,25538,25896,25724,26246,25188,25058,24104,23003,22691,21674,21570,21943,22561,22698,22524,24292,24328,25308,25519,25628,25324,24866,24835,24666,24508,23838,23785,23217,23068,23040,22683,22317,21817,21037,20920,20920,21384,21686,22282,23443,24612,24626,24403,24755,24986,24232,23968,23954,24211,23482,22885,22437,22187,21969,21728,21536,21382,21237,21086,20938,20796,20687,20617,20572,20559,20582,20628,20709,20838,20999,21171,21336,21498,21630]
["All","23",23390,23183,22497,21888,21342,21857,21750,21717,22653,23643,23898,24248,25297,25413,25066,25853,26419,26460,25775,25193,25458,25978,25651,25971,24660,24802,23825,22673,22019,21325,21115,21982,22544,22868,22893,24554,24781,25540,25648,25682,25163,25077,24715,24672,24637,23815,23745,23337,23154,23128,22748,22360,21837,21060,20921,20924,21386,21687,22280,23443,24610,24620,24398,24751,24980,24229,23966,23954,24209,23480,22888,22442,22191,21974,21734,21541,21387,21243,21094,20946,20803,20695,20626,20581,20567,20590,20637,20719,20848,21009,21181,21344,21507]
["All","24",22578,22229,21777,21466,20901,20966,21281,21261,21507,22303,22825,23525,24070,25123,25311,25094,25832,26008,26168,25566,25194,25894,26241,25656,25809,24755,24792,23561,22315,21868,20963,21307,21976,22977,23283,23455,24963,25041,25744,25630,25425,25295,24625,24689,24781,24534,23562,23581,23371,23189,23141,22739,22330,21811,21012,20878,20880,21340,21640,22233,23394,24554,24564,24343,24695,24924,24176,23915,23904,24158,23428,22841,22395,22147,21932,21692,21499,21346,21203,21055,20905,20765,20658,20588,20544,20531,20554,20601,20682,20812,20973,21142,21306]
["All","25",21002,22268,21666,21201,20804,20459,20178,20497,20493,20722,21543,21820,22711,23256,24371,24602,24451,24879,25057,25276,24990,24724,25238,25627,25077,25581,24489,24491,22954,21932,21776,21129,21483,22210,23391,23670,24080,25269,25273,25597,25348,25229,24800,24555,24588,24714,24460,23565,23576,23366,23165,23095,22671,22265,21725,20930,20797,20800,21259,21558,22150,23308,24465,24473,24251,24604,24833,24089,23829,23819,24072,23345,22758,22314,22068,21854,21615,21421,21270,21127,20979,20830,20690,20585,20515,20470,20457,20480,20527,20608,20738,20899,21067]
["All","26",20602,20847,21927,21350,20790,20559,20172,19953,20327,20326,20485,21309,21830,22718,23212,24360,24561,24350,24822,24938,25424,25468,25132,25463,25550,25357,25675,24557,24167,22939,21666,21955,21331,21620,22554,23918,24415,24571,25276,25195,25312,25205,25009,24851,24606,24620,24729,24544,23625,23634,23406,23186,23096,22674,22248,21710,20914,20782,20785,21245,21544,22135,23293,24448,24456,24234,24588,24818,24075,23815,23805,24058,23331,22745,22303,22056,21844,21606,21411,21260,21117,20970,20820,20681,20577,20506,20463,20449,20472,20520,20599,20731,20892]
["All","27",20764,20439,20502,21620,20928,20552,20273,19952,19787,20163,20085,20238,21253,21811,22687,23130,24259,24321,24284,24763,24986,25872,25733,25445,25582,25827,25540,25688,24415,24084,22710,21973,22034,21506,21930,23109,24624,24914,24674,25015,24955,25298,24975,25001,24945,24657,24706,24855,24657,23738,23730,23485,23249,23159,22720,22294,21758,20960,20828,20830,21291,21588,22181,23341,24496,24503,24284,24636,24866,24127,23864,23855,24107,23380,22794,22352,22107,21895,21656,21461,21310,21167,21020,20870,20732,20628,20557,20514,20500,20522,20569,20651,20782]
["All","28",20560,20600,20094,20188,21201,20685,20269,20053,19779,19620,19919,19762,20055,21107,21719,22585,22941,23910,24062,24179,24819,25337,26063,25850,25389,25746,25865,25382,25479,24448,24077,22850,22161,22015,21846,22352,23610,25093,25220,24785,24724,24850,25031,25033,25012,24980,24686,24866,24971,24772,23835,23810,23549,23313,23207,22769,22343,21807,21008,20875,20876,21339,21636,22232,23393,24548,24557,24338,24690,24922,24183,23918,23909,24161,23432,22846,22405,22158,21945,21708,21514,21361,21218,21072,20920,20782,20676,20606,20563,20549,20572,20621,20701]
["All","29",18572,20394,20254,19779,19781,20959,20401,20052,19892,19613,19366,19675,19657,19949,21044,21709,22519,22681,23710,23926,24325,25194,25507,26271,25868,25718,25894,25793,25190,25316,24372,24334,23104,22220,22261,22125,22862,23929,25265,25287,24658,24550,24670,24942,25174,25075,25046,24733,24970,25076,24862,23909,23868,23607,23355,23249,22810,22384,21846,21049,20914,20914,21378,21676,22273,23435,24592,24603,24385,24737,24971,24232,23966,23956,24207,23480,22891,22449,22201,21988,21750,21555,21403,21259,21113,20963,20825,20718,20648,20605,20591,20613,20664]
["All","30",17689,18250,19835,19663,19160,19299,20546,20064,19771,19655,19449,19195,19680,19703,19993,21134,21797,22458,22620,23675,24085,24565,25332,25623,26203,26041,25830,25884,25539,25155,25247,24571,24493,23117,22433,22531,22522,23164,24092,25327,25296,24619,24411,24651,25024,25211,25200,25222,24845,25083,25176,24946,23978,23936,23663,23409,23303,22864,22439,21901,21101,20967,20965,21430,21729,22328,23489,24649,24660,24444,24795,25031,24291,24025,24015,24266,23538,22949,22507,22260,22046,21807,21609,21457,21314,21169,21018,20879,20773,20703,20659,20646,20669]
["All","31",17726,17621,18063,19669,19467,19000,19214,20415,19958,19673,19601,19359,19200,19763,19814,20101,21230,21826,22503,22636,23836,24292,24680,25375,25688,26399,26016,25958,25771,25572,25119,25307,24604,24466,23427,22664,22939,22758,23281,24113,25327,25170,24486,24415,24700,25022,25351,25422,25347,24970,25197,25274,25031,24064,24007,23735,23479,23373,22935,22509,21970,21171,21034,21033,21498,21798,22398,23560,24722,24736,24519,24870,25106,24366,24100,24091,24342,23613,23023,22582,22333,22121,21879,21680,21529,21385,21240,21088,20949,20842,20772,20729,20715]
["All","32",17779,17665,17442,17909,19471,19303,18900,19083,20319,19858,19619,19523,19412,19227,19863,19928,20184,21260,21919,22584,22745,23928,24352,24746,25368,25978,26555,26110,25841,25749,25513,25285,25373,24734,24668,23703,23132,23132,22942,23284,24095,25191,24965,24402,24444,24675,25015,25445,25510,25434,25047,25262,25326,25085,24106,24049,23777,23518,23413,22974,22548,22009,21209,21073,21071,21536,21838,22438,23601,24765,24782,24565,24915,25153,24411,24144,24135,24388,23657,23068,22624,22375,22163,21921,21721,21572,21426,21281,21127,20988,20882,20812,20770]
["All","33",17224,17713,17482,17291,17716,19300,19205,18772,18980,20221,19808,19493,19476,19402,19194,19893,19964,20121,21252,21962,22692,22963,24036,24472,24826,25599,26121,26715,26047,25914,25863,25577,25365,25472,24979,24807,23987,23426,23193,22952,23168,23983,25035,24921,24450,24432,24702,25144,25510,25574,25487,25090,25294,25359,25108,24129,24072,23800,23540,23435,22995,22566,22029,21229,21091,21090,21554,21859,22458,23623,24789,24807,24590,24940,25179,24437,24171,24162,24415,23684,23092,22647,22397,22185,21943,21745,21595,21447,21303,21148,21010,20905,20834]
["All","34",17350,17164,17537,17323,17105,17555,19214,19078,18672,18879,20176,19667,19408,19420,19398,19169,19897,19907,20088,21252,22074,22801,23008,24050,24460,24988,25586,26205,26682,26128,25967,25961,25666,25454,25630,25163,25081,24230,23542,23172,22841,23084,23854,25028,25012,24489,24454,24836,25227,25592,25648,25551,25144,25348,25402,25154,24172,24114,23844,23583,23477,23034,22607,22069,21268,21129,21128,21592,21902,22500,23666,24834,24852,24635,24986,25225,24484,24218,24208,24463,23731,23138,22692,22440,22228,21987,21787,21637,21489,21346,21190,21051,20945]
["All","35",16993,17274,16959,17332,17074,16834,17331,18940,18828,18516,19071,20081,19635,19367,19392,19430,19144,19868,19906,20098,21333,22158,22852,23012,24060,24587,25106,25661,26201,26751,26314,26107,26091,25779,25712,25834,25334,25121,24279,23533,23027,22750,22920,23841,24963,25000,24488,24574,24899,25292,25648,25695,25586,25182,25375,25431,25181,24201,24141,23872,23611,23505,23063,22633,22095,21292,21154,21153,21617,21928,22526,23694,24866,24884,24665,25017,25256,24517,24249,24240,24494,23764,23171,22722,22468,22257,22015,21814,21666,21517,21374,21217,21078]
["All","36",16355,16966,17146,16842,17182,16899,16743,17222,18844,18822,18829,19017,20136,19690,19423,19476,19548,19159,19966,20030,20255,21482,22220,22908,23090,24188,24860,25067,25705,26264,26684,26424,26163,26179,25896,25857,25906,25483,25173,24217,23486,22980,22651,22907,23892,24967,25043,24527,24624,24947,25333,25682,25722,25613,25201,25394,25449,25200,24219,24159,23891,23629,23522,23079,22650,22111,21308,21170,21168,21632,21945,22543,23714,24886,24907,24687,25039,25280,24540,24270,24261,24515,23786,23192,22744,22488,22277,22036,21834,21685,21535,21393,21235]
["All","37",16136,16328,16840,17031,16704,17010,16798,16633,17124,18827,19134,18751,18945,20132,19710,19429,19504,19552,19147,20025,20147,20381,21549,22220,22924,23191,24308,24806,25068,25736,26479,26712,26441,26215,26311,26057,25992,25970,25478,25081,24193,23448,22802,22646,22878,23987,24951,25117,24582,24679,24996,25375,25716,25758,25639,25227,25421,25476,25230,24248,24185,23917,23657,23549,23106,22675,22135,21332,21193,21192,21657,21971,22569,23742,24915,24939,24718,25070,25313,24572,24301,24293,24545,23817,23222,22775,22516,22306,22065,21864,21714,21565,21421]
["All","38",16289,16103,16199,16719,16880,16528,16907,16698,16532,17108,19138,18986,18686,18851,20101,19686,19389,19423,19531,19116,20076,20230,20429,21563,22208,23053,23312,24239,24793,25070,25617,26536,26796,26599,26321,26452,26205,26009,26035,25460,25064,24100,23336,22746,22707,22884,24023,25032,25164,24628,24717,25027,25400,25744,25777,25658,25247,25441,25498,25251,24270,24205,23939,23679,23569,23125,22696,22157,21352,21212,21212,21678,21992,22589,23765,24940,24965,24744,25096,25339,24600,24328,24320,24570,23844,23249,22800,22541,22332,22091,21889,21739,21589]
["All","39",16164,16261,15977,16080,16569,16712,16433,16792,16608,16515,17390,19032,18956,18671,18817,20129,19718,19370,19434,19593,19176,20187,20275,20485,21587,22281,23195,23298,24213,24861,25130,25627,26516,26837,26634,26433,26571,26302,26045,26039,25440,24944,24048,23334,22768,22723,22916,24086,25077,25209,24668,24749,25054,25429,25766,25799,25680,25269,25465,25520,25272,24293,24227,23962,23701,23592,23148,22719,22180,21375,21236,21235,21700,22016,22615,23789,24965,24992,24771,25123,25366,24630,24356,24348,24597,23873,23278,22826,22568,22359,22118,21917,21764]
["All","40",16560,16031,16004,15716,15795,16266,16489,16206,16587,16428,16320,17301,18976,18916,18673,18792,20153,19715,19369,19458,19678,19246,20217,20255,20488,21639,22247,23148,23274,24171,25005,25051,25648,26526,26896,26605,26494,26704,26263,25983,26015,25390,24874,24022,23313,22787,22769,22975,24129,25123,25251,24703,24777,25082,25451,25787,25822,25703,25293,25487,25543,25297,24317,24250,23987,23723,23616,23172,22745,22204,21400,21259,21258,21724,22040,22640,23814,24993,25020,24799,25151,25395,24659,24384,24376,24627,23904,23306,22855,22597,22387,22146,21945]
["All","41",16524,16536,15932,15932,15608,15662,16190,16400,16125,16522,16329,16242,17275,18940,18899,18693,18778,20173,19747,19401,19538,19668,19282,20251,20282,20595,21697,22295,23168,23205,24200,24982,25050,25718,26612,26935,26671,26593,26640,26310,25996,25988,25253,24863,23960,23294,22792,22803,23001,24154,25148,25269,24714,24789,25089,25456,25793,25828,25713,25302,25496,25552,25307,24328,24259,23997,23732,23626,23181,22755,22214,21410,21269,21268,21735,22051,22651,23825,25004,25033,24813,25164,25409,24674,24399,24391,24642,23920,23323,22870,22613,22402,22160]
["All","42",16349,16487,16424,15856,15818,15478,15584,16091,16321,16053,16418,16187,16173,17218,18869,18861,18675,18707,20160,19765,19430,19635,19637,19294,20276,20348,20628,21756,22264,23153,23321,24219,24963,25102,25808,26680,27082,26733,26627,26646,26278,25932,25846,25217,24882,23960,23302,22873,22828,23025,24172,25162,25276,24723,24792,25093,25460,25797,25833,25719,25308,25501,25559,25315,24335,24266,24005,23739,23634,23189,22763,22222,21419,21279,21278,21745,22061,22661,23834,25014,25046,24824,25177,25422,24686,24412,24406,24656,23933,23338,22884,22628,22417]
["All","43",16288,16319,16382,16343,15734,15666,15382,15492,16012,16255,15947,16325,16095,16119,17172,18830,18809,18657,18653,20169,19823,19464,19641,19588,19283,20322,20384,20682,21746,22297,23294,23299,24178,24966,25160,25826,26738,27083,26715,26641,26624,26209,25785,25776,25251,24860,23935,23304,22896,22849,23040,24181,25164,25281,24725,24793,25095,25461,25798,25834,25721,25313,25504,25562,25319,24341,24270,24010,23744,23640,23194,22770,22229,21425,21287,21286,21752,22069,22669,23843,25023,25054,24834,25188,25433,24695,24423,24416,24667,23944,23351,22898,22640]
["All","44",16938,16254,16212,16289,16221,15587,15570,15280,15400,15931,16139,15839,16237,15984,16055,17117,18764,18734,18630,18590,20180,19816,19454,19660,19566,19324,20333,20419,20698,21754,22398,23234,23261,24139,24991,25232,25903,26794,27093,26723,26631,26589,26119,25750,25797,25254,24860,23960,23316,22907,22854,23041,24177,25160,25274,24718,24786,25088,25453,25791,25828,25715,25307,25500,25557,25314,24339,24265,24007,23743,23638,23192,22769,22229,21425,21287,21286,21751,22069,22669,23843,25025,25058,24837,25191,25437,24697,24425,24419,24671,23949,23357,22904]
["All","45",16668,16750,15978,15979,16060,16000,15431,15404,15135,15276,15853,16042,15786,16175,15905,16021,17053,18701,18700,18641,18602,20220,19840,19464,19674,19578,19376,20334,20460,20732,21857,22374,23199,23251,24190,25020,25351,25997,26806,27125,26705,26577,26571,26091,25778,25761,25251,24920,23978,23332,22921,22862,23046,24180,25159,25273,24719,24787,25089,25455,25794,25831,25719,25312,25504,25560,25318,24345,24271,24014,23751,23646,23199,22777,22237,21434,21296,21296,21760,22078,22680,23852,25036,25069,24848,25202,25448,24708,24437,24433,24684,23962,23372]
["All","46",16351,16519,16537,15847,15834,15899,15877,15304,15313,15060,15243,15770,15974,15738,16129,15839,15983,17004,18662,18690,18670,18623,20215,19791,19503,19693,19589,19424,20332,20498,20538,21772,22328,23164,23287,24159,25073,25422,26050,26789,27142,26699,26565,26577,26074,25740,25734,25226,24928,23985,23335,22922,22857,23041,24171,25150,25266,24712,24779,25082,25449,25788,25824,25713,25307,25498,25555,25314,24344,24268,24012,23749,23645,23198,22777,22237,21435,21299,21300,21762,22082,22683,23853,25039,25074,24853,25206,25453,24713,24441,24438,24688,23967]
["All","47",16722,16212,16317,16388,15696,15672,15774,15747,15199,15241,15026,15137,15701,15914,15671,16060,15759,15924,16947,18617,18682,18633,18602,20220,19761,19559,19713,19595,19462,20310,20596,20472,21734,22333,23177,23342,24170,25094,25435,26067,26738,27074,26598,26516,26585,26037,25761,25723,25227,24926,23982,23330,22914,22847,23027,24158,25136,25252,24700,24766,25070,25437,25777,25813,25702,25297,25487,25548,25307,24337,24262,24006,23744,23640,23192,22773,22233,21433,21297,21299,21760,22081,22682,23851,25037,25075,24853,25208,25454,24714,24442,24440,24689]
["All","48",16923,16566,15995,16157,16214,15513,15548,15623,15636,15112,15201,14943,15061,15648,15858,15629,16003,15679,15859,16910,18574,18685,18639,18591,20204,19777,19591,19690,19541,19490,20484,20558,20461,21687,22324,23196,23439,24177,25109,25448,26091,26682,27072,26563,26497,26551,26039,25773,25727,25231,24927,23979,23325,22911,22838,23019,24150,25128,25244,24692,24760,25064,25429,25772,25808,25698,25294,25485,25547,25306,24337,24261,24005,23744,23642,23194,22775,22236,21437,21302,21305,21765,22085,22689,23856,25041,25081,24860,25214,25462,24722,24449,24448]
["All","49",17432,16773,16353,15844,15990,16024,15364,15395,15500,15542,15063,15135,14891,15003,15600,15814,15570,15939,15601,15823,16895,18586,18693,18609,18608,20223,19794,19600,19694,19481,19420,20402,20522,20457,21655,22337,23232,23457,24148,25089,25413,26042,26616,27009,26534,26458,26537,26074,25770,25724,25226,24917,23967,23314,22897,22826,23008,24138,25114,25231,24681,24749,25053,25418,25762,25798,25689,25286,25475,25540,25300,24331,24255,24001,23740,23639,23193,22775,22236,21438,21302,21306,21765,22085,22689,23855,25042,25082,24862,25217,25465,24725,24453]
["All","50",17791,17139,16410,16077,15569,15719,15806,15164,15263,15380,15427,14954,15034,14783,14874,15506,15716,15457,15832,15480,15733,16883,18529,18663,18547,18626,20183,19779,19599,19672,19536,19386,20314,20450,20460,21625,22346,23239,23433,24095,25022,25362,25969,26561,26967,26483,26415,26526,26055,25750,25702,25202,24891,23942,23285,22872,22802,22984,24113,25087,25207,24658,24725,25030,25395,25742,25775,25667,25266,25456,25522,25282,24314,24239,23986,23724,23625,23182,22764,22225,21427,21291,21296,21754,22075,22679,23846,25031,25072,24854,25208,25458,24719]
["All","51",17694,17516,16805,16136,15859,15361,15546,15616,15044,15157,15269,15345,14887,14977,14707,14787,15447,15646,15384,15766,15418,15683,16855,18481,18629,18541,18594,20153,19734,19594,19692,19492,19348,20199,20410,20484,21615,22337,23223,23392,24055,24958,25311,25937,26501,26941,26392,26359,26495,26024,25717,25667,25166,24856,23904,23249,22839,22769,22950,24080,25054,25174,24627,24693,24998,25365,25712,25746,25638,25239,25428,25495,25257,24290,24214,23961,23702,23603,23163,22744,22206,21409,21273,21279,21737,22059,22663,23828,25015,25057,24841,25194,25445]
["All","52",16139,17395,17160,16563,15897,15622,15170,15322,15492,14928,15040,15218,15269,14833,14922,14639,14703,15391,15586,15323,15717,15406,15622,16798,18413,18603,18493,18594,20097,19701,19471,19658,19440,19299,20134,20377,20476,21545,22289,23175,23378,24013,24926,25252,25879,26462,26878,26376,26325,26457,25987,25678,25626,25127,24816,23865,23212,22803,22734,22915,24045,25017,25139,24595,24659,24965,25335,25681,25715,25608,25211,25399,25468,25229,24265,24190,23937,23680,23581,23143,22725,22189,21390,21255,21262,21720,22043,22645,23810,24999,25042,24826,25178]
["All","53",14567,15826,17030,16897,16282,15641,15408,14958,15182,15365,14797,14948,15181,15196,14783,14851,14557,14614,15325,15524,15295,15707,15364,15545,16743,18407,18562,18433,18566,20043,19518,19428,19609,19373,19262,20050,20317,20441,21484,22231,23089,23297,23917,24870,25218,25805,26401,26815,26336,26282,26413,25942,25630,25581,25083,24771,23823,23172,22764,22697,22879,24006,24979,25100,24558,24623,24928,25299,25644,25681,25574,25178,25367,25437,25199,24238,24162,23910,23654,23556,23119,22702,22167,21370,21235,21241,21700,22025,22628,23790,24980,25022,24808]
["All","54",14645,14276,15484,16740,16623,16022,15401,15180,14831,15008,15202,14646,14827,15097,15067,14679,14730,14411,14463,15208,15419,15285,15649,15302,15472,16699,18379,18510,18346,18511,20128,19471,19381,19529,19330,19254,19990,20268,20380,21406,22169,23029,23263,23865,24822,25151,25736,26341,26765,26285,26230,26359,25889,25578,25528,25032,24723,23778,23128,22722,22656,22838,23964,24936,25059,24519,24584,24889,25260,25605,25643,25538,25143,25332,25404,25166,24206,24132,23881,23625,23528,23093,22679,22145,21350,21214,21221,21679,22006,22608,23769,24959,25001]
["All","55",15100,14349,13928,15157,16435,16378,15772,15168,15012,14703,15100,15103,14578,14771,15033,14984,14607,14646,14317,14355,15145,15374,15251,15602,15248,15456,16678,18326,18465,18249,18471,20037,19404,19359,19461,19262,19162,19917,20191,20344,21309,22097,22924,23194,23800,24736,25094,25656,26284,26704,26225,26169,26297,25830,25518,25469,24976,24668,23725,23079,22674,22610,22792,23918,24888,25012,24474,24539,24844,25216,25561,25599,25498,25105,25292,25365,25128,24172,24097,23849,23594,23497,23063,22651,22117,21325,21189,21197,21655,21983,22585,23742,24932]
["All","56",15878,14827,14035,13685,14900,16165,16124,15529,14968,14848,14762,15008,15008,14520,14695,14983,14891,14521,14551,14223,14266,15100,15318,15169,15522,15211,15388,16593,18250,18390,17979,18408,19955,19371,19320,19399,19216,19112,19820,20080,20277,21207,21997,22823,23108,23691,24666,25036,25588,26211,26630,26153,26096,26225,25758,25449,25401,24910,24603,23666,23021,22617,22555,22738,23862,24830,24956,24420,24484,24789,25162,25507,25547,25447,25056,25244,25318,25082,24129,24054,23808,23555,23459,23025,22615,22082,21292,21157,21164,21623,21951,22553,23709]
["All","57",15718,15575,14484,13768,13432,14643,15888,15819,15334,14801,14906,14643,14915,14898,14412,14590,14892,14753,14432,14430,14131,14227,15033,15247,15091,15488,15145,15292,16499,18184,18343,17956,18358,19863,19310,19286,19321,19132,19037,19682,19973,20191,21097,21900,22757,22987,23591,24589,24958,25502,26124,26541,26066,26011,26139,25676,25367,25321,24834,24530,23597,22956,22552,22492,22676,23797,24764,24890,24358,24422,24728,25099,25445,25488,25388,24999,25187,25262,25027,24078,24004,23758,23506,23412,22981,22573,22041,21253,21119,21126,21585,21912,22515]
["All","58",15714,15381,15202,14192,13504,13156,14384,15610,15594,15130,14824,14754,14496,14816,14767,14297,14453,14738,14611,14308,14318,14089,14143,14937,15167,15045,15416,15092,15199,16408,18225,18295,17911,18294,19757,19249,19209,19234,19037,18951,19559,19893,20111,21030,21792,22655,22895,23516,24498,24863,25404,26025,26439,25969,25913,26042,25582,25277,25232,24748,24445,23518,22881,22479,22420,22605,23723,24689,24816,24287,24352,24658,25030,25376,25420,25321,24934,25121,25197,24963,24018,23946,23700,23449,23358,22929,22523,21993,21209,21074,21081,21538,21868]
["All","59",15297,15354,14988,14870,13907,13252,12911,14104,15364,15406,15172,14677,14640,14378,14705,14630,14147,14311,14639,14474,14216,14246,14015,14056,14827,15120,14944,15339,14994,15084,16283,18100,18205,17862,18215,19633,19172,19113,19160,18912,18812,19460,19773,20044,20888,21691,22567,22799,23419,24393,24756,25294,25915,26329,25861,25805,25936,25479,25177,25134,24653,24353,23431,22797,22400,22343,22528,23643,24605,24733,24208,24275,24579,24951,25298,25343,25246,24861,25048,25126,24895,23953,23881,23636,23387,23296,22872,22467,21938,21158,21024,21033,21490]
["All","60",15851,15565,15585,15227,15159,14118,13539,13119,14285,15149,15364,14993,14522,14512,14247,14590,14485,14035,14200,14547,14390,14141,14139,13917,13972,14748,15051,14841,15251,14903,14962,16135,17988,18100,17830,18095,19471,19037,19015,19052,18802,18691,19322,19675,19880,20744,21542,22390,22676,23289,24259,24621,25157,25778,26191,25726,25672,25805,25351,25053,25011,24535,24237,23321,22689,22298,22241,22427,23540,24497,24626,24106,24175,24478,24849,25197,25245,25150,24766,24954,25032,24804,23867,23793,23549,23304,23215,22791,22389,21864,21088,20955,20966]
["All","61",15324,15696,15287,15289,15015,14812,13913,13237,12870,13627,15137,15146,14805,14368,14386,14096,14455,14336,13888,14070,14428,14259,13997,13989,13811,13908,14627,14955,14752,15087,14784,14858,16050,17866,18045,17762,18024,19305,18949,18932,18938,18686,18588,19217,19510,19739,20636,21424,22254,22533,23146,24109,24470,25004,25623,26037,25576,25524,25658,25210,24915,24876,24404,24108,23200,22572,22185,22130,22316,23425,24377,24509,23994,24063,24365,24737,25085,25134,25040,24659,24847,24927,24701,23769,23697,23454,23211,23124,22702,22302,21782,21009,20878]
["All","62",14949,15121,15377,14975,15087,14631,14560,13570,12957,12222,13558,14906,14956,14656,14257,14260,13985,14337,14209,13739,13942,14285,14131,13860,13814,13674,13828,14468,14835,14630,14894,14685,14750,15954,17725,17941,17645,17886,19143,18858,18778,18811,18601,18446,19037,19347,19629,20483,21288,22107,22385,22996,23954,24314,24846,25465,25879,25422,25374,25509,25064,24775,24737,24268,23978,23075,22452,22069,22015,22200,23308,24256,24389,23879,23949,24250,24623,24971,25021,24928,24552,24739,24821,24597,23671,23601,23360,23118,23032,22612,22216,21700,20930]
["All","63",14372,14709,14772,15008,14713,14676,14345,14196,13245,12302,12123,13285,14631,14734,14441,14035,14068,13806,14191,14020,13572,13775,14091,13929,13713,13702,13555,13749,14303,14706,14594,14764,14551,14608,15854,17547,17791,17562,17769,18955,18732,18643,18685,18496,18318,18921,19194,19448,20340,21137,21950,22229,22835,23787,24149,24679,25296,25709,25258,25212,25348,24910,24624,24588,24124,23839,22944,22325,21945,21892,22080,23183,24128,24263,23757,23827,24129,24501,24851,24902,24811,24438,24624,24707,24486,23568,23498,23259,23020,22936,22519,22124,21612]
["All","64",14002,14130,14360,14395,14739,14265,14410,13932,13877,12532,12149,11873,13035,14400,14530,14210,13817,13873,13627,14047,13850,13386,13593,13862,13775,13590,13524,13414,13595,14139,14509,14453,14630,14424,14458,15716,17359,17654,17455,17597,18779,18597,18448,18490,18333,18169,18777,19032,19299,20180,20974,21782,22061,22663,23610,23972,24499,25116,25530,25085,25041,25177,24746,24464,24432,23971,23691,22803,22191,21815,21762,21951,23049,23992,24127,23627,23700,24000,24372,24723,24774,24685,24316,24503,24587,24370,23457,23388,23151,22915,22834,22419,22026]
["All","65",13012,13204,13240,13472,13534,13816,13420,13494,13129,13157,12444,11896,11642,12757,14151,14257,13988,13569,13669,13398,13884,13649,13201,13370,13625,13596,13394,13378,13259,13433,14053,14329,14272,14474,14256,14304,15536,17157,17508,17337,17431,18567,18397,18228,18297,18122,18018,18587,18863,19122,19997,20788,21588,21867,22466,23408,23771,24295,24909,25323,24886,24844,24980,24557,24280,24250,23795,23519,22638,22033,21661,21613,21803,22895,23833,23969,23475,23550,23850,24222,24570,24625,24538,24172,24360,24445,24231,23325,23256,23023,22789,22710,22298]
["All","66",12452,12611,12799,12845,13110,13136,13423,13019,13099,12833,13087,12128,11644,11387,12479,13845,13985,13730,13351,13461,13193,13669,13431,12956,13121,13410,13406,13197,13164,13109,13268,13838,14124,14087,14290,14087,14134,15340,16943,17338,17192,17258,18384,18199,18048,18119,17951,17829,18410,18678,18934,19803,20587,21383,21662,22258,23194,23558,24079,24692,25106,24676,24636,24774,24357,24086,24058,23608,23336,22465,21867,21500,21454,21644,22730,23663,23800,23313,23389,23690,24060,24410,24467,24383,24021,24210,24296,24085,23186,23118,22890,22658,22580]
["All","67",11865,12091,12245,12402,12445,12693,12741,13016,12637,12742,12697,12726,11811,11358,11131,12127,13558,13677,13428,13064,13235,12954,13373,13175,12720,12918,13157,13200,12991,12956,12866,13035,13598,13938,13897,14117,13885,13932,15160,16731,17164,16998,17016,18166,17984,17844,17884,17752,17650,18216,18483,18738,19599,20379,21171,21450,22042,22973,23337,23855,24466,24881,24456,24422,24560,24150,23885,23859,23415,23148,22287,21695,21333,21290,21481,22561,23491,23629,23148,23226,23527,23896,24246,24305,24224,23866,24057,24145,23935,23043,22978,22754,22525]
["All","68",11302,11419,11651,11824,11990,12040,12220,12321,12640,12244,12576,12351,12392,11493,11078,10877,11840,13211,13372,13149,12796,12916,12710,13105,12926,12469,12638,12934,12937,12761,12776,12663,12790,13357,13716,13707,13927,13688,13725,14984,16513,16950,16821,16803,17932,17738,17641,17661,17549,17442,18001,18267,18520,19375,20149,20936,21214,21803,22728,23091,23606,24214,24630,24210,24182,24321,23918,23659,23635,23199,22938,22087,21502,21148,21106,21298,22372,23296,23435,22961,23040,23340,23712,24060,24122,24045,23691,23882,23973,23765,22882,22818,22599]
["All","69",10648,10875,10999,11208,11406,11581,11563,11773,11903,12286,12106,12190,12013,12050,11140,10784,10592,11495,12898,13061,12837,12512,12590,12391,12792,12648,12196,12354,12626,12685,12581,12505,12414,12589,13106,13512,13479,13715,13494,13501,14751,16279,16697,16575,16552,17670,17490,17417,17430,17312,17207,17761,18026,18278,19124,19891,20672,20950,21534,22453,22816,23326,23931,24345,23936,23911,24052,23657,23404,23383,22954,22700,21860,21285,20936,20898,21091,22157,23074,23215,22750,22830,23128,23501,23848,23912,23838,23489,23683,23774,23569,22700,22636]
["All","70",10534,10225,10461,10550,10754,10929,11097,11096,11316,11493,12040,11749,11857,11680,11705,10821,10522,10300,11169,12532,12778,12483,12131,12258,12077,12469,12361,11894,12045,12321,12477,12311,12233,12166,12356,12865,13245,13244,13516,13244,13291,14542,16010,16417,16285,16272,17368,17204,17162,17168,17054,16954,17502,17764,18014,18853,19613,20387,20665,21244,22155,22517,23023,23627,24040,23639,23618,23761,23375,23127,23111,22689,22442,21615,21049,20706,20672,20866,21924,22833,22976,22519,22600,22897,23270,23618,23684,23613,23271,23465,23559,23358,22500]
["All","71",10157,10041,9751,9986,10062,10278,10436,10619,10591,10855,11221,11585,11345,11461,11278,11342,10474,10166,9964,10817,12195,12376,12076,11783,11878,11725,12069,12005,11600,11760,12053,12206,11993,11985,11888,12130,12606,12971,12956,13271,12957,13055,14286,15752,16116,16013,16028,17076,16931,16881,16890,16780,16683,17224,17485,17734,18565,19318,20083,20362,20938,21839,22200,22702,23303,23716,23325,23308,23454,23076,22835,22822,22408,22169,21356,20800,20463,20433,20627,21677,22578,22723,22274,22358,22654,23026,23375,23442,23375,23038,23233,23328,23135]
["All","72",9366,9671,9573,9294,9500,9573,9801,9943,10144,10157,10626,10755,11104,10893,11047,10858,10912,10073,9838,9595,10395,11804,11973,11665,11374,11535,11362,11710,11663,11277,11417,11701,11849,11664,11688,11592,11857,12303,12672,12659,13025,12684,12833,13998,15449,15776,15702,15756,16776,16627,16579,16591,16486,16394,16927,17188,17436,18257,19002,19758,20037,20609,21499,21861,22358,22955,23367,22985,22973,23121,22753,22519,22511,22107,21875,21075,20531,20200,20175,20370,21411,22303,22451,22010,22096,22392,22762,23110,23180,23117,22787,22982,23081]
["All","73",8662,8811,9144,9080,8868,8962,9071,9290,9421,9643,9877,10122,10258,10631,10429,10573,10386,10436,9698,9445,9234,10044,11352,11497,11257,10973,11149,11001,11321,11301,10979,11044,11362,11487,11350,11413,11327,11581,11994,12384,12348,12727,12408,12598,13706,15105,15460,15376,15446,16438,16294,16252,16266,16166,16079,16605,16864,17113,17921,18656,19402,19681,20248,21128,21489,21981,22572,22984,22611,22605,22755,22399,22171,22169,21776,21551,20766,20235,19912,19891,20087,21118,21999,22150,21718,21806,22101,22470,22819,22890,22832,22511,22704]
["All","74",8253,8185,8356,8598,8566,8335,8400,8561,8787,8912,9364,9350,9625,9804,10101,9959,10097,9943,10021,9262,9078,8880,9661,10894,11028,10818,10528,10673,10623,10923,10946,10598,10701,10974,11115,11013,11055,11011,11292,11694,12079,12046,12448,12138,12250,13400,14720,15067,15038,15099,16072,15938,15899,15918,15822,15739,16259,16516,16764,17560,18285,19022,19298,19860,20727,21088,21574,22160,22571,22209,22208,22359,22017,21797,21800,21417,21199,20432,19914,19600,19582,19780,20799,21671,21823,21401,21491,21786,22154,22502,22574,22521,22208]
["All","75",7922,7651,7610,7756,7938,8074,7787,7841,8053,8217,8478,8855,8883,9172,9296,9547,9505,9613,9527,9519,8862,8646,8472,9219,10419,10539,10345,10093,10204,10226,10481,10540,10189,10335,10526,10735,10641,10724,10694,10980,11323,11721,11719,12155,11769,11920,13036,14310,14697,14661,14725,15679,15554,15520,15541,15451,15374,15886,16142,16387,17171,17886,18610,18885,19443,20295,20655,21135,21716,22123,21774,21779,21932,21603,21392,21399,21027,20820,20071,19566,19262,19248,19447,20453,21315,21469,21058,21151,21445,21810,22158,22233,22185]
["All","76",7164,7300,7059,7008,7173,7334,7515,7216,7286,7503,7836,7982,8320,8378,8628,8754,8989,8984,9153,9042,9051,8433,8253,8027,8781,9962,10048,9893,9617,9691,9939,10033,10150,9765,9950,10129,10356,10286,10329,10342,10677,10943,11334,11392,11760,11432,11578,12667,13918,14284,14254,14322,15256,15138,15110,15133,15050,14979,15483,15736,15980,16751,17453,18164,18438,18989,19828,20186,20658,21235,21639,21302,21314,21469,21152,20951,20964,20604,20407,19676,19186,18893,18883,19083,20076,20925,21082,20683,20779,21072,21435,21782,21861]
["All","77",6399,6573,6738,6475,6412,6592,6774,6958,6654,6725,7136,7315,7513,7796,7869,8063,8237,8470,8512,8650,8584,8562,7954,7826,7630,8300,9419,9480,9408,9145,9083,9501,9595,9687,9376,9517,9683,9914,9902,10008,9976,10313,10562,10958,10974,11373,11049,11192,12281,13484,13842,13820,13891,14800,14692,14669,14697,14620,14555,15049,15297,15539,16298,16988,17684,17959,18503,19325,19683,20148,20716,21118,20795,20813,20970,20667,20477,20495,20147,19961,19251,18774,18494,18489,18690,19667,20504,20662,20277,20376,20667,21027,21376]
["All","78",5798,5823,6026,6142,5891,5876,6030,6222,6434,6147,6425,6609,6839,7007,7291,7366,7587,7755,7960,7964,8116,8082,8058,7460,7369,7188,7838,8921,8941,8847,8908,8632,9026,9131,9165,8952,9076,9272,9493,9515,9622,9573,9917,10164,10582,10599,11005,10620,10813,11853,13021,13372,13356,13430,14315,14213,14195,14228,14157,14100,14583,14827,15068,15811,16488,17169,17443,17980,18784,19141,19597,20158,20557,20248,20273,20432,20144,19965,19988,19654,19479,18790,18328,18061,18061,18263,19226,20049,20209,19837,19939,20229,20587]
["All","79",5047,5235,5290,5431,5552,5384,5295,5503,5693,5901,5834,5926,6066,6340,6597,6736,6873,7059,7207,7353,7461,7595,7537,7511,6989,6926,6716,7396,8401,8394,8340,8411,8167,8499,8636,8712,8475,8640,8816,9067,9108,9230,9144,9525,9726,10168,10130,10555,10217,10392,11395,12524,12867,12857,12934,13793,13699,13686,13724,13660,13611,14082,14322,14561,15286,15948,16614,16885,17413,18200,18552,18999,19552,19947,19653,19686,19846,19575,19407,19437,19118,18954,18290,17846,17592,17597,17799,18745,19553,19714,19357,19463,19751]
["All","80",4528,4563,4786,4841,4877,5025,4882,4814,4931,5148,5740,5287,5435,5552,5853,6141,6282,6326,6572,6626,6863,6929,7024,6982,6987,6500,6458,6288,6962,7839,7697,7801,7889,7718,7981,8108,8170,8026,8170,8366,8654,8676,8797,8717,9048,9270,9696,9656,10105,9769,9939,10901,11991,12325,12321,12401,13232,13149,13141,13183,13125,13084,13545,13780,14016,14721,15365,16015,16283,16800,17567,17915,18353,18897,19287,19010,19050,19210,18957,18801,18839,18535,18385,17748,17321,17080,17091,17294,18222,19013,19174,18834,18943]
["All","81",4083,4060,4128,4329,4304,4368,4488,4383,4280,4414,5002,5248,4792,4933,5076,5322,5730,5751,5785,6012,6085,6332,6416,6478,6477,6446,6001,5990,5826,6463,7568,7130,7266,7349,7211,7460,7557,7664,7585,7712,7908,8183,8182,8377,8225,8600,8788,9176,9197,9612,9297,9464,10383,11428,11751,11754,11837,12637,12564,12561,12608,12558,12524,12973,13202,13436,14120,14745,15375,15639,16145,16890,17234,17661,18195,18580,18321,18368,18530,18295,18152,18197,17909,17772,17162,16756,16530,16548,16751,17657,18429,18591,18270]
["All","82",4151,3639,3647,3668,3845,3813,3891,4013,3849,3736,4219,4470,4772,4338,4467,4610,4871,5278,5239,5261,5489,5573,5792,5816,5904,5962,5917,5523,5453,5365,5904,6963,6617,6732,6792,6720,6959,6996,7107,7140,7263,7436,7685,7710,7868,7790,8113,8278,8688,8692,9089,8797,8960,9834,10831,11142,11151,11237,12003,11941,11945,11996,11954,11928,12362,12584,12815,13476,14081,14692,14951,15444,16165,16504,16920,17442,17819,17579,17634,17797,17581,17451,17504,17234,17110,16530,16147,15938,15962,16164,17047,17797,17961]
["All","83",3091,3644,3174,3186,3214,3376,3310,3412,3496,3379,3584,3790,3972,4310,3909,3985,4189,4398,4929,4678,4771,4975,5054,5237,5274,5373,5376,5411,5000,4936,4871,5428,6374,6092,6173,6301,6233,6367,6454,6624,6589,6796,6920,7164,7195,7418,7280,7571,7783,8153,8160,8538,8269,8427,9252,10198,10498,10512,10599,11330,11277,11287,11342,11309,11291,11710,11926,12152,12788,13373,13962,14214,14693,15388,15722,16125,16633,17005,16784,16846,17011,16814,16697,16758,16506,16396,15849,15490,15298,15328,15530,16388,17115]
["All","84",2627,2625,3217,2728,2742,2785,2880,2871,2929,3031,3225,3196,3377,3501,3896,3534,3588,3749,3962,4641,4185,4330,4499,4508,4662,4743,4824,4829,4859,4500,4423,4433,4934,5765,5578,5636,5781,5739,5825,5908,6126,6129,6290,6436,6598,6665,6884,6727,7059,7243,7590,7602,7958,7713,7864,8639,9529,9816,9837,9925,10618,10575,10591,10650,10624,10614,11017,11226,11446,12054,12617,13182,13430,13893,14560,14887,15276,15769,16134,15932,16002,16167,15991,15889,15957,15725,15630,15118,14783,14608,14645,14846,15675]
["All","85",1985,2209,2245,2793,2297,2324,2400,2446,2433,2540,2951,2982,2987,3070,3174,3278,3391,3426,3597,3702,3765,3769,3814,4020,3974,4146,4194,4299,4264,4272,4119,3939,3995,4461,5218,5094,5107,5262,5235,5274,5365,5570,5540,5798,5921,6081,6136,6310,6214,6504,6681,7003,7020,7354,7131,7275,7997,8829,9100,9127,9216,9867,9834,9855,9917,9899,9898,10282,10484,10699,11278,11814,12353,12596,13044,13679,13994,14368,14847,15203,15023,15100,15266,15111,15024,15100,14889,14808,14330,14021,13865,13907,14108]
["All","86",1711,1610,1868,1873,2374,1932,1945,2032,2039,2052,2448,2493,2530,2560,2642,2799,2891,2865,2974,3111,3260,3379,3338,3372,3541,3541,3626,3682,3767,3716,3790,3690,3459,3564,3963,4643,4552,4600,4694,4749,4793,4835,5029,5031,5281,5359,5496,5534,5766,5661,5933,6100,6396,6415,6727,6528,6664,7330,8101,8356,8388,8476,9083,9058,9084,9148,9139,9146,9510,9704,9913,10460,10968,11479,11715,12141,12744,13049,13406,13866,14210,14053,14136,14302,14170,14098,14181,13992,13927,13486,13206,13069,13118]
["All","87",1228,1379,1309,1508,1487,2035,1574,1586,1647,1676,1991,2038,2086,2144,2176,2293,2422,2406,2459,2548,2653,2829,2984,2882,2933,3095,3030,3111,3164,3272,3225,3321,3230,3042,3161,3516,4103,4051,4105,4195,4300,4285,4284,4515,4484,4782,4753,4902,4995,5188,5097,5348,5504,5774,5795,6083,5907,6036,6643,7349,7587,7623,7711,8270,8254,8284,8350,8349,8364,8705,8891,9093,9606,10082,10565,10791,11195,11762,12056,12394,12835,13166,13032,13122,13286,13177,13120,13209,13043,12994,12594,12342,12223]
["All","88",1018,935,1113,1006,1175,1157,1738,1260,1262,1353,1588,1637,1682,1741,1796,1866,1964,2003,2052,2089,2206,2291,2427,2611,2474,2559,2666,2578,2624,2686,2789,2819,2858,2780,2658,2780,3072,3508,3574,3615,3712,3789,3750,3817,4019,3986,4240,4159,4363,4429,4606,4530,4760,4904,5150,5169,5433,5280,5400,5948,6587,6806,6845,6931,7441,7435,7468,7535,7543,7565,7882,8058,8250,8728,9172,9622,9838,10219,10748,11030,11348,11766,12082,11971,12067,12229,12141,12101,12195,12052,12019,11659,11436]
["All","89",811,788,728,823,756,916,849,1458,965,1011,1263,1295,1337,1382,1443,1523,1572,1609,1688,1712,1796,1895,1917,2050,2268,2109,2182,2238,2124,2139,2293,2391,2383,2453,2392,2310,2374,2607,2954,3144,3165,3194,3344,3245,3314,3522,3486,3677,3654,3812,3874,4034,3971,4178,4308,4529,4548,4785,4655,4765,5254,5825,6025,6066,6149,6608,6610,6647,6714,6729,6757,7049,7215,7396,7837,8247,8662,8868,9222,9713,9981,10278,10670,10971,10882,10983,11141,11074,11050,11147,11028,11009,10691]
["All",90,2264,2224,2246,2058,2030,1953,2010,2139,3109,3233,3900,3989,4166,4275,4446,4526,4609,4757,4772,4722,5502,5807,6103,6213,6497,6857,7049,7330,7295,7231,7244,7567,7891,8076,8463,8697,8738,8902,9170,9853,10430,11040,11337,12038,12441,12731,13043,13138,13663,13931,14283,14620,15041,15332,15755,16225,16811,17321,17949,18364,18802,19585,20743,21897,22903,23810,24965,25937,26775,27527,28167,28726,29462,30241,31077,32197,33541,35082,36604,38234,40079,41908,43739,45665,47585,49148,50569,51919,53007,53918,54786,55429,55972]
[]
["Data for comparison and dependencies"]
["Males","0-15",246007,246116,245075,244834,243850,242163,239798,236848,233798,231270,228025,224574,221776,219376,217792,216783,216009,215281,214052,213053,213242,213806,213918,213497,212926,212221,211448,210531,208712,206747,204111,200873,197868,195571,194208,193348,193409,194066,194729,195016,195331,196009,196102,196674,197411,198891,200274,201765,202858,203436,203675,203442,202385,200672,198743,196933,194901,192563,190651,188736,186828,184615,182901,181612,180621,179837,179262,178917,178778,178814,179003,179340,179800,180341,180929,181523,182088,182591,183000,183288,183430,183399,183186,182782,182195,181437,180537,179516,178405,177239,176066,174915,173808]
["Males","16-64",441354,443834,442311,441300,440299,442142,444194,446280,450695,452460,454069,457647,462739,466900,470771,474117,477940,478879,481076,483285,487005,494294,499689,503341,505165,511239,516431,519633,520636,523611,528336,534641,540211,545899,552675,559437,566316,571339,574967,577199,578278,579073,578075,579375,581710,582941,583499,585002,586093,587487,588619,589581,590621,592101,593281,593757,594247,594432,593993,593418,592945,592896,592247,591552,590758,589872,588999,588239,587894,587735,587777,587767,587639,587089,585845,584461,583364,582231,580873,579282,577632,575918,574338,572956,571567,570286,569138,568472,567787,567005,566324,565706,565062]
["Males","65+",67252,67559,68359,68859,69202,69740,69936,70443,70672,71032,74531,74516,74498,75032,76342,77483,78901,79620,80811,81546,82903,84016,84605,85108,85923,86887,87640,88505,89150,90120,91826,93472,95025,96781,98418,100325,102531,105593,108866,112320,115713,119466,122968,126662,130008,133381,136475,139433,143062,146425,149958,153654,157612,161586,165590,169943,174250,178901,183530,188106,192401,196409,200404,203927,207168,210228,213071,215583,217482,219034,220227,221292,222312,223610,225467,227329,228809,230247,231833,233615,235425,237308,239090,240734,242441,244107,245696,246844,248048,249368,250586,251712,252831]
["Males","85+",2847,2773,2769,2886,2860,2927,2912,3011,3190,3281,3887,3936,4041,4082,4131,4230,4304,4317,4361,4418,4735,4963,5129,5332,5502,5744,5902,6145,6197,6270,6375,6500,6581,6879,7494,7975,8223,8585,8894,9382,9792,10279,10575,11067,11600,12122,12548,12957,13492,14002,14522,15174,15798,16477,16979,17482,18290,19339,20418,21389,22285,23336,24271,25159,25963,26715,27366,28096,28924,29723,30627,31627,32778,33949,35149,36541,37905,39447,40961,42430,43730,44868,46003,46880,47617,48287,48876,49329,49483,49519,49447,49410,49454]
["Males","All",754613,757509,755745,754993,753351,754045,753928,753571,755165,754762,756625,756737,759013,761308,764905,768383,772850,773780,775939,777884,783150,792116,798212,801946,804014,810347,815519,818669,818498,820478,824273,828986,833104,838251,845301,853110,862256,870998,878562,884535,889322,894548,897145,902711,909129,915213,920248,926200,932013,937348,942252,946677,950618,954359,957614,960633,963398,965896,968174,970260,972174,973920,975552,977091,978547,979937,981332,982739,984154,985583,987007,988399,989751,991040,992241,993313,994261,995069,995706,996185,996487,996625,996614,996472,996203,995830,995371,994832,994240,993612,992976,992333,991701]
["Males","Median age",26.705311391407175,26.827789295137581,27.003440799396682,27.093279617496016,27.149037132590067,27.032734214937605,27.114801646706585,27.163099596357835,27.16597215645421,27.091164621006278,27.348930610664858,27.513680875576036,27.679002673057425,27.882427766672723,28.081631718707079,28.302734029375333,28.54565274265283,28.848247731624074,29.194238231820481,29.529129078492538,29.815785054575986,30.023412204234123,30.299028512755708,30.626359766671921,31.038507062258343,31.406262005378409,31.756304146039604,32.173847579337504,32.657692307692308,33.087825133187089,33.519872751551333,33.86976035906067,34.224337947035764,34.587585712007652,34.883677373077226,35.162794373320686,35.366480446927376,35.57037337662338,35.773519750694852,36.023817553326026,36.291464681440445,36.48319103521878,36.70984855355038,36.86064835659613,36.982449229691873,37.120298455362594,37.347718662493826,37.530801824999998,37.748516258000002,37.941284097999997,38.141729667,38.360636393,38.596993558000001,38.840089912000003,39.092693308000001,39.351082892000001,39.6080933,39.861347854000002,40.107089346000002,40.355937500000003,40.600923895999998,40.839959065000002,41.069500197000004,41.266152087000002,41.455538412000003,41.642943354000003,41.823141974000002,41.986413267000003,42.131905113999998,42.266301663,42.376404493999999,42.463298420000001,42.51307929,42.529100528999997,42.536252396999998,42.554224853999997,42.593011081,42.646254155000001,42.728052431000002,42.849534523000003,43.001978123999997,43.159652510000001,43.308674869000001,43.463178294999999,43.629402347999999,43.798594663000003,43.947874614,44.097450918,44.247997462000001,44.413886734000002,44.571301966,44.705450472999999,44.821359141000002]
["Males","dep1",{"$f":"CHOOSE($I$336,C277,C278,C279,SUM(C277,C279))/CHOOSE($J$336,C277,C278,C279,SUM(C277,C279))","v":6.5626895854398386},{"$f":"CHOOSE($I$336,D277,D278,D279,SUM(D277,D279))/CHOOSE($J$336,D277,D278,D279,SUM(D277,D279))","v":6.5695762222649829},6.4704135519829133,6.4087483117675248,6.3625184243229969,6.3398623458560364,6.3514355982612676,6.3353349516630466,6.3772781299524564,6.36980515823854,6.0923508338812038,6.1415937516774921,6.2114284947246903,6.2226783239151295,6.1666055382358334,6.1189809377540882,6.0574644174345069,6.0145566440592813,5.9531004442464512,5.9265322639982339,5.8743953777306004,5.883331746334032,5.9061402990367,5.9141443812567562,5.8792756305063838,5.8839527201998001,5.8926403468735735,5.8712276142590811,5.84,5.8101531291611188,5.7536645394550563,5.7197984423142758,5.684935543278085,5.6405596139738172,5.6155886118392973,5.5762471966110141,5.52336366562308,5.4107658651615163,5.281419359579667,5.1388799857549854,4.9975197255278143,4.84717827666449,4.70101977750309,4.5741816803776985,4.4744169589563718,4.3704950480203326,4.2755010075105329,4.1955778043935084,4.0967762228963664,4.0122042001024418,3.9252257298710305,3.8370689991799756,3.747309849503845,3.6643087891277708,3.5828310888338666,3.4938597059013903,3.410312769010043,3.3226868491512067,3.2364899471476054,3.1547000095690727,3.0818187015660001,3.0186804067023405,2.955265363964791,2.9008027382347605,2.8515890485016993,{"$f":"CHOOSE($I$336,BP277,BP278,BP279,SUM(BP277,BP279))/CHOOSE($J$336,BP277,BP278,BP279,SUM(BP277,BP279))","v":2.8058679148353218},2.7643320771010602,2.7285964106631786,2.7031846313717915,2.6833048750422308,2.6689597551617195,2.6560698082171972,2.6433076037280938,2.6255042261079558,2.5983625098129659,2.5709918224247676,2.5495675432347502,2.5287235012834044,2.5055665069252435,2.4796438584851144,2.4535712010194328,2.4268798354880579,2.4021832782634154,2.3800377179791803,2.3575509092933951,2.3362132179740853,2.3164316879395677,2.3029605742898349,2.2890206734180483,2.2737680857207021,2.2599985633674669,2.2474335748792269,2.2349395445969837]
["Males","dep2",{"$f":"CHOOSE($L$336,C277,C278,C279,SUM(C277,C279))/CHOOSE($M$336,C277,C278,C279,SUM(C277,C279))","v":1.7940709004215327},{"$f":"CHOOSE($L$336,D277,D278,D279,SUM(D277,D279))/CHOOSE($M$336,D277,D278,D279,SUM(D277,D279))","v":1.8033528905069154},1.8047985310619199,1.8024457387454358,1.8056141070330121,1.8258032812609688,1.8523674092361071,1.8842464365331353,1.9277111010359369,1.9564145803606174,1.9913123561013046,2.0378449865077881,2.0865152225669146,2.1283093866238785,2.1615624081692624,2.187058025767703,2.2125929938104432,2.2244368987509349,2.2474725767570498,2.2683792295813716,2.2838136952382739,2.3118808639607868,2.3358903879056463,2.357602214551024,2.3724909123357412,2.408993454936128,2.4423546214672167,2.4682018325092265,2.4945187626969219,2.5326171601038951,2.5884739186031132,2.661587171994245,2.7301584894980491,2.7913085273378977,2.8457890509144836,2.8934201543331195,2.9280747017977449,2.9440448094977998,2.952652147343231,2.9597520203470484,2.9605029411614132,2.954318424153993,2.9478281710538394,2.9458647304676773,2.9466949663392619,2.9309571574379936,2.9135035002047194,2.8994225955938839,2.8891786372733637,2.8878222143573411,2.8899914078802014,2.8980299053292828,2.9183042221508511,2.9505910141923137,2.9851667731693694,3.0150203368658377,3.048968450649304,3.0869481676126775,3.1156039045166297,3.1441696337741609,3.1737480463313852,3.2115266906806057,3.238074149403229,3.2572296984780742,3.2707049567879705,{"$f":"CHOOSE($L$336,BP277,BP278,BP279,SUM(BP277,BP279))/CHOOSE($M$336,BP277,BP278,BP279,SUM(BP277,BP279))","v":3.2800369223241046},3.2856879874150686,3.2877758960858947,3.2884023761312915,3.2868511414095094,3.2836153584018146,3.2773893163822905,3.2682925472747497,3.2554383085377148,3.2379828551531262,3.2197627848812549,3.2037476385044594,3.1887168589908592,3.1741693989071038,3.1605015058268955,3.1490595867633431,3.1402461300225193,3.1352723461399887,3.1346412666455121,3.1371168253794011,3.1431626404757576,3.1524729002919067,3.1666926624924798,3.1825733583700009,3.1990983925659702,3.2165437960764711,3.2341766000628875,3.2510701463684066]
["Males","dep3",{"$f":"CHOOSE($O$336,C277,C278,C279,SUM(C277,C279))/CHOOSE($P$336,C277,C278,C279,SUM(C277,C279))","v":0.78531502686275578},{"$f":"CHOOSE($O$336,D277,D278,D279,SUM(D277,D279))/CHOOSE($P$336,D277,D278,D279,SUM(D277,D279))","v":0.78462102494620223},0.78190304816963063,0.780489204413232,0.77894407318911874,0.77640484381362151,0.77420625439893587,0.77076126538037237,0.76788517752159491,0.76502967231444052,0.75366213196895782,0.75085760139088564,0.74855032841221303,0.74514279503274372,0.74045163088932253,0.73669061325467433,0.73245735987250349,0.73001108846697704,0.72593713012483763,0.72319661641757105,0.72005943034662079,0.71789861057947368,0.71658800159451697,0.71498132985047136,0.71248690810409265,0.70951295184348129,0.7069758733215642,0.70403229042657067,0.70070032431125828,0.69642971431651213,0.68971098578413648,0.6824406733594931,0.67556411385727899,0.66895728436952717,0.66367308441491868,0.65837853667174029,0.65354125836318178,0.64762279791362853,0.64141043166060052,0.63453679360699689,0.6279851082162009,0.62131389175053486,0.61460494562321744,0.60826508647351363,0.60293080120579445,0.59857887513844077,0.59472782398759905,0.59134285664042574,0.58643038852913965,0.58147664358130802,0.57595020826676246,0.56971234625982925,0.56218524043255913,0.55394773890431681,0.54549821180074276,0.53678354539408413,0.52797093872155298,0.51838939978032861,0.50951544840598539,0.50083589408823859,0.49265219695751117,0.48452328462249095,0.47716831244048474,0.47105999652434644,0.46577133441123908,{"$f":"CHOOSE($O$336,BP277,BP278,BP279,SUM(BP277,BP279))/CHOOSE($P$336,BP277,BP278,BP279,SUM(BP277,BP279))","v":0.46104367220847808},0.45691287758103449,0.45352851711026615,0.4511633775803765,0.44945305744907604,0.44837061343085438,0.44764272449529741,0.44713910552283942,0.44644276162207791,0.44520369294973378,0.44398217447878452,0.44314755279303575,0.44228244492997254,0.44114137496293687,0.43964183515110228,0.43793198123455612,0.43593046942408847,0.43380632572061872,0.4315822778832441,0.42906159628481805,0.42636484123850882,0.42356410695558533,0.42104324983581948,0.41834621869232952,0.41546200601490363,0.41266887299250909,0.40999514798641434,0.40738891662506238]
["Females","0-15",236737,236569,234354,233036,231134,228804,226258,223208,221032,218742,216033,213721,211277,209154,207306,206138,205106,204692,203517,203042,203297,204163,204610,204402,203531,202906,202000,200721,198798,196442,193422,190783,188039,185676,184562,183801,183664,184419,184791,184943,185475,186132,186505,187109,187789,189110,190410,191745,192699,193409,193781,193629,192750,191093,189313,187484,185358,183121,181128,179357,177559,175774,174258,173026,172085,171343,170795,170467,170336,170367,170547,170858,171287,171802,172366,172938,173486,173973,174368,174648,174787,174759,174555,174175,173616,172901,172046,171075,170014,168911,167793,166695,165641]
["Females","16-64",450237,445067,438850,436888,435933,436125,437520,439603,444001,449913,457179,460639,466320,471874,476385,480677,483845,485539,487994,490801,495477,500286,505195,509161,512532,518578,523433,527476,530722,534896,538879,544408,549447,554726,561383,568477,576366,581828,585479,588040,589472,589601,589909,591424,592887,593440,593676,594932,595948,596873,597251,597303,597334,597948,597923,597400,596800,596144,594699,592704,591023,589233,587217,585092,582885,580547,578506,576463,574748,573344,572007,570648,569089,566748,564080,561372,558870,556358,553806,551205,548425,545829,543375,541289,539231,537179,535359,534077,532978,532233,531599,530911,530561]
["Females","65+",98826,99832,101044,102025,103100,104547,105604,106843,108055,109356,113127,113448,113950,114981,116756,118303,120153,121429,122985,123868,125371,126698,127535,128198,129054,129920,130309,130903,130988,131128,132264,133357,134334,135389,136487,137725,139397,141907,144501,147315,150049,153353,156166,159254,161816,164374,166500,168764,171606,174226,177339,180872,184721,188591,192786,197321,202002,206600,211545,216669,221345,225967,230445,234685,238646,242478,245809,248938,251547,253666,255550,257292,259068,261454,264009,266465,268582,270602,272557,274475,276513,278330,279977,281248,282499,283757,284787,285284,285615,285564,285386,285233,284707]
["Females","85+",6170,6372,6740,7175,7259,7390,7604,7910,8265,8584,10254,10498,10747,11090,11546,12055,12545,12749,13181,13466,14447,15007,15454,15816,16185,16563,16845,17093,17041,17046,17085,17227,17235,17497,18361,19065,19723,20345,20838,21448,21973,22434,22709,23377,23860,24339,24606,24763,25163,25523,25952,26461,26894,27480,27887,28327,29070,30242,31430,32520,33549,34846,35970,36918,37785,38469,39064,39800,40466,41206,42261,43573,45076,46573,48261,50136,52069,53901,55922,58010,59746,61403,62922,64262,65397,66448,67165,67774,68069,68099,68051,68005,68094]
["Females","All",785800,781468,774248,771949,770167,769476,769382,769654,773088,778011,786339,787808,791547,796009,800447,805118,809104,811660,814496,817711,824145,831147,837340,841761,845117,851404,855742,859100,860508,862466,864565,868548,871820,875791,882432,890003,899427,908154,914771,920298,924996,929086,932580,937787,942492,946924,950586,955441,960253,964508,968371,971804,974805,977632,980022,982205,984160,985865,987372,988730,989927,990974,991920,992803,993616,994368,995110,995868,996631,997377,998104,998798,999444,1000004,1000455,1000775,1000938,1000933,1000731,1000328,999725,998918,997907,996712,995346,993837,992192,990436,988607,986708,984778,982839,980909]
["Females","Median age",29.806724511930586,29.943746259724715,30.221668868787479,30.360617879503234,30.473177658567373,30.558555696738669,30.622396619378208,30.697557471264368,30.687493447950519,30.683183500793231,31.223265221450056,31.322802197802197,31.400158730158729,31.477407786885244,31.575790119668611,31.652993348115299,31.808020477815699,32.020947348556334,32.29625600580183,32.551996853971858,32.760486505071341,32.939272426622573,33.132159315339038,33.377941650548031,33.687234210111832,33.949949561573682,34.272368726316607,34.611557826707745,35.006224221972253,35.396459266877251,35.84278505799066,36.149654239326516,36.493732642798172,36.80269210466782,37.057936210131331,37.285773491070756,37.434263401319278,37.598493408662897,37.821315034504146,38.084523439925491,38.347614944779508,38.607131280388977,38.855354892902142,39.065690060443252,39.221832791930247,39.41041648849739,39.613044947617439,39.779758596000001,40.032535467999999,40.286068495000002,40.547125281,40.813376398000003,41.077113840000003,41.341218075,41.614836842000003,41.891061018000002,42.172649573000001,42.466002746999997,42.758429561,43.043863023999997,43.323736281000002,43.589962796000002,43.843302377000001,44.093051621000001,44.34120222,44.576331642,44.789256197999997,44.967636728999999,45.126504513999997,45.253321256,45.360303743999999,45.457098012000003,45.531199131999998,45.578086448000001,45.601746931000001,45.594444979000002,45.569202478000001,45.538822277999998,45.511822707,45.496703089999997,45.504751028000001,45.549164636,45.637475295999998,45.755467525,45.871979476999996,45.986951220000002,46.118517314000002,46.253183034999999,46.374512084000003,46.480853947999996,46.582268843999998,46.684632346999997,46.782930630999999]
["Females","dep1",{"$f":"CHOOSE($I$336,C286,C287,C288,SUM(C286,C288))/CHOOSE($J$336,C286,C287,C288,SUM(C286,C288))","v":4.5558557464634815},{"$f":"CHOOSE($I$336,D286,D287,D288,SUM(D286,D288))/CHOOSE($J$336,D286,D287,D288,SUM(D286,D288))","v":4.4581597083099611},4.3431574363643559,4.2821661357510417,4.2282541222114451,4.1715687681138629,4.1430248854210072,4.1144763812322758,4.1090278099116189,4.1142049818939972,4.0412898777480173,4.0603536421973061,4.0923211935059234,4.1039302145571881,4.0801757511391274,4.0631006821466915,4.0269073597829435,3.9985423580857948,3.9679147863560598,3.9622905027932962,3.9520862081342574,3.9486495445863392,3.9612263300270514,3.9716766252203621,3.9714538100330095,3.9915178571428571,4.0168599252545869,4.0295180400754758,4.0516841237365258,4.0791897992800932,4.074268130405855,4.0823353854690794,4.0901558801197018,4.0972752586990078,4.1130876933334308,4.1276238881829732,4.1347087813941474,4.100065535879132,4.0517297458149075,3.991718426501035,3.9285300135289138,3.8447307845298102,3.7774483562363126,3.713715197106509,3.6639578286448806,3.610303332643849,3.5656216216216214,3.5252304993956058,3.4727690174003238,3.4258549240641467,3.367849147677612,3.3023519394931222,3.2337092155196214,3.1706072930309506,3.1014855850528567,3.0275540869953019,2.9544261938000616,2.8854985479186834,2.8112174714599729,2.7355274635503926,2.6701438930176873,2.6076064204065195,2.5481872030202433,2.4930949996804226,2.4424670851386572,{"$f":"CHOOSE($I$336,BP286,BP287,BP288,SUM(BP286,BP288))/CHOOSE($J$336,BP286,BP287,BP288,SUM(BP286,BP288))","v":2.3942254555052416},2.3534777001655756,2.3156890470719618,2.284853327608757,2.2602319585596806,2.2383369203678343,2.2179002845016558,2.1966780922383311,2.1676776794388304,2.136593828240704,2.1067382207794645,2.0808170316700298,2.0560010642936861,2.0318905770169176,2.0082156844885692,1.9833606376553725,1.9610857615061259,1.9407844215774868,1.9245967971327795,1.9087890576603812,1.8930951483135219,1.8798575777686481,1.872088865831943,1.8660714598322916,1.8637958566205823,1.8627367845654657,1.8613239001097348,1.8635333869557125]
["Females","dep2",{"$f":"CHOOSE($L$336,C286,C287,C288,SUM(C286,C288))/CHOOSE($M$336,C286,C287,C288,SUM(C286,C288))","v":1.9018446630649202},{"$f":"CHOOSE($L$336,D286,D287,D288,SUM(D286,D288))/CHOOSE($M$336,D286,D287,D288,SUM(D286,D288))","v":1.881341173188372},1.8725944511294879,1.8747661305549357,1.886061765036732,1.906107410709603,1.9337216805593613,1.9694769004695172,2.0087634369684029,2.0568203637161586,2.1162461290636152,2.15532867617127,2.2071498554030966,2.2561079396043109,2.297979797979798,2.331821401197256,2.3589997367215001,2.3720467824829501,2.3978046060034295,2.4172387978841816,2.4372076321834557,2.4504244157854265,2.4690630956453741,2.490978561853602,2.5182011585458728,2.5557548815707767,2.5912524752475248,2.627906397437239,2.669654624291995,2.7229207603262031,2.7860274425866756,2.8535456513421007,2.9219842692207467,2.9876020595014974,3.0417041427812874,3.0928939450819093,3.138154455963063,3.1549243841469696,3.1683307087466379,3.1795742472004886,3.1781749561935571,3.1676498398985666,3.1629661403179541,3.1608527649658753,3.1571977059359173,3.1380677912326158,3.1178824641562941,3.1027249732717932,3.0926367028370669,3.0860663154248251,3.082092671624153,3.0847806888430966,3.0990090791180287,3.1290942106722905,3.1583832066471929,3.1864052399138059,3.219715361624532,3.2554649657876484,3.2833079369285807,3.3046047826402094,3.3286006341554075,3.3522193270904683,3.3698137244774991,3.3815264757897658,3.3871923758607663,{"$f":"CHOOSE($L$336,BP286,BP287,BP288,SUM(BP286,BP288))/CHOOSE($M$336,BP286,BP287,BP288,SUM(BP286,BP288))","v":3.3882154508792306},3.3871366257794433,3.3816691793719604,3.3742015780574866,3.3653465753344252,3.3539552146915512,3.3398962881457117,3.3224296064499934,3.2988440181138752,3.272571156724644,3.2460881934566146,3.2214126788328743,3.1979560046673909,3.1760758854835749,3.1560911089734782,3.1376761429625772,3.1233241206461471,3.1129156999226604,3.1077307305870532,3.105883098331951,3.1068588382947468,3.1117201213628913,3.1218880607920503,3.1349065371087086,3.1509670773365857,3.1681834164714857,3.1849245628243197,3.203077740414511]
["Females","dep3",{"$f":"CHOOSE($O$336,C286,C287,C288,SUM(C286,C288))/CHOOSE($P$336,C286,C287,C288,SUM(C286,C288))","v":0.70549196425112426},{"$f":"CHOOSE($O$336,D286,D287,D288,SUM(D286,D288))/CHOOSE($P$336,D286,D287,D288,SUM(D286,D288))","v":0.70323512712506797},0.69873404134789119,0.69550320687874745,0.69153347654637165,0.68637562209202907,0.68178339189181048,0.67628336226825547,0.67165217708387148,0.66669714536510438,0.6563160772876413,0.65324343076513969,0.64962933581775195,0.64526817529732983,0.63971091951540138,0.63536359461350445,0.63059285062058235,0.62765660598366868,0.62332543139092567,0.62109449083845703,0.61854820061581905,0.61706577686702269,0.61602613316473231,0.61455802766085388,0.61196686561330182,0.60964588103092909,0.60786797829730765,0.60526680819241063,0.6028090943824177,0.59969472173886496,0.59389104843315343,0.58858209415684581,0.58329636787199923,0.57831280270350238,0.57487174854928691,0.57165205924248741,0.56851182903538344,0.56513731667105904,0.56117670638825112,0.55662467118925651,0.55279205064317305,0.5482775380355539,0.54426840905708396,0.54021070379919334,0.53714620786315981,0.53498885380950767,0.53349583928721522,0.53187299068816585,0.52894964384238485,0.5260897357433324,0.52215186462599694,0.51703199724433313,0.51063525409899035,0.50329484518705025,0.49545536627941972,0.48721820142669664,0.47851610904584885,0.46987716853851857,0.46126930041026504,0.45289198183957619,0.44511712091129696,0.43753064785521018,0.43058242711321637,0.4243839386231914,0.41897251485765624,{"$f":"CHOOSE($O$336,BP286,BP287,BP288,SUM(BP286,BP288))/CHOOSE($P$336,BP286,BP287,BP288,SUM(BP286,BP288))","v":0.41405100272823275},0.40996965943677927,0.40644961314242795,0.40375175107790551,0.40177769183058865,0.40025393278995158,0.39906107672544666,0.39801326811585785,0.39653692043503147,0.39499513033514755,0.39357491869650413,0.39244188676855146,0.39132429848731937,0.39015047267438607,0.38886452040977637,0.38729669842676712,0.38570567813387657,0.38403236735807378,0.38244664850040511,0.38064084715477459,0.37862251400391539,0.37660589318197241,0.37486934628220325,0.37314130575534044,0.37166180758017492,0.37025766860335541,0.36885300313324249,0.36780667394992317]
["All","0-15",482744,482685,479429,477870,474984,470967,466056,460056,454830,450012,444058,438295,433053,428530,425098,422921,421115,419973,417569,416095,416539,417969,418528,417899,416457,415127,413448,411252,407510,403189,397533,391656,385907,381247,378770,377149,377073,378485,379520,379959,380806,382141,382607,383783,385200,388001,390684,393510,395557,396845,397456,397071,395135,391765,388056,384417,380259,375684,371779,368093,364387,360389,357159,354638,352706,351180,350057,349384,349114,349181,349550,350198,351087,352143,353295,354461,355574,356564,357368,357936,358217,358158,357741,356957,355811,354338,352583,350591,348419,346150,343859,341610,339449]
["All","16-64",891591,888901,881161,878188,876232,878267,881714,885883,894696,902373,911248,918286,929059,938774,947156,954794,961785,964418,969070,974086,982482,994580,1004884,1012502,1017697,1029817,1039864,1047109,1051358,1058507,1067215,1079049,1089658,1100625,1114058,1127914,1142682,1153167,1160446,1165239,1167750,1168674,1167984,1170799,1174597,1176381,1177175,1179934,1182041,1184360,1185870,1186884,1187955,1190049,1191204,1191157,1191047,1190576,1188692,1186122,1183968,1182129,1179464,1176644,1173643,1170419,1167505,1164702,1162642,1161079,1159784,1158415,1156728,1153837,1149925,1145833,1142234,1138589,1134679,1130487,1126057,1121747,1117713,1114245,1110798,1107465,1104497,1102549,1100765,1099238,1097923,1096617,1095623]
["All","65+",166078,167391,169403,170884,172302,174287,175540,177286,178727,180388,187658,187964,188448,190013,193098,195786,199054,201049,203796,205414,208274,210714,212140,213306,214977,216807,217949,219408,220138,221248,224090,226829,229359,232170,234905,238050,241928,247500,253367,259635,265762,272819,279134,285916,291824,297755,302975,308197,314668,320651,327297,334526,342333,350177,358376,367264,376252,385501,395075,404775,413746,422376,430849,438612,445814,452706,458880,464521,469029,472700,475777,478584,481380,485064,489476,493794,497391,500849,504390,508090,511938,515638,519067,521982,524940,527864,530483,532128,533663,534932,535972,536945,537538]
["All","85+",9017,9145,9509,10061,10119,10317,10516,10921,11455,11865,14141,14434,14788,15172,15677,16285,16849,17066,17542,17884,19182,19970,20583,21148,21687,22307,22747,23238,23238,23316,23460,23727,23816,24376,25855,27040,27946,28930,29732,30830,31765,32713,33284,34444,35460,36461,37154,37720,38655,39525,40474,41635,42692,43957,44866,45809,47360,49581,51848,53909,55834,58182,60241,62077,63748,65184,66430,67896,69390,70929,72888,75200,77854,80522,83410,86677,89974,93348,96883,100440,103476,106271,108925,111142,113014,114735,116041,117103,117552,117618,117498,117415,117548]
["All","All",1540413,1538977,1529993,1526942,1523518,1523521,1523310,1523225,1528253,1532773,1542964,1544545,1550560,1557317,1565352,1573501,1581954,1585440,1590435,1595595,1607295,1623263,1635552,1643707,1649131,1661751,1671261,1677769,1679006,1682944,1688838,1697534,1704924,1714042,1727733,1743113,1761683,1779152,1793333,1804833,1814318,1823634,1829725,1840498,1851621,1862137,1870834,1881641,1892266,1901856,1910623,1918481,1925423,1931991,1937636,1942838,1947558,1951761,1955546,1958990,1962101,1964894,1967472,1969894,1972163,1974305,1976442,1978607,1980785,1982960,1985111,1987197,1989195,1991044,1992696,1994088,1995199,1996002,1996437,1996513,1996212,1995543,1994521,1993184,1991549,1989667,1987563,1985268,1982847,1980320,1977754,1975172,1972610]
["All","Median age",28.219090466926069,28.36638349514563,28.561137653030755,28.62259758272241,28.704872411678693,28.717355571670293,28.80082885194139,28.844836184112104,28.831867131806462,28.779128440366971,29.213053805638747,29.350216010165184,29.473724372996898,29.607724697979847,29.752138376734461,29.91724630337648,30.135431481396523,30.417713064386856,30.730658709106986,31.021669022795546,31.288324383285786,31.49096410340853,31.717787682333874,31.999546798029556,32.36752995900347,32.680287166063593,33.020117912790475,33.411585251731239,33.862594540638078,34.267069810165339,34.70720529903339,35.03665683533152,35.388716415622248,35.72353465999457,35.995002333540761,36.243821789070658,36.425673589129929,36.60919044068595,36.822408930202997,37.090965272517046,37.355681395444961,37.580475946775842,37.819599157968597,37.996953104300978,38.130774650988684,38.284805977975878,38.494095801999997,38.675755033999998,38.920203465,39.154904993999999,39.381526674,39.612853045000001,39.853536361000003,40.099812614999998,40.361675376000001,40.629270562999999,40.901982805000003,41.176107324999997,41.445533388000001,41.706623982000004,41.957503138,42.209678052000001,42.456903635000003,42.695121469,42.919026094000003,43.107452446000003,43.284425216000002,43.445127030000002,43.588295991000003,43.716285956,43.830279382999997,43.921190162000002,43.990215483999997,44.031490394999999,44.033138856000001,44.023629444999997,44.011110588999998,44.018343983999998,44.039036658000001,44.084278089000001,44.173803632000002,44.302277721999999,44.440118923999997,44.575955227999998,44.713250764000001,44.861284742999999,45.018174316,45.152177432000002,45.279473748999997,45.406826832999997,45.540876681,45.670519990000003,45.780378229999997]
["All","dep1",{"$f":"CHOOSE($I$336,C295,C296,C297,SUM(C295,C297))/CHOOSE($J$336,C295,C296,C297,SUM(C295,C297))","v":5.3685075687327641},{"$f":"CHOOSE($I$336,D295,D296,D297,SUM(D295,D297))/CHOOSE($J$336,D295,D296,D297,SUM(D295,D297))","v":5.3103273174782393},5.2015666782760634,5.1390885044825731,5.0854430012420053,5.0391997108218058,5.0228665831149595,4.9969145899845451,5.0059364281837659,5.0024003814000935,4.8558974304319564,4.885435508927241,4.9300549753778231,4.9405777499434249,4.9050533925778623,4.8767225440021251,4.8317793161654627,4.7969301016170185,4.7550982354903928,4.7420623716007668,4.7172570748149072,4.7200470780299364,4.7368907325351186,4.7467112973849774,4.7339808444624305,4.7499250485454807,4.771134531472959,4.7724285349668198,4.775904205543795,4.7842556768874749,4.7624391985363026,4.757103368616888,4.750883985367917,4.7405995606667526,4.7425895574806836,4.7381390464188193,4.7232317053007504,4.6592606060606059,4.5800992236558038,4.4879889075047661,4.3939690399680922,4.2836972498249759,4.1843129106450663,4.0949054967193161,4.0250185043039641,3.9508354183808838,3.8853865830514067,3.8285057933724209,3.7564703115664764,3.6936108105073742,3.6232229442982979,3.5479574083927705,3.470173778163367,3.3984213697644332,3.3238944572181173,3.243326326566176,3.1655565950479998,3.0883862817476477,3.0087755489464025,2.930324254215305,2.8615817433884558,2.7987598727200411,2.7375344958442516,2.6826534613736057,2.6325844410449202,{"$f":"CHOOSE($I$336,BP295,BP296,BP297,SUM(BP295,BP297))/CHOOSE($J$336,BP295,BP296,BP297,SUM(BP295,BP297))","v":2.5853843333200799},2.544249041143654,2.5073182913151397,2.4788275351843914,2.4562703617516397,2.4376630228026994,2.4205050732995672,2.402941543063692,2.3787314663632015,2.3492980248265494,2.3204676444023216,2.2964508806954691,2.2733179061952806,2.2496064553222705,2.2249739219429627,2.1995964355058621,2.1754544855111533,2.1533116148782336,2.134642573881858,2.1160475482912333,2.0980119879362866,2.0820591800302743,2.0719620091406581,2.0626593936622926,2.0549116523221644,2.048470815639623,2.0423264952648781,2.0382242743768813]
["All","dep2",{"$f":"CHOOSE($L$336,C295,C296,C297,SUM(C295,C297))/CHOOSE($M$336,C295,C296,C297,SUM(C295,C297))","v":1.8469230068110634},{"$f":"CHOOSE($L$336,D295,D296,D297,SUM(D295,D297))/CHOOSE($M$336,D295,D296,D297,SUM(D295,D297))","v":1.8415757688761822},1.8379384642981547,1.8377131855944084,1.8447610866892359,1.8648164308751993,1.8918627804384023,1.9255981880466726,1.9670997955279994,2.0052198608037117,2.0520922942498503,2.0951322739250959,2.1453701971814074,2.1906844328285069,2.2280885819269911,2.2576178529796347,2.2839010721536872,2.2963809578234793,2.3207422006901854,2.3410182770761483,2.3586794993986158,2.3795544645655538,2.4009958712439787,2.4228390113400606,2.4437024710834492,2.4807275845705048,2.5151022619531358,2.5461493196385669,2.5799563200903046,2.6253370007614296,2.6845947380469042,2.7550937557448374,2.823628490802188,2.8869079625544596,2.9412519470919025,2.9906323495488523,3.0303999490814775,3.0467970989603286,3.0576675801011803,3.0667493071620884,3.0665220611019786,3.0582271988611534,3.0526989835523133,3.0506796809655454,3.049317237798546,3.0319019796340729,3.0131128994276706,2.9984854260374578,2.9882949865632513,2.9844397686754274,2.9836510204903184,2.9890976676715248,3.0064534905791693,3.0376603320868378,3.0696703568557115,3.0986064612126936,3.1321993693771875,3.1690889151520958,3.1973080781862344,3.2223432665114524,3.2492048289318776,3.2801472852945013,3.3023499337829931,3.317873437138716,3.3275390835426673,{"$f":"CHOOSE($L$336,BP295,BP296,BP297,SUM(BP295,BP297))/CHOOSE($M$336,BP295,BP296,BP297,SUM(BP295,BP297))","v":3.3328179281280255},3.3351854126613665,3.3335871133194424,3.3302646127053053,3.3251494210738843,3.3179344871978258,3.3078858245906599,3.2947047313059157,3.2766148979249907,3.2548578383503872,3.2326066901577324,3.2123664834886689,3.1932247787213517,3.1750996172013162,3.1583495373474588,3.1435051937791898,3.1319892338018418,3.1243637156490309,3.1215104340298692,3.1218765018507018,3.1254480185585516,3.1325872205977032,3.144829730369576,3.1593139294929382,3.1756117290192112,3.1929453642335957,3.2101431456924563,3.2276512819304224]
["All","dep3",{"$f":"CHOOSE($O$336,C295,C296,C297,SUM(C295,C297))/CHOOSE($P$336,C295,C296,C297,SUM(C295,C297))","v":0.74403149091738563},{"$f":"CHOOSE($O$336,D295,D296,D297,SUM(D295,D297))/CHOOSE($P$336,D295,D296,D297,SUM(D295,D297))","v":0.74250549166558988},0.73891084286841591,0.73659661443320579,0.73380854830785769,0.7298939642373391,0.72640103741295148,0.72183537253154506,0.71789909984421296,0.71385152284263964,0.70293929550620848,0.69986219758917634,0.69678568497878524,0.6928055123087643,0.68764275407799469,0.68355619057162764,0.67903265077744934,0.67626106643564965,0.67201886169964509,0.6694915117882444,0.66666186523007687,0.66483267401854351,0.66362650396087952,0.66206541456420653,0.6595416148005967,0.65691512088287696,0.65481464118454791,0.65209780230234993,0.64926519322932597,0.64568403217618431,0.63950819065575115,0.63325060429921498,0.62721977161097797,0.62151358700525094,0.61721595306962151,0.61305203682060605,0.60916379779677254,0.60462311397237956,0.59966471107796493,0.59406279608626722,0.58896512045136784,0.5834570050079394,0.57818240066733062,0.57306790065387581,0.56896062768823552,0.5658003721440279,0.5632219865957192,0.56078961731890942,0.55694603822732236,0.55309716012354071,0.54840200730455757,0.54274552793409492,0.53579951943677551,0.52802644950683475,0.51988124839235184,0.51140976025734319,0.50264834219198395,0.49355150193448372,0.48481066800199257,0.4762689100855515,0.4682836995732092,0.46040510242537669,0.45324286047857382,0.44706965017333755,0.44169964434203274,{"$f":"CHOOSE($O$336,BP295,BP296,BP297,SUM(BP295,BP297))/CHOOSE($P$336,BP295,BP296,BP297,SUM(BP295,BP297))","v":0.43685298661750549},0.43273703638231409,0.42926877215399833,0.42671513415136475,0.42485590979716042,0.4235290981635158,0.42254537381362045,0.42174284386047733,0.42061640669511841,0.41920640363752432,0.41787080535923748,0.41686821850837957,0.4158602680388564,0.41469646931040965,0.41330860736282743,0.41167033459556057,0.4098874336801725,0.40800380470981107,0.40612260919130905,0.40398591656438654,0.40165177589713014,0.39927140213755258,0.39717169337014385,0.39499615681988748,0.39286922216093395,0.39082391959364926,0.38883166107984135,0.38706275007497259]
["Comp","parity",1,1,1,1,1,1,1,1,1,1,1,1,1,1,1,1,1,1,1,1,1,1,1,1,1,1,1,1,1,1,1,1,1,1,1,1,1,1,1,1,1,1,1,1,1,1,1,1,1,1,1,1,1,1,1,1,1,1,1,1,1,1,1,1,1,1,1,1,1,1,1,1,1,1,1,1,1,1,1,1,1,1,1,1,1,1,1,1,1,1,1,1,1]
["past year",93,"Year drop down","Age drop down","Gender drop down","agegroup","scatter y axis"]
["current year",92,1971,"0","All","0-15",0]
["future year",93,1972,"1","Males","16-39",{"$f":"G306+1","v":1}]
["Gender",1,1973,"2","Females","40-64",{"$f":"G307+1","v":2}]
["past year",{"$f":"OFFSET($C$305,B305,0)","v":2063},1974,"3",null,"16-64",3]
["current year",{"$f":"OFFSET($C$305,B306,0)","v":2062},1975,"4",null,"60+",4]
["future year",2063,1976,"5",null,"65+",5]
["Gender",{"$f":"OFFSET($E$305,B308,0)","v":"All"},1977,"6",null,{"$f":"IF(AND('Population Proportion'!$D$21<>\"\",'Population Proportion'!$D$22<>\"\",'Population Proportion'!$D$21>=0,'Population Proportion'!$D$22<=90,'Population Proportion'!$D$21<='Population Proportion'!$D$22),'Population Proportion'!$D$21&\"-\"&'Population Proportion'!$D$22,\"\")","v":"0-4"},6]
["Pyramid",null,1978,"7",null,null,7]
["Age lower",13,1979,"8",null,null,8]
["Age upper",91,1980,"9",null,null,9]
["Age lower",{"$f":"OFFSET($G$305,B314,0)","v":12},1981,"10",null,null,10]
["Age upper",{"$f":"OFFSET($G$305,B315,0)","v":90},1982,"11",null,null,11]
[null,null,1983,"12",null,null,12]
["reference year",48,1984,"13",null,null,13]
["start year",66,1985,"14",null,null,14]
["end year",73,1986,"15",null,null,15]
["reference year",{"$f":"OFFSET($C$305,B319,0)","v":2018},1987,"16",null,null,16]
["start year",{"$f":"OFFSET($C$305,B320,0)","v":2036},1988,"17",null,null,17]
["end year",2043,1989,"18",null,null,18]
["current year",66,1990,"19",null,null,19]
["current year",{"$f":"OFFSET($C$305,B325,0)","v":2036},1991,"20",null,null,20]
[null,null,1992,"21",null,null,21]
[null,{"$f":"$B$322&\" Males\"","v":"2018 Males"},1993,"22",null,null,22]
[null,{"$f":"$B$322&\" Females\"","v":"2018 Females"},1994,"23",null,null,23]
["Dependencies",null,1995,"24",null,null,24,null,"numerator","denominator",null,"numerator","denominator",null,"numerator","denominator"]
["depstart",58,1996,"25",null,null,25,null,"0-15","0-15",null,"0-15","0-15",null,"0-15","0-15"]
["depend",66,1997,"26",null,null,26,null,"16-64","16-64",null,"16-64","16-64",null,"16-64","16-64"]
["depstart",{"$f":"OFFSET($C$305,B331,0)","v":2028},1998,"27",null,null,27,null,"65+","65+",null,"65+","65+",null,"65+","65+"]
["depend",{"$f":"OFFSET($C$305,B332,0)","v":2036},1999,"28",null,null,28,null,"0-15 and 65+","0-15 and 65+",null,"0-15 and 65+","0-15 and 65+",null,"0-15 and 65+","0-15 and 65+"]
["gender",1,2000,"29",null,null,29]
["gender",{"$f":"OFFSET($E$305,B335,0)","v":"All"},2001,"30",null,null,30,null,2,3,null,2,1,null,1,4]
[{"$f":"$B$336&\" Aged \"&I$337&\" (per \"&CHOOSE($B$335,\"persons\",\"males\",\"females\")&\" aged \"&J$337&\")\"","v":"All Aged 16-64 (per persons aged 65+)"},null,2002,"31",null,null,31,null,{"$f":"OFFSET(I$330,I336,0)","v":"16-64"},{"$f":"OFFSET(J$330,J336,0)","v":"65+"},null,{"$f":"OFFSET(L$330,L336,0)","v":"16-64"},{"$f":"OFFSET(M$330,M336,0)","v":"0-15"},null,{"$f":"OFFSET(O$330,O336,0)","v":"0-15"},{"$f":"OFFSET(P$330,P336,0)","v":"0-15 and 65+"}]
[{"$f":"$B$336&\" Aged \"&L$337&\" (per \"&CHOOSE($B$335,\"persons\",\"males\",\"females\")&\" aged \"&M$337&\")\"","v":"All Aged 16-64 (per persons aged 0-15)"},null,2003,"32",null,null,32]
[{"$f":"$B$336&\" Aged \"&O$337&\" (per \"&CHOOSE($B$335,\"persons\",\"males\",\"females\")&\" aged \"&P$337&\")\"","v":"All Aged 0-15 (per persons aged 0-15 and 65+)"},null,2004,"33",null,null,33]
["Age Distribution",null,2005,"34",null,null,34]
["start year",58,2006,"35",null,null,35]
["end year",73,2007,"36",null,null,36]
["gender",1,2008,"37",null,null,37]
["agegroup",2,2009,"38",null,null,38]
["start year",{"$f":"OFFSET($C$305,B341,0)","v":2028},2010,"39",null,null,39]
["end year",{"$f":"OFFSET($C$305,B342,0)","v":2043},2011,"40",null,null,40]
["gender",{"$f":"OFFSET($E$305,B343,0)","v":"All"},2012,"41",null,null,41]
["agegroup",{"$f":"OFFSET($F$305,B344,0)","v":"16-39"},2013,"42",null,null,42]
[null,null,2014,"43",null,null,43]
[{"$f":"\"Number of \"&CHOOSE(B343,\"people\",\"males\",\"females\")&\" in age group as a percentage of \"&CHOOSE(B343,\"all people\",\"all males\",\"all females\")&\" (\"&B345&\"-\"&B346&\")\"","v":"Number of people in age group as a percentage of all people (2028-2043)"},null,2015,"44",null,null,44]
[null,null,2016,"45",null,null,45]
[null,null,2017,"46",null,null,46]
[null,null,2018,"47",null,null,47]
[null,null,2019,"48",null,null,48]
[null,null,2020,"49",null,null,49]
[null,null,2021,"50",null,null,50]
[null,null,2022,"51",null,null,51]
[null,null,2023,"52",null,null,52]
[null,null,2024,"53",null,null,53]
[null,null,2025,"54",null,null,54]
[null,null,2026,"55",null,null,55]
[null,null,2027,"56",null,null,56]
[null,null,2028,"57",null,null,57]
[null,null,2029,"58",null,null,58]
[null,null,2030,"59",null,null,59]
[null,null,2031,"60",null,null,60]
[null,null,2032,"61",null,null,61]
[null,null,2033,"62",null,null,62]
[null,null,2034,"63",null,null,63]
[null,null,2035,"64",null,null,64]
[null,null,2036,"65",null,null,65]
[null,null,2037,"66",null,null,{"$f":"G371+1","v":66}]
[null,null,2038,"67",null,null,67]
[null,null,2039,"68",null,null,68]
[null,null,2040,"69",null,null,69]
[null,null,2041,"70",null,null,70]
[null,null,2042,"71",null,null,71]
[null,null,2043,"72",null,null,72]
[null,null,2044,"73",null,null,73]
[null,null,2045,"74",null,null,74]
[null,null,2046,"75",null,null,75]
[null,null,2047,"76",null,null,76]
[null,null,2048,"77",null,null,77]
[null,null,2049,"78",null,null,78]
[null,null,2050,"79",null,null,79]
[null,null,2051,"80",null,null,80]
[null,null,2052,"81",null,null,81]
[null,null,2053,"82",null,null,82]
[null,null,2054,"83",null,null,83]
[null,null,2055,"84",null,null,84]
[null,null,2056,"85",null,null,85]
[null,null,2057,"86",null,null,86]
[null,null,2058,"87",null,null,87]
[null,null,2059,"88",null,null,88]
[null,null,2060,"89",null,null,89]
[null,null,2061,"90",null,null,90]
[null,null,2062]
[null,null,2063]
["Data for HHs"]
[null,"Household Type",2016,2017,2018,2019,2020,2021,2022,2023,2024,2025,2026,2027,2028,2029,2030,2031,2032,2033,2034,2035,2036,2037,2038,2039,2040,2041]
[null,"One adult households",201724,202672,203892,205233,206788,208460,210534,212728,214991,217113,219008,220932,222871,224469,225795,227179,228735,230112,231488,232739,233830,234950,235913,237065,238261,239281]
[null,"Two adults without children",197748,199531,201099,202765,204630,206693,208898,211589,214673,217685,220635,223671,226763,229647,232289,234753,237157,239285,241360,243166,244816,246322,247792,248996,250052,251042]
[null,"Other households without children",109865,109704,109417,109130,109071,109081,109309,109975,111112,112321,113407,114562,115748,116653,117472,118305,119132,119543,120026,120449,120748,120894,120903,120831,120648,120377]
[null,"One adult households with children",46045,46265,46537,46776,46914,47011,47009,46853,46547,46223,45918,45560,45163,44842,44560,44276,43978,43794,43595,43437,43329,43263,43230,43232,43264,43325]
[null,"Other households with children",169745,170611,171652,172566,173125,173509,173525,172964,171833,170634,169504,168178,166702,165510,164464,163410,162298,161606,160864,160270,159851,159586,159455,159443,159551,159764]
[null,"Total households",725127,728783,732597,736470,740528,744754,749275,754109,759156,763976,768472,772903,777247,781121,784580,787923,791300,794340,797333,800061,802574,805015,807293,809567,811776,813789]
[]
[]
[]
[null,"Household Size",2016,2017,2018,2019,2020,2021,2022,2023,2024,2025,2026,2027,2028,2029,2030,2031,2032,2033,2034,2035,2036,2037,2038,2039,2040,2041]
[null,"1 person",201724,202672,203892,205233,206788,208460,210534,212728,214991,217113,219008,220932,222871,224469,225795,227179,228735,230112,231488,232739,233830,234950,235913,237065,238261,239281]
[null,"2 persons",222913,224792,226491,228266,230184,232290,234481,237081,239999,242836,245621,248465,251345,254057,256548,258862,261110,263141,265114,266841,268439,269917,271378,272591,273673,274703]
[null,"3 persons",119810,119891,120004,120080,120150,120284,120382,120547,120786,121019,121188,121324,121423,121449,121440,121424,121403,121304,121248,121202,121154,121088,121011,120947,120885,120823]
[null,"4 persons",105410,105759,106130,106443,106677,106836,106923,106902,106805,106717,106621,106463,106255,106082,105961,105850,105714,105614,105506,105443,105414,105396,105379,105379,105379,105386]
[null,"5+ persons",75270,75669,76080,76448,76729,76884,76955,76851,76575,76291,76034,75719,75353,75064,74836,74608,74338,74169,73977,73836,73737,73664,73612,73585,73578,73596]
[null,"Total households",725127,728783,732597,736470,740528,744754,749275,754109,759156,763976,768472,772903,777247,781121,784580,787923,791300,794340,797333,800061,802574,805015,807293,809567,811776,813789]
[null,"Average Household Size",2.54,2.54,2.5299999999999998,2.5299999999999998,2.5299999999999998,2.52,2.52,2.5099999999999998,2.5099999999999998,2.5,2.4900000000000002,2.48,2.48,2.4700000000000002,2.4700000000000002,2.46,2.46,2.4500000000000002,2.4500000000000002,2.44,2.44,2.44,2.4300000000000002,2.4300000000000002,2.4300000000000002,2.42]
["Households"]
[null,"Household Type"]
[null,"Household Size"]
[null,"Average Household Size"]
["selected",2]
["selected",{"$f":"OFFSET($B$418,B422,0)","v":"Household Size"}]
[{"$f":"IF($B$422<>3,OFFSET($B$400,MATCH($B$423,$B$400:$B$417,0)+ROW()-424,0),$B$417)","v":"1 person"},true,{"$f":"IF($B422<3,IF($B424=TRUE,OFFSET($B$400,MATCH($B$423,$B$400:$B$417,0)+ROW()-424,COLUMN()-2),NA()),IF($B424=TRUE,C417,NA()))","v":201724},{"$f":"IF($B422<3,IF($B424=TRUE,OFFSET($B$400,MATCH($B$423,$B$400:$B$417,0)+ROW()-424,COLUMN()-2),NA()),IF($B424=TRUE,D417,NA()))","v":202672},203892,205233,206788,208460,210534,212728,214991,217113,219008,220932,222871,224469,225795,227179,228735,230112,231488,232739,233830,234950,235913,237065,238261,239281]
[{"$f":"IF($B$422<>3,OFFSET($B$400,MATCH($B$423,$B$400:$B$417,0)+ROW()-424,0),\"\")","v":"2 persons"},true,{"$f":"IF($B$422=3,NA(),IF($B425=TRUE,OFFSET($B$400,MATCH($B$423,$B$400:$B$417,0)+ROW()-424,COLUMN()-2),NA()))","v":222913},{"$f":"IF($B$422=3,NA(),IF($B425=TRUE,OFFSET($B$400,MATCH($B$423,$B$400:$B$417,0)+ROW()-424,COLUMN()-2),NA()))","v":224792},226491,228266,230184,232290,234481,237081,239999,242836,245621,248465,251345,254057,256548,258862,261110,263141,265114,266841,268439,269917,271378,272591,273673,274703]
[{"$f":"IF($B$422<>3,OFFSET($B$400,MATCH($B$423,$B$400:$B$417,0)+ROW()-424,0),\"\")","v":"3 persons"},true,{"$f":"IF($B$422=3,NA(),IF($B426=TRUE,OFFSET($B$400,MATCH($B$423,$B$400:$B$417,0)+ROW()-424,COLUMN()-2),NA()))","v":119810},119891,120004,120080,120150,120284,120382,120547,120786,121019,121188,121324,121423,121449,121440,121424,121403,121304,121248,121202,121154,121088,121011,120947,120885,120823]
["4 persons",true,105410,105759,106130,106443,106677,106836,106923,106902,106805,106717,106621,106463,106255,106082,105961,105850,105714,105614,105506,105443,105414,105396,105379,105379,105379,105386]
["5+ persons",true,75270,75669,76080,76448,76729,76884,76955,76851,76575,76291,76034,75719,75353,75064,74836,74608,74338,74169,73977,73836,73737,73664,73612,73585,73578,73596]
["Total households",true,725127,728783,732597,736470,740528,744754,749275,754109,759156,763976,768472,772903,777247,781121,784580,787923,791300,794340,797333,800061,802574,805015,807293,809567,811776,813789]
["labels",false]
[null,{"$f":"B423&\" (2012 to 2037)\"","v":"Household Size (2012 to 2037)"}]
[]
[null,null,1971,1972,1973,1974,1975,1976,1977,1978,1979,1980,1981,1982,1983,1984,1985,1986,1987,1988,1989,1990,1991,1992,1993,1994,1995,1996,1997,1998,1999,2000,2001,2002,2003,2004,2005,2006,2007,2008,2009,2010,2011,2012,2013,2014,2015,2016,2017,2018,2019,2020,2021,2022,2023,2024,2025,2026,2027,2028,2029,2030,2031,2032,2033,2034,2035,2036,2037,2038,2039,2040,2041,2042,2043,2044,2045,2046,2047,2048,2049,2050,2051,2052,2053,2054,2055,2056,2057,2058,2059,2060,2061,2062,2063]
[null,"UK",55928000,56096700,56222900,56235600,56225700,56216100,56189900,56178000,56240100,56329700,56357500,56290700,56315700,56409300,56554000,56683800,56804000,56916400,57076500,57237500,57438700,57584500,57713900,57862100,58024800,58164400,58314200,58474900,58684400,58886100,59113000,59365700,59636700,59950400,60413300,60827100,61319100,61823800,62260500,62759500,63285100,63705000,64105700,64596800,65110000,65648100,66040229,66435550,66832812,67195769,67530759,67844183,68138263,68413827,68671302,68921237,69163320,69397439,69624055,69843742,70057115,70264986,70468281,70667684,70864051,71058596,71252552,71446813,71641712,71836821,72031626,72225603,72417950,72607025,72791746,72971038,73143852,73309225,73466347,73614759,73754384,73885478,74008516,74124255,74233748,74338297,74439273,74538088,74636110,74734689,74835085,74938345,75045282]
[null,"GB",54387600,54557700,54692900,54708700,54702200,54692600,54666600,54654800,54711800,54796900,54814500,54746200,54765100,54852000,54988600,55110300,55222000,55331000,55486000,55641900,55831400,55961300,56078300,56218400,56375700,56502600,56643000,56797200,57005400,57203100,57424200,57668100,57931700,58236300,58685500,59084000,59557400,60044600,60467200,60954600,61470800,61881400,62275900,62756300,63258400,63785900,64169395,64553909,64940546,65293913,65620136,65925702,66212840,66481836,66733666,66978399,67215762,67445678,67668509,67884752,68095014,68300092,68500809,68697790,68891888,69084291,69276110,69468206,69660927,69853861,70046515,70238406,70428755,70615981,70799050,70976950,71148653,71313223,71469910,71618246,71758172,71889935,72013995,72131071,72242199,72348630,72451710,72552820,72653263,72754369,72857331,72963173,73072672]
[null,"England",46411700,46571900,46686200,46682700,46674400,46659900,46639800,46638200,46698100,46787200,46820800,46777300,46813700,46912400,47057400,47187600,47300400,47412300,47552700,47699100,47875000,47998000,48102300,48228800,48383500,48519100,48664800,48820600,49032900,49233300,49449700,49679300,49925500,50194600,50606000,50965200,51381100,51815900,52196400,52642500,53107200,53493700,53865800,54316600,54786300,55268100,55619430,55977178,56343072,56678470,56989570,57282105,57557521,57816890,58060235,58297244,58527723,58751651,58969496,59181798,59389102,59592225,59792005,59988992,60183914,60377815,60571681,60766253,60961805,61157868,61353965,61549624,61744098,61935975,62124272,62308060,62486366,62658300,62823107,62980339,63129854,63271801,63406569,63534723,63657158,63774963,63889363,64001546,64112751,64224166,64336909,64451968,64570104]
[null,"Scotland",5235600,5230600,5233900,5240800,5232400,5233400,5226200,5212300,5203600,5193900,5180200,5164500,5148100,5138900,5127900,5111800,5099000,5077400,5078200,5081300,5083300,5085600,5092500,5102200,5103700,5092200,5083300,5077100,5072000,5062900,5064200,5066000,5068500,5084300,5110200,5133100,5170000,5202900,5231900,5262200,5299900,5313600,5327700,5347600,5373000,5404700,5424800,5438100,5452444,5464679,5475660,5485890,5495578,5504866,5513731,5522085,5529888,5537116,5543666,5549510,5554680,5559154,5562901,5565969,5568456,5570442,5571993,5573181,5574058,5574675,5575012,5575078,5574819,5574150,5573030,5571379,5569182,5566376,5562992,5558993,5554461,5549462,5544049,5538320,5532367,5526290,5520182,5514153,5508265,5502590,5497176,5492044,5487199]
[null,"Wales",2740300,2755200,2772800,2785200,2795400,2799300,2800600,2804300,2810100,2815800,2813500,2804300,2803300,2800700,2803400,2810900,2822600,2841200,2855200,2861500,2873000,2877700,2883600,2887400,2888500,2891300,2894900,2899500,2900600,2906900,2910200,2922900,2937700,2957400,2969300,2985700,3006300,3025900,3038900,3050000,3063800,3074100,3082400,3092000,3099100,3113200,3125165,3138631,3145030,3150764,3154906,3157707,3159741,3160080,3159700,3159070,3158151,3156911,3155347,3153444,3151232,3148713,3145903,3142829,3139518,3136034,3132436,3128772,3125064,3121318,3117538,3113704,3109838,3105856,3101748,3097511,3093105,3088547,3083811,3078914,3073857,3068672,3063377,3058028,3052674,3047377,3042165,3037121,3032247,3027613,3023246,3019161,3015369]
[null,"ni",1540413,1538977,1529993,1526942,1523518,1523521,1523310,1523225,1528253,1532773,1542964,1544545,1550560,1557317,1565352,1573501,1581954,1585440,1590435,1595595,1607295,1623263,1635552,1643707,1649131,1661751,1671261,1677769,1679006,1682944,1688838,1697534,1704924,1714042,1727733,1743113,1761683,1779152,1793333,1804833,1814318,1823634,1829725,1840498,1851621,1862137,1870834,1881641,1892266,1901856,1910623,1918481,1925423,1931991,1937636,1942838,1947558,1951761,1955546,1958990,1962101,1964894,1967472,1969894,1972163,1974305,1976442,1978607,1980785,1982960,1985111,1987197,1989195,1991044,1992696,1994088,1995199,1996002,1996437,1996513,1996212,1995543,1994521,1993184,1991549,1989667,1987563,1985268,1982847,1980320,1977754,1975172,1972610]
[]
[null,"UK",2.754278715491346E-2,2.7434358883855915E-2,2.7212986167558059E-2,2.7152586617729693E-2,2.7096470119536083E-2,2.7101150737955854E-2,2.7110032229991511E-2,2.7114261810673217E-2,2.7173724797786632E-2,2.7210743178110303E-2,2.7378148427449761E-2,2.7438724336346858E-2,2.7533352155793146E-2,2.7607451253605347E-2,2.7678890971460906E-2,2.7759271608466616E-2,2.7849341595662276E-2,2.7855591709946517E-2,2.7864970697222151E-2,2.7876741646647739E-2,2.7982788607680883E-2,2.818923495037727E-2,2.8338961671278497E-2,2.8407316706445151E-2,2.842114061573672E-2,2.8569898425841237E-2,2.8659588916593214E-2,2.8692122603031386E-2,2.8610772198403665E-2,2.8579647828604712E-2,2.8569654729078207E-2,2.859452512140849E-2,2.8588503388014427E-2,2.8591001894899784E-2,2.8598553629747094E-2,2.8656848674357319E-2,2.8729759569204375E-2,2.8777784607222461E-2,2.8803703792934524E-2,2.8757925095005538E-2,2.8668959992162454E-2,2.8626230280197788E-2,2.8542313710013305E-2,2.8492092487553564E-2,2.8438350483796653E-2,2.8365436318796736E-2,2.8322401660667913E-2,2.8322803077569163E-2,2.8313427841402214E-2,2.830321057863033E-2,2.8292633287299494E-2,2.8277752272438745E-2,2.8257588544633137E-2,2.8239773810636262E-2,2.8216095276597495E-2,2.8189250288702741E-2,2.815882754037834E-2,2.8124395195620981E-2,2.8087217844464819E-2,2.8048182183594918E-2,2.8007162441673485E-2,2.7964055952419888E-2,2.7919965863790547E-2,2.787545718917292E-2,2.7830232285196339E-2,2.7784182507630744E-2,2.7738543315613453E-2,2.7693425597584038E-2,2.7648487797164868E-2,2.7603671381839126E-2,2.7558880872687784E-2,2.7513747444933068E-2,2.7468258905423312E-2,2.7422195028649086E-2,2.7375301589825856E-2,2.7327115725008597E-2,2.7277740308235338E-2,2.7227160019765589E-2,2.717485054755751E-2,2.7121096735506531E-2,2.7065672462263397E-2,2.7008595653938924E-2,2.6949885064578245E-2,2.6889767728525568E-2,2.6828080942376775E-2,2.6765033371695345E-2,2.6700462268082602E-2,2.6634275888590006E-2,2.6566858856925956E-2,2.6498002821688332E-2,2.6428165345171988E-2,2.6357294119585907E-2,2.6285596474938958E-2]
[null,"GB",2.8322871389802086E-2,2.8208245582200128E-2,2.7974252599514745E-2,2.7910405474814791E-2,2.7851128473809099E-2,2.7856071936605685E-2,2.7865460811537575E-2,2.7869921763504762E-2,2.7932785980355243E-2,2.7971892570565125E-2,2.8148829233140864E-2,2.8212825730370327E-2,2.8312921915599535E-2,2.8391252825785751E-2,2.8466845855322741E-2,2.8551849654238862E-2,2.8647169606316324E-2,2.8653738410655872E-2,2.8663716973651013E-2,2.8676141540817261E-2,2.8788369985348745E-2,2.9006885115249289E-2,2.9165506087024749E-2,2.9237882970699985E-2,2.9252514824649627E-2,2.9410168735598007E-2,2.9505163921402469E-2,2.9539642799292921E-2,2.9453455286692139E-2,2.9420503434254439E-2,2.9409865527077434E-2,2.9436274127290479E-2,2.9429897620819E-2,2.9432536064276062E-2,2.9440543234700224E-2,2.9502284882540114E-2,2.9579582050257399E-2,2.9630507989061465E-2,2.9657946787679933E-2,2.9609463436721759E-2,2.9515119373751439E-2,2.946982453532079E-2,2.9380948328326047E-2,2.9327700963887291E-2,2.927075297509896E-2,2.9193552180027248E-2,2.9147941363547914E-2,2.9148366522622201E-2,2.9138436871165203E-2,2.9127615617094354E-2,2.9116413291188546E-2,2.9100653338511282E-2,2.9079299422891391E-2,2.9060433890544177E-2,2.9035359753801029E-2,2.9006934011665462E-2,2.8974721732679308E-2,2.8938266437176299E-2,2.8898907762250237E-2,2.8857584984622174E-2,2.881416545416967E-2,2.8768541043839298E-2,2.8721879766412686E-2,2.8674779785492373E-2,2.8626926293557231E-2,2.8578204558833788E-2,2.8529921786890171E-2,2.8482195149821487E-2,2.8434663236680729E-2,2.838726409124329E-2,2.8339896710064733E-2,2.8292171095112836E-2,2.8244074455100052E-2,2.8195374075451845E-2,2.8145801391402849E-2,2.8094867418225214E-2,2.8042681285898693E-2,2.7989227187221646E-2,2.793395150490605E-2,2.7877155773962964E-2,2.7818601622126047E-2,2.7758308586591434E-2,2.7696297087809112E-2,2.7632807503995053E-2,2.7567668586610992E-2,2.7501101264806257E-2,2.7432934295132577E-2,2.7363071483644606E-2,2.7291919428312533E-2,2.7219258818669708E-2,2.714557303780453E-2,2.7070807350990614E-2,2.6995180907029102E-2]
[null,"England",3.3190186957168126E-2,3.3045183898445199E-2,3.2771846926929159E-2,3.2708947854344327E-2,3.2641405138577037E-2,3.2651613055321591E-2,3.2661160639625382E-2,3.2660458594028073E-2,3.2726235114490743E-2,3.2760519971274195E-2,3.2954669719440929E-2,3.3019113971947935E-2,3.3121927982620473E-2,3.3196276464218417E-2,3.326473625827181E-2,3.3345645890021952E-2,3.3444833447497276E-2,3.3439423946950472E-2,3.3445734942495378E-2,3.3451260086668301E-2,3.3572741514360314E-2,3.3819388307846157E-2,3.4001534230171944E-2,3.4081440964734762E-2,3.4084574286688644E-2,3.4249419300852652E-2,3.4342296690831976E-2,3.4366005333814002E-2,3.4242437220723232E-2,3.4183042777957195E-2,3.4152643999862488E-2,3.4169845388320692E-2,3.4149362550199798E-2,3.4147936232184338E-2,3.4140872623799549E-2,3.420202412626655E-2,3.4286595654822491E-2,3.4336024270542442E-2,3.4357407790575598E-2,3.4284712922068673E-2,3.4163314955410945E-2,3.4090631233210641E-2,3.3968213597496001E-2,3.3884631954135568E-2,3.3797153667979037E-2,3.3692799282045161E-2,3.3629086191564864E-2,3.361443122409636E-2,3.3584714727659865E-2,3.35551753602382E-2,3.3525836394273548E-2,3.3491803417489634E-2,3.345215302097531E-2,3.3415685278125475E-2,3.3372858377166401E-2,3.3326412480150863E-2,3.3275820417616453E-2,3.3220530262204888E-2,3.3161992769956863E-2,3.3101224805640407E-2,3.3038064795120156E-2,3.2972321473145196E-2,3.2905268856597135E-2,3.2837591270078348E-2,3.2768938889551118E-2,3.2699179326048815E-2,3.2629802696081692E-2,3.2560951224028904E-2,3.2492230175927367E-2,3.2423628632705113E-2,3.2355056433598053E-2,3.2286094875250582E-2,3.2216763454864947E-2,3.2146809669178537E-2,3.2075965413325087E-2,3.2003692620184293E-2,3.1930149370504278E-2,3.1855348772628689E-2,3.1778705246144547E-2,3.1700575635199423E-2,3.1620728918524028E-2,3.1539216024528839E-2,3.1456062541406399E-2,3.1371569842210532E-2,3.1285546866544056E-2,3.119824624594451E-2,3.1109450879953208E-2,3.1019063195754676E-2,3.092749833804511E-2,3.0834499275553068E-2,3.07405815843593E-2,3.0645642969350448E-2,3.0549896589914118E-2]
[null,"England & Wales",3.133978271484375E-2,3.1199421818837919E-2,3.0934572069795184E-2,3.0867330127213811E-2,3.0796930652640601E-2,3.0803591647256729E-2,3.0811037127531332E-2,3.0808009303736665E-2,3.0868684379557327E-2,3.0900812450859828E-2,3.108664774158193E-2,3.1151576391241911E-2,3.1250579438498904E-2,3.1326089099251504E-2,3.1394442126881236E-2,3.1470964128923869E-2,3.1561438860403405E-2,3.154884734396609E-2,3.1551304458229762E-2,3.1558070908968644E-2,3.1672085599432492E-2,3.1906450427217709E-2,3.207851582496337E-2,3.2156283135287837E-2,3.2164358714308006E-2,3.2323245880211009E-2,3.241409472902286E-2,3.243939976914198E-2,3.2329921919377669E-2,3.2277283171142417E-2,3.2254416070313353E-2,3.2271159761378801E-2,3.2251623057249657E-2,3.2247930463576158E-2,3.2248685494994898E-2,3.2309247853140544E-2,3.2391381091944088E-2,3.2441531824265429E-2,3.2467154156852591E-2,3.2407110472684832E-2,3.2299905645261792E-2,3.2238022337796414E-2,3.2129637108811164E-2,3.2059621729148592E-2,3.198770328960325E-2,3.1896120846915024E-2,3.1839751675613148E-2,3.1829742869627309E-2,3.1809150676886618E-2,3.1788072031809736E-2,3.1767223310749271E-2,3.1742008065809339E-2,3.1711294886781947E-2,3.1683945594541678E-2,3.1650409298866457E-2,3.1613318039217256E-2,3.1572187823747135E-2,3.152651163178366E-2,3.1477681158888403E-2,3.1426684763652638E-2,3.1373369384308056E-2,3.1317574499762815E-2,3.1260524261467353E-2,3.1202869944144333E-2,3.1144284788607163E-2,3.1084637934633751E-2,3.1025341737332297E-2,3.0966526736627774E-2,3.0907813580345139E-2,3.0849177212667254E-2,3.0790518409350563E-2,3.0731437144713616E-2,3.0671924060245163E-2,3.0611745847068789E-2,3.0550629947987015E-2,3.0488045123862613E-2,3.0424139895852468E-2,3.0358900708957193E-2,3.0291766943191002E-2,3.0223063527527325E-2,3.0152569544024503E-2,3.0080325173442765E-2,3.0006358061431253E-2,2.9930945486844357E-2,2.9853905193465334E-2,2.9775476285326136E-2,2.9695467284117583E-2,2.9613774987500872E-2,2.9530822236378651E-2,2.9446358586291077E-2,2.9360888495580214E-2,2.9274328579858209E-2,2.9186893461557929E-2]
["UK"]
["country",1]
["end year",91]
["start year",30]
["country",{"$f":"OFFSET($B$440,B446,0)","v":"UK"}]
["end year",{"$f":"OFFSET($C$305,B447,0)","v":2061}]
["start year",{"$f":"OFFSET($C$305,B448,0)","v":2000}]
[]
[{"$f":"\"Northern Ireland's population share of UK regions\"&\" (\"&B451&\"-\"&B450&\")\"","v":"Northern Ireland's population share of UK regions (2000-2061)"}]
["check1",true]
["check2",true]
["check3",true]
["check4",true]
["labels",false]
[]
["Data for age distribution"]
["Males","0-15",246007,246116,245075,244834,243850,242163,239798,236848,233798,231270,228025,224574,221776,219376,217792,216783,216009,215281,214052,213053,213242,213806,213918,213497,212926,212221,211448,210531,208712,206747,204111,200873,197868,195571,194208,193348,193409,194066,194729,195016,195331,196009,196102,196674,197411,198891,200274,201765,202858,203436,203675,203442,202385,200672,198743,196933,194901,192563,190651,188736,186828,184615,182901,181612,180621,179837,179262,178917,178778,178814,179003,179340,179800,180341,180929,181523,182088,182591,183000,183288,183430,183399,183186,182782,182195,181437,180537,179516,178405,177239,176066,174915,173808]
["Males","16-39",248911,251990,252313,253139,253579,257632,260118,263442,268185,272113,273721,276058,278796,281033,283811,285889,287658,286575,286723,286724,287973,292662,294806,295424,294116,296049,297257,295963,292671,291131,290845,292720,293357,293494,294345,295347,297054,297718,297714,296444,294222,292562,289908,289701,290556,290911,290319,290764,290644,290234,289778,289803,290289,291119,291575,291713,291805,292142,292078,291838,291584,291675,291751,291362,290618,289845,289103,288296,287718,287267,287358,287465,287507,287127,286556,285681,284165,282122,280030,278161,276198,274091,272521,271085,269764,268256,267290,266737,266440,266275,266198,266198,266239]
["Males","40-64",192443,191844,189998,188161,186720,184510,184076,182838,182510,180347,180348,181589,183943,185867,186960,188228,190282,192304,194353,196561,199032,201632,204883,207917,211049,215190,219174,223670,227965,232480,237491,241921,246854,252405,258330,264090,269262,273621,277253,280755,284056,286511,288167,289674,291154,292030,293180,294238,295449,297253,298841,299778,300332,300982,301706,302044,302442,302290,301915,301580,301361,301221,300496,300190,300140,300027,299896,299943,300176,300468,300419,300302,300132,299962,299289,298780,299199,300109,300843,301121,301434,301827,301817,301871,301803,302030,301848,301735,301347,300730,300126,299508,298823]
["Males","16-64",441354,443834,442311,441300,440299,442142,444194,446280,450695,452460,454069,457647,462739,466900,470771,474117,477940,478879,481076,483285,487005,494294,499689,503341,505165,511239,516431,519633,520636,523611,528336,534641,540211,545899,552675,559437,566316,571339,574967,577199,578278,579073,578075,579375,581710,582941,583499,585002,586093,587487,588619,589581,590621,592101,593281,593757,594247,594432,593993,593418,592945,592896,592247,591552,590758,589872,588999,588239,587894,587735,587777,587767,587639,587089,585845,584461,583364,582231,580873,579282,577632,575918,574338,572956,571567,570286,569138,568472,567787,567005,566324,565706,565062]
["Males","60+",102897,103731,104442,104523,104835,104180,103734,102835,102690,101517,106054,106986,107801,108683,109678,110471,111737,112270,113301,114033,115248,116249,117057,117621,118472,119910,121250,122722,124041,125384,127299,129650,132753,136094,139257,142704,146419,150032,153846,157956,161828,165547,169318,173556,177434,181664,186031,190344,195232,199948,205041,210102,215532,220943,226300,231371,236149,240922,245197,249182,252962,256507,259687,262223,264376,266146,267772,269325,271144,273526,275907,277877,279798,281867,284119,286374,288688,290864,292858,294885,296820,298627,299934,301259,302658,303913,305042,306130,306926,307539,307593,307575,307581]
["Males","65+",67252,67559,68359,68859,69202,69740,69936,70443,70672,71032,74531,74516,74498,75032,76342,77483,78901,79620,80811,81546,82903,84016,84605,85108,85923,86887,87640,88505,89150,90120,91826,93472,95025,96781,98418,100325,102531,105593,108866,112320,115713,119466,122968,126662,130008,133381,136475,139433,143062,146425,149958,153654,157612,161586,165590,169943,174250,178901,183530,188106,192401,196409,200404,203927,207168,210228,213071,215583,217482,219034,220227,221292,222312,223610,225467,227329,228809,230247,231833,233615,235425,237308,239090,240734,242441,244107,245696,246844,248048,249368,250586,251712,252831]
["Males","Custom",{"$f":"IF(AND('Population Proportion'!$D$21<>\"\",'Population Proportion'!$D$22<>\"\",'Population Proportion'!$D$21>=0,'Population Proportion'!$D$22<=90,'Population Proportion'!$D$21<='Population Proportion'!$D$22),SUM(OFFSET(C$1,MATCH('Population Proportion'!$D$21,$G$306:$G$396,0),0,'Population Proportion'!$D$22-'Population Proportion'!$D$21+1,1)),NA())","v":80337},{"$f":"IF(AND('Population Proportion'!$D$21<>\"\",'Population Proportion'!$D$22<>\"\",'Population Proportion'!$D$21>=0,'Population Proportion'!$D$22<=90,'Population Proportion'!$D$21<='Population Proportion'!$D$22),SUM(OFFSET(D$1,MATCH('Population Proportion'!$D$21,$G$306:$G$396,0),0,'Population Proportion'!$D$22-'Population Proportion'!$D$21+1,1)),NA())","v":79106},{"$f":"IF(AND('Population Proportion'!$D$21<>\"\",'Population Proportion'!$D$22<>\"\",'Population Proportion'!$D$21>=0,'Population Proportion'!$D$22<=90,'Population Proportion'!$D$21<='Population Proportion'!$D$22),SUM(OFFSET(E$1,MATCH('Population Proportion'!$D$21,$G$306:$G$396,0),0,'Population Proportion'!$D$22-'Population Proportion'!$D$21+1,1)),NA())","v":77124},{"$f":"IF(AND('Population Proportion'!$D$21<>\"\",'Population Proportion'!$D$22<>\"\",'Population Proportion'!$D$21>=0,'Population Proportion'!$D$22<=90,'Population Proportion'!$D$21<='Population Proportion'!$D$22),SUM(OFFSET(F$1,MATCH('Population Proportion'!$D$21,$G$306:$G$396,0),0,'Population Proportion'!$D$22-'Population Proportion'!$D$21+1,1)),NA())","v":75470},{"$f":"IF(AND('Population Proportion'!$D$21<>\"\",'Population Proportion'!$D$22<>\"\",'Population Proportion'!$D$21>=0,'Population Proportion'!$D$22<=90,'Population Proportion'!$D$21<='Population Proportion'!$D$22),SUM(OFFSET(G$1,MATCH('Population Proportion'!$D$21,$G$306:$G$396,0),0,'Population Proportion'!$D$22-'Population Proportion'!$D$21+1,1)),NA())","v":73391},{"$f":"IF(AND('Population Proportion'!$D$21<>\"\",'Population Proportion'!$D$22<>\"\",'Population Proportion'!$D$21>=0,'Population Proportion'!$D$22<=90,'Population Proportion'!$D$21<='Population Proportion'!$D$22),SUM(OFFSET(H$1,MATCH('Population Proportion'!$D$21,$G$306:$G$396,0),0,'Population Proportion'!$D$22-'Population Proportion'!$D$21+1,1)),NA())","v":71282},{"$f":"IF(AND('Population Proportion'!$D$21<>\"\",'Population Proportion'!$D$22<>\"\",'Population Proportion'!$D$21>=0,'Population Proportion'!$D$22<=90,'Population Proportion'!$D$21<='Population Proportion'!$D$22),SUM(OFFSET(I$1,MATCH('Population Proportion'!$D$21,$G$306:$G$396,0),0,'Population Proportion'!$D$22-'Population Proportion'!$D$21+1,1)),NA())","v":68889},{"$f":"IF(AND('Population Proportion'!$D$21<>\"\",'Population Proportion'!$D$22<>\"\",'Population Proportion'!$D$21>=0,'Population Proportion'!$D$22<=90,'Population Proportion'!$D$21<='Population Proportion'!$D$22),SUM(OFFSET(J$1,MATCH('Population Proportion'!$D$21,$G$306:$G$396,0),0,'Population Proportion'!$D$22-'Population Proportion'!$D$21+1,1)),NA())","v":66908},{"$f":"IF(AND('Population Proportion'!$D$21<>\"\",'Population Proportion'!$D$22<>\"\",'Population Proportion'!$D$21>=0,'Population Proportion'!$D$22<=90,'Population Proportion'!$D$21<='Population Proportion'!$D$22),SUM(OFFSET(K$1,MATCH('Population Proportion'!$D$21,$G$306:$G$396,0),0,'Population Proportion'!$D$22-'Population Proportion'!$D$21+1,1)),NA())","v":66021},{"$f":"IF(AND('Population Proportion'!$D$21<>\"\",'Population Proportion'!$D$22<>\"\",'Population Proportion'!$D$21>=0,'Population Proportion'!$D$22<=90,'Population Proportion'!$D$21<='Population Proportion'!$D$22),SUM(OFFSET(L$1,MATCH('Population Proportion'!$D$21,$G$306:$G$396,0),0,'Population Proportion'!$D$22-'Population Proportion'!$D$21+1,1)),NA())","v":66557},{"$f":"IF(AND('Population Proportion'!$D$21<>\"\",'Population Proportion'!$D$22<>\"\",'Population Proportion'!$D$21>=0,'Population Proportion'!$D$22<=90,'Population Proportion'!$D$21<='Population Proportion'!$D$22),SUM(OFFSET(M$1,MATCH('Population Proportion'!$D$21,$G$306:$G$396,0),0,'Population Proportion'!$D$22-'Population Proportion'!$D$21+1,1)),NA())","v":67825},{"$f":"IF(AND('Population Proportion'!$D$21<>\"\",'Population Proportion'!$D$22<>\"\",'Population Proportion'!$D$21>=0,'Population Proportion'!$D$22<=90,'Population Proportion'!$D$21<='Population Proportion'!$D$22),SUM(OFFSET(N$1,MATCH('Population Proportion'!$D$21,$G$306:$G$396,0),0,'Population Proportion'!$D$22-'Population Proportion'!$D$21+1,1)),NA())","v":68213},{"$f":"IF(AND('Population Proportion'!$D$21<>\"\",'Population Proportion'!$D$22<>\"\",'Population Proportion'!$D$21>=0,'Population Proportion'!$D$22<=90,'Population Proportion'!$D$21<='Population Proportion'!$D$22),SUM(OFFSET(O$1,MATCH('Population Proportion'!$D$21,$G$306:$G$396,0),0,'Population Proportion'!$D$22-'Population Proportion'!$D$21+1,1)),NA())","v":68772},{"$f":"IF(AND('Population Proportion'!$D$21<>\"\",'Population Proportion'!$D$22<>\"\",'Population Proportion'!$D$21>=0,'Population Proportion'!$D$22<=90,'Population Proportion'!$D$21<='Population Proportion'!$D$22),SUM(OFFSET(P$1,MATCH('Population Proportion'!$D$21,$G$306:$G$396,0),0,'Population Proportion'!$D$22-'Population Proportion'!$D$21+1,1)),NA())","v":68913},{"$f":"IF(AND('Population Proportion'!$D$21<>\"\",'Population Proportion'!$D$22<>\"\",'Population Proportion'!$D$21>=0,'Population Proportion'!$D$22<=90,'Population Proportion'!$D$21<='Population Proportion'!$D$22),SUM(OFFSET(Q$1,MATCH('Population Proportion'!$D$21,$G$306:$G$396,0),0,'Population Proportion'!$D$22-'Population Proportion'!$D$21+1,1)),NA())","v":68763},{"$f":"IF(AND('Population Proportion'!$D$21<>\"\",'Population Proportion'!$D$22<>\"\",'Population Proportion'!$D$21>=0,'Population Proportion'!$D$22<=90,'Population Proportion'!$D$21<='Population Proportion'!$D$22),SUM(OFFSET(R$1,MATCH('Population Proportion'!$D$21,$G$306:$G$396,0),0,'Population Proportion'!$D$22-'Population Proportion'!$D$21+1,1)),NA())","v":68984},{"$f":"IF(AND('Population Proportion'!$D$21<>\"\",'Population Proportion'!$D$22<>\"\",'Population Proportion'!$D$21>=0,'Population Proportion'!$D$22<=90,'Population Proportion'!$D$21<='Population Proportion'!$D$22),SUM(OFFSET(S$1,MATCH('Population Proportion'!$D$21,$G$306:$G$396,0),0,'Population Proportion'!$D$22-'Population Proportion'!$D$21+1,1)),NA())","v":69568},{"$f":"IF(AND('Population Proportion'!$D$21<>\"\",'Population Proportion'!$D$22<>\"\",'Population Proportion'!$D$21>=0,'Population Proportion'!$D$22<=90,'Population Proportion'!$D$21<='Population Proportion'!$D$22),SUM(OFFSET(T$1,MATCH('Population Proportion'!$D$21,$G$306:$G$396,0),0,'Population Proportion'!$D$22-'Population Proportion'!$D$21+1,1)),NA())","v":69541},{"$f":"IF(AND('Population Proportion'!$D$21<>\"\",'Population Proportion'!$D$22<>\"\",'Population Proportion'!$D$21>=0,'Population Proportion'!$D$22<=90,'Population Proportion'!$D$21<='Population Proportion'!$D$22),SUM(OFFSET(U$1,MATCH('Population Proportion'!$D$21,$G$306:$G$396,0),0,'Population Proportion'!$D$22-'Population Proportion'!$D$21+1,1)),NA())","v":69072},{"$f":"IF(AND('Population Proportion'!$D$21<>\"\",'Population Proportion'!$D$22<>\"\",'Population Proportion'!$D$21>=0,'Population Proportion'!$D$22<=90,'Population Proportion'!$D$21<='Population Proportion'!$D$22),SUM(OFFSET(V$1,MATCH('Population Proportion'!$D$21,$G$306:$G$396,0),0,'Population Proportion'!$D$22-'Population Proportion'!$D$21+1,1)),NA())","v":68166},{"$f":"IF(AND('Population Proportion'!$D$21<>\"\",'Population Proportion'!$D$22<>\"\",'Population Proportion'!$D$21>=0,'Population Proportion'!$D$22<=90,'Population Proportion'!$D$21<='Population Proportion'!$D$22),SUM(OFFSET(W$1,MATCH('Population Proportion'!$D$21,$G$306:$G$396,0),0,'Population Proportion'!$D$22-'Population Proportion'!$D$21+1,1)),NA())","v":67714},{"$f":"IF(AND('Population Proportion'!$D$21<>\"\",'Population Proportion'!$D$22<>\"\",'Population Proportion'!$D$21>=0,'Population Proportion'!$D$22<=90,'Population Proportion'!$D$21<='Population Proportion'!$D$22),SUM(OFFSET(X$1,MATCH('Population Proportion'!$D$21,$G$306:$G$396,0),0,'Population Proportion'!$D$22-'Population Proportion'!$D$21+1,1)),NA())","v":67247},{"$f":"IF(AND('Population Proportion'!$D$21<>\"\",'Population Proportion'!$D$22<>\"\",'Population Proportion'!$D$21>=0,'Population Proportion'!$D$22<=90,'Population Proportion'!$D$21<='Population Proportion'!$D$22),SUM(OFFSET(Y$1,MATCH('Population Proportion'!$D$21,$G$306:$G$396,0),0,'Population Proportion'!$D$22-'Population Proportion'!$D$21+1,1)),NA())","v":66117},{"$f":"IF(AND('Population Proportion'!$D$21<>\"\",'Population Proportion'!$D$22<>\"\",'Population Proportion'!$D$21>=0,'Population Proportion'!$D$22<=90,'Population Proportion'!$D$21<='Population Proportion'!$D$22),SUM(OFFSET(Z$1,MATCH('Population Proportion'!$D$21,$G$306:$G$396,0),0,'Population Proportion'!$D$22-'Population Proportion'!$D$21+1,1)),NA())","v":64859},{"$f":"IF(AND('Population Proportion'!$D$21<>\"\",'Population Proportion'!$D$22<>\"\",'Population Proportion'!$D$21>=0,'Population Proportion'!$D$22<=90,'Population Proportion'!$D$21<='Population Proportion'!$D$22),SUM(OFFSET(AA$1,MATCH('Population Proportion'!$D$21,$G$306:$G$396,0),0,'Population Proportion'!$D$22-'Population Proportion'!$D$21+1,1)),NA())","v":63748},{"$f":"IF(AND('Population Proportion'!$D$21<>\"\",'Population Proportion'!$D$22<>\"\",'Population Proportion'!$D$21>=0,'Population Proportion'!$D$22<=90,'Population Proportion'!$D$21<='Population Proportion'!$D$22),SUM(OFFSET(AB$1,MATCH('Population Proportion'!$D$21,$G$306:$G$396,0),0,'Population Proportion'!$D$22-'Population Proportion'!$D$21+1,1)),NA())","v":62938},{"$f":"IF(AND('Population Proportion'!$D$21<>\"\",'Population Proportion'!$D$22<>\"\",'Population Proportion'!$D$21>=0,'Population Proportion'!$D$22<=90,'Population Proportion'!$D$21<='Population Proportion'!$D$22),SUM(OFFSET(AC$1,MATCH('Population Proportion'!$D$21,$G$306:$G$396,0),0,'Population Proportion'!$D$22-'Population Proportion'!$D$21+1,1)),NA())","v":62259},{"$f":"IF(AND('Population Proportion'!$D$21<>\"\",'Population Proportion'!$D$22<>\"\",'Population Proportion'!$D$21>=0,'Population Proportion'!$D$22<=90,'Population Proportion'!$D$21<='Population Proportion'!$D$22),SUM(OFFSET(AD$1,MATCH('Population Proportion'!$D$21,$G$306:$G$396,0),0,'Population Proportion'!$D$22-'Population Proportion'!$D$21+1,1)),NA())","v":61693},{"$f":"IF(AND('Population Proportion'!$D$21<>\"\",'Population Proportion'!$D$22<>\"\",'Population Proportion'!$D$21>=0,'Population Proportion'!$D$22<=90,'Population Proportion'!$D$21<='Population Proportion'!$D$22),SUM(OFFSET(AE$1,MATCH('Population Proportion'!$D$21,$G$306:$G$396,0),0,'Population Proportion'!$D$22-'Population Proportion'!$D$21+1,1)),NA())","v":61253},{"$f":"IF(AND('Population Proportion'!$D$21<>\"\",'Population Proportion'!$D$22<>\"\",'Population Proportion'!$D$21>=0,'Population Proportion'!$D$22<=90,'Population Proportion'!$D$21<='Population Proportion'!$D$22),SUM(OFFSET(AF$1,MATCH('Population Proportion'!$D$21,$G$306:$G$396,0),0,'Population Proportion'!$D$22-'Population Proportion'!$D$21+1,1)),NA())","v":60375},{"$f":"IF(AND('Population Proportion'!$D$21<>\"\",'Population Proportion'!$D$22<>\"\",'Population Proportion'!$D$21>=0,'Population Proportion'!$D$22<=90,'Population Proportion'!$D$21<='Population Proportion'!$D$22),SUM(OFFSET(AG$1,MATCH('Population Proportion'!$D$21,$G$306:$G$396,0),0,'Population Proportion'!$D$22-'Population Proportion'!$D$21+1,1)),NA())","v":59050},{"$f":"IF(AND('Population Proportion'!$D$21<>\"\",'Population Proportion'!$D$22<>\"\",'Population Proportion'!$D$21>=0,'Population Proportion'!$D$22<=90,'Population Proportion'!$D$21<='Population Proportion'!$D$22),SUM(OFFSET(AH$1,MATCH('Population Proportion'!$D$21,$G$306:$G$396,0),0,'Population Proportion'!$D$22-'Population Proportion'!$D$21+1,1)),NA())","v":57552},{"$f":"IF(AND('Population Proportion'!$D$21<>\"\",'Population Proportion'!$D$22<>\"\",'Population Proportion'!$D$21>=0,'Population Proportion'!$D$22<=90,'Population Proportion'!$D$21<='Population Proportion'!$D$22),SUM(OFFSET(AI$1,MATCH('Population Proportion'!$D$21,$G$306:$G$396,0),0,'Population Proportion'!$D$22-'Population Proportion'!$D$21+1,1)),NA())","v":56526},{"$f":"IF(AND('Population Proportion'!$D$21<>\"\",'Population Proportion'!$D$22<>\"\",'Population Proportion'!$D$21>=0,'Population Proportion'!$D$22<=90,'Population Proportion'!$D$21<='Population Proportion'!$D$22),SUM(OFFSET(AJ$1,MATCH('Population Proportion'!$D$21,$G$306:$G$396,0),0,'Population Proportion'!$D$22-'Population Proportion'!$D$21+1,1)),NA())","v":55866},{"$f":"IF(AND('Population Proportion'!$D$21<>\"\",'Population Proportion'!$D$22<>\"\",'Population Proportion'!$D$21>=0,'Population Proportion'!$D$22<=90,'Population Proportion'!$D$21<='Population Proportion'!$D$22),SUM(OFFSET(AK$1,MATCH('Population Proportion'!$D$21,$G$306:$G$396,0),0,'Population Proportion'!$D$22-'Population Proportion'!$D$21+1,1)),NA())","v":56051},{"$f":"IF(AND('Population Proportion'!$D$21<>\"\",'Population Proportion'!$D$22<>\"\",'Population Proportion'!$D$21>=0,'Population Proportion'!$D$22<=90,'Population Proportion'!$D$21<='Population Proportion'!$D$22),SUM(OFFSET(AL$1,MATCH('Population Proportion'!$D$21,$G$306:$G$396,0),0,'Population Proportion'!$D$22-'Population Proportion'!$D$21+1,1)),NA())","v":56802},{"$f":"IF(AND('Population Proportion'!$D$21<>\"\",'Population Proportion'!$D$22<>\"\",'Population Proportion'!$D$21>=0,'Population Proportion'!$D$22<=90,'Population Proportion'!$D$21<='Population Proportion'!$D$22),SUM(OFFSET(AM$1,MATCH('Population Proportion'!$D$21,$G$306:$G$396,0),0,'Population Proportion'!$D$22-'Population Proportion'!$D$21+1,1)),NA())","v":58442},{"$f":"IF(AND('Population Proportion'!$D$21<>\"\",'Population Proportion'!$D$22<>\"\",'Population Proportion'!$D$21>=0,'Population Proportion'!$D$22<=90,'Population Proportion'!$D$21<='Population Proportion'!$D$22),SUM(OFFSET(AN$1,MATCH('Population Proportion'!$D$21,$G$306:$G$396,0),0,'Population Proportion'!$D$22-'Population Proportion'!$D$21+1,1)),NA())","v":60564},{"$f":"IF(AND('Population Proportion'!$D$21<>\"\",'Population Proportion'!$D$22<>\"\",'Population Proportion'!$D$21>=0,'Population Proportion'!$D$22<=90,'Population Proportion'!$D$21<='Population Proportion'!$D$22),SUM(OFFSET(AO$1,MATCH('Population Proportion'!$D$21,$G$306:$G$396,0),0,'Population Proportion'!$D$22-'Population Proportion'!$D$21+1,1)),NA())","v":62084},{"$f":"IF(AND('Population Proportion'!$D$21<>\"\",'Population Proportion'!$D$22<>\"\",'Population Proportion'!$D$21>=0,'Population Proportion'!$D$22<=90,'Population Proportion'!$D$21<='Population Proportion'!$D$22),SUM(OFFSET(AP$1,MATCH('Population Proportion'!$D$21,$G$306:$G$396,0),0,'Population Proportion'!$D$22-'Population Proportion'!$D$21+1,1)),NA())","v":63311},{"$f":"IF(AND('Population Proportion'!$D$21<>\"\",'Population Proportion'!$D$22<>\"\",'Population Proportion'!$D$21>=0,'Population Proportion'!$D$22<=90,'Population Proportion'!$D$21<='Population Proportion'!$D$22),SUM(OFFSET(AQ$1,MATCH('Population Proportion'!$D$21,$G$306:$G$396,0),0,'Population Proportion'!$D$22-'Population Proportion'!$D$21+1,1)),NA())","v":64543},{"$f":"IF(AND('Population Proportion'!$D$21<>\"\",'Population Proportion'!$D$22<>\"\",'Population Proportion'!$D$21>=0,'Population Proportion'!$D$22<=90,'Population Proportion'!$D$21<='Population Proportion'!$D$22),SUM(OFFSET(AR$1,MATCH('Population Proportion'!$D$21,$G$306:$G$396,0),0,'Population Proportion'!$D$22-'Population Proportion'!$D$21+1,1)),NA())","v":65147},{"$f":"IF(AND('Population Proportion'!$D$21<>\"\",'Population Proportion'!$D$22<>\"\",'Population Proportion'!$D$21>=0,'Population Proportion'!$D$22<=90,'Population Proportion'!$D$21<='Population Proportion'!$D$22),SUM(OFFSET(AS$1,MATCH('Population Proportion'!$D$21,$G$306:$G$396,0),0,'Population Proportion'!$D$22-'Population Proportion'!$D$21+1,1)),NA())","v":64699},{"$f":"IF(AND('Population Proportion'!$D$21<>\"\",'Population Proportion'!$D$22<>\"\",'Population Proportion'!$D$21>=0,'Population Proportion'!$D$22<=90,'Population Proportion'!$D$21<='Population Proportion'!$D$22),SUM(OFFSET(AT$1,MATCH('Population Proportion'!$D$21,$G$306:$G$396,0),0,'Population Proportion'!$D$22-'Population Proportion'!$D$21+1,1)),NA())","v":64213},{"$f":"IF(AND('Population Proportion'!$D$21<>\"\",'Population Proportion'!$D$22<>\"\",'Population Proportion'!$D$21>=0,'Population Proportion'!$D$22<=90,'Population Proportion'!$D$21<='Population Proportion'!$D$22),SUM(OFFSET(AU$1,MATCH('Population Proportion'!$D$21,$G$306:$G$396,0),0,'Population Proportion'!$D$22-'Population Proportion'!$D$21+1,1)),NA())","v":63979},{"$f":"IF(AND('Population Proportion'!$D$21<>\"\",'Population Proportion'!$D$22<>\"\",'Population Proportion'!$D$21>=0,'Population Proportion'!$D$22<=90,'Population Proportion'!$D$21<='Population Proportion'!$D$22),SUM(OFFSET(AV$1,MATCH('Population Proportion'!$D$21,$G$306:$G$396,0),0,'Population Proportion'!$D$22-'Population Proportion'!$D$21+1,1)),NA())","v":64023},{"$f":"IF(AND('Population Proportion'!$D$21<>\"\",'Population Proportion'!$D$22<>\"\",'Population Proportion'!$D$21>=0,'Population Proportion'!$D$22<=90,'Population Proportion'!$D$21<='Population Proportion'!$D$22),SUM(OFFSET(AW$1,MATCH('Population Proportion'!$D$21,$G$306:$G$396,0),0,'Population Proportion'!$D$22-'Population Proportion'!$D$21+1,1)),NA())","v":63161},{"$f":"IF(AND('Population Proportion'!$D$21<>\"\",'Population Proportion'!$D$22<>\"\",'Population Proportion'!$D$21>=0,'Population Proportion'!$D$22<=90,'Population Proportion'!$D$21<='Population Proportion'!$D$22),SUM(OFFSET(AX$1,MATCH('Population Proportion'!$D$21,$G$306:$G$396,0),0,'Population Proportion'!$D$22-'Population Proportion'!$D$21+1,1)),NA())","v":62618},{"$f":"IF(AND('Population Proportion'!$D$21<>\"\",'Population Proportion'!$D$22<>\"\",'Population Proportion'!$D$21>=0,'Population Proportion'!$D$22<=90,'Population Proportion'!$D$21<='Population Proportion'!$D$22),SUM(OFFSET(AY$1,MATCH('Population Proportion'!$D$21,$G$306:$G$396,0),0,'Population Proportion'!$D$22-'Population Proportion'!$D$21+1,1)),NA())","v":61809},{"$f":"IF(AND('Population Proportion'!$D$21<>\"\",'Population Proportion'!$D$22<>\"\",'Population Proportion'!$D$21>=0,'Population Proportion'!$D$22<=90,'Population Proportion'!$D$21<='Population Proportion'!$D$22),SUM(OFFSET(AZ$1,MATCH('Population Proportion'!$D$21,$G$306:$G$396,0),0,'Population Proportion'!$D$22-'Population Proportion'!$D$21+1,1)),NA())","v":60900},{"$f":"IF(AND('Population Proportion'!$D$21<>\"\",'Population Proportion'!$D$22<>\"\",'Population Proportion'!$D$21>=0,'Population Proportion'!$D$22<=90,'Population Proportion'!$D$21<='Population Proportion'!$D$22),SUM(OFFSET(BA$1,MATCH('Population Proportion'!$D$21,$G$306:$G$396,0),0,'Population Proportion'!$D$22-'Population Proportion'!$D$21+1,1)),NA())","v":59558},{"$f":"IF(AND('Population Proportion'!$D$21<>\"\",'Population Proportion'!$D$22<>\"\",'Population Proportion'!$D$21>=0,'Population Proportion'!$D$22<=90,'Population Proportion'!$D$21<='Population Proportion'!$D$22),SUM(OFFSET(BB$1,MATCH('Population Proportion'!$D$21,$G$306:$G$396,0),0,'Population Proportion'!$D$22-'Population Proportion'!$D$21+1,1)),NA())","v":58561},{"$f":"IF(AND('Population Proportion'!$D$21<>\"\",'Population Proportion'!$D$22<>\"\",'Population Proportion'!$D$21>=0,'Population Proportion'!$D$22<=90,'Population Proportion'!$D$21<='Population Proportion'!$D$22),SUM(OFFSET(BC$1,MATCH('Population Proportion'!$D$21,$G$306:$G$396,0),0,'Population Proportion'!$D$22-'Population Proportion'!$D$21+1,1)),NA())","v":57824},{"$f":"IF(AND('Population Proportion'!$D$21<>\"\",'Population Proportion'!$D$22<>\"\",'Population Proportion'!$D$21>=0,'Population Proportion'!$D$22<=90,'Population Proportion'!$D$21<='Population Proportion'!$D$22),SUM(OFFSET(BD$1,MATCH('Population Proportion'!$D$21,$G$306:$G$396,0),0,'Population Proportion'!$D$22-'Population Proportion'!$D$21+1,1)),NA())","v":57256},{"$f":"IF(AND('Population Proportion'!$D$21<>\"\",'Population Proportion'!$D$22<>\"\",'Population Proportion'!$D$21>=0,'Population Proportion'!$D$22<=90,'Population Proportion'!$D$21<='Population Proportion'!$D$22),SUM(OFFSET(BE$1,MATCH('Population Proportion'!$D$21,$G$306:$G$396,0),0,'Population Proportion'!$D$22-'Population Proportion'!$D$21+1,1)),NA())","v":56731},{"$f":"IF(AND('Population Proportion'!$D$21<>\"\",'Population Proportion'!$D$22<>\"\",'Population Proportion'!$D$21>=0,'Population Proportion'!$D$22<=90,'Population Proportion'!$D$21<='Population Proportion'!$D$22),SUM(OFFSET(BF$1,MATCH('Population Proportion'!$D$21,$G$306:$G$396,0),0,'Population Proportion'!$D$22-'Population Proportion'!$D$21+1,1)),NA())","v":56238},{"$f":"IF(AND('Population Proportion'!$D$21<>\"\",'Population Proportion'!$D$22<>\"\",'Population Proportion'!$D$21>=0,'Population Proportion'!$D$22<=90,'Population Proportion'!$D$21<='Population Proportion'!$D$22),SUM(OFFSET(BG$1,MATCH('Population Proportion'!$D$21,$G$306:$G$396,0),0,'Population Proportion'!$D$22-'Population Proportion'!$D$21+1,1)),NA())","v":55797},{"$f":"IF(AND('Population Proportion'!$D$21<>\"\",'Population Proportion'!$D$22<>\"\",'Population Proportion'!$D$21>=0,'Population Proportion'!$D$22<=90,'Population Proportion'!$D$21<='Population Proportion'!$D$22),SUM(OFFSET(BH$1,MATCH('Population Proportion'!$D$21,$G$306:$G$396,0),0,'Population Proportion'!$D$22-'Population Proportion'!$D$21+1,1)),NA())","v":55388},{"$f":"IF(AND('Population Proportion'!$D$21<>\"\",'Population Proportion'!$D$22<>\"\",'Population Proportion'!$D$21>=0,'Population Proportion'!$D$22<=90,'Population Proportion'!$D$21<='Population Proportion'!$D$22),SUM(OFFSET(BI$1,MATCH('Population Proportion'!$D$21,$G$306:$G$396,0),0,'Population Proportion'!$D$22-'Population Proportion'!$D$21+1,1)),NA())","v":55003},{"$f":"IF(AND('Population Proportion'!$D$21<>\"\",'Population Proportion'!$D$22<>\"\",'Population Proportion'!$D$21>=0,'Population Proportion'!$D$22<=90,'Population Proportion'!$D$21<='Population Proportion'!$D$22),SUM(OFFSET(BJ$1,MATCH('Population Proportion'!$D$21,$G$306:$G$396,0),0,'Population Proportion'!$D$22-'Population Proportion'!$D$21+1,1)),NA())","v":54653},{"$f":"IF(AND('Population Proportion'!$D$21<>\"\",'Population Proportion'!$D$22<>\"\",'Population Proportion'!$D$21>=0,'Population Proportion'!$D$22<=90,'Population Proportion'!$D$21<='Population Proportion'!$D$22),SUM(OFFSET(BK$1,MATCH('Population Proportion'!$D$21,$G$306:$G$396,0),0,'Population Proportion'!$D$22-'Population Proportion'!$D$21+1,1)),NA())","v":54366},{"$f":"IF(AND('Population Proportion'!$D$21<>\"\",'Population Proportion'!$D$22<>\"\",'Population Proportion'!$D$21>=0,'Population Proportion'!$D$22<=90,'Population Proportion'!$D$21<='Population Proportion'!$D$22),SUM(OFFSET(BL$1,MATCH('Population Proportion'!$D$21,$G$306:$G$396,0),0,'Population Proportion'!$D$22-'Population Proportion'!$D$21+1,1)),NA())","v":54149},{"$f":"IF(AND('Population Proportion'!$D$21<>\"\",'Population Proportion'!$D$22<>\"\",'Population Proportion'!$D$21>=0,'Population Proportion'!$D$22<=90,'Population Proportion'!$D$21<='Population Proportion'!$D$22),SUM(OFFSET(BM$1,MATCH('Population Proportion'!$D$21,$G$306:$G$396,0),0,'Population Proportion'!$D$22-'Population Proportion'!$D$21+1,1)),NA())","v":54013},{"$f":"IF(AND('Population Proportion'!$D$21<>\"\",'Population Proportion'!$D$22<>\"\",'Population Proportion'!$D$21>=0,'Population Proportion'!$D$22<=90,'Population Proportion'!$D$21<='Population Proportion'!$D$22),SUM(OFFSET(BN$1,MATCH('Population Proportion'!$D$21,$G$306:$G$396,0),0,'Population Proportion'!$D$22-'Population Proportion'!$D$21+1,1)),NA())","v":53964},{"$f":"IF(AND('Population Proportion'!$D$21<>\"\",'Population Proportion'!$D$22<>\"\",'Population Proportion'!$D$21>=0,'Population Proportion'!$D$22<=90,'Population Proportion'!$D$21<='Population Proportion'!$D$22),SUM(OFFSET(BO$1,MATCH('Population Proportion'!$D$21,$G$306:$G$396,0),0,'Population Proportion'!$D$22-'Population Proportion'!$D$21+1,1)),NA())","v":54006},{"$f":"IF(AND('Population Proportion'!$D$21<>\"\",'Population Proportion'!$D$22<>\"\",'Population Proportion'!$D$21>=0,'Population Proportion'!$D$22<=90,'Population Proportion'!$D$21<='Population Proportion'!$D$22),SUM(OFFSET(BP$1,MATCH('Population Proportion'!$D$21,$G$306:$G$396,0),0,'Population Proportion'!$D$22-'Population Proportion'!$D$21+1,1)),NA())","v":54140},{"$f":"IF(AND('Population Proportion'!$D$21<>\"\",'Population Proportion'!$D$22<>\"\",'Population Proportion'!$D$21>=0,'Population Proportion'!$D$22<=90,'Population Proportion'!$D$21<='Population Proportion'!$D$22),SUM(OFFSET(BQ$1,MATCH('Population Proportion'!$D$21,$G$306:$G$396,0),0,'Population Proportion'!$D$22-'Population Proportion'!$D$21+1,1)),NA())","v":54369},{"$f":"IF(AND('Population Proportion'!$D$21<>\"\",'Population Proportion'!$D$22<>\"\",'Population Proportion'!$D$21>=0,'Population Proportion'!$D$22<=90,'Population Proportion'!$D$21<='Population Proportion'!$D$22),SUM(OFFSET(BR$1,MATCH('Population Proportion'!$D$21,$G$306:$G$396,0),0,'Population Proportion'!$D$22-'Population Proportion'!$D$21+1,1)),NA())","v":54687},{"$f":"IF(AND('Population Proportion'!$D$21<>\"\",'Population Proportion'!$D$22<>\"\",'Population Proportion'!$D$21>=0,'Population Proportion'!$D$22<=90,'Population Proportion'!$D$21<='Population Proportion'!$D$22),SUM(OFFSET(BS$1,MATCH('Population Proportion'!$D$21,$G$306:$G$396,0),0,'Population Proportion'!$D$22-'Population Proportion'!$D$21+1,1)),NA())","v":55074},{"$f":"IF(AND('Population Proportion'!$D$21<>\"\",'Population Proportion'!$D$22<>\"\",'Population Proportion'!$D$21>=0,'Population Proportion'!$D$22<=90,'Population Proportion'!$D$21<='Population Proportion'!$D$22),SUM(OFFSET(BT$1,MATCH('Population Proportion'!$D$21,$G$306:$G$396,0),0,'Population Proportion'!$D$22-'Population Proportion'!$D$21+1,1)),NA())","v":55501},{"$f":"IF(AND('Population Proportion'!$D$21<>\"\",'Population Proportion'!$D$22<>\"\",'Population Proportion'!$D$21>=0,'Population Proportion'!$D$22<=90,'Population Proportion'!$D$21<='Population Proportion'!$D$22),SUM(OFFSET(BU$1,MATCH('Population Proportion'!$D$21,$G$306:$G$396,0),0,'Population Proportion'!$D$22-'Population Proportion'!$D$21+1,1)),NA())","v":55932},{"$f":"IF(AND('Population Proportion'!$D$21<>\"\",'Population Proportion'!$D$22<>\"\",'Population Proportion'!$D$21>=0,'Population Proportion'!$D$22<=90,'Population Proportion'!$D$21<='Population Proportion'!$D$22),SUM(OFFSET(BV$1,MATCH('Population Proportion'!$D$21,$G$306:$G$396,0),0,'Population Proportion'!$D$22-'Population Proportion'!$D$21+1,1)),NA())","v":56336},{"$f":"IF(AND('Population Proportion'!$D$21<>\"\",'Population Proportion'!$D$22<>\"\",'Population Proportion'!$D$21>=0,'Population Proportion'!$D$22<=90,'Population Proportion'!$D$21<='Population Proportion'!$D$22),SUM(OFFSET(BW$1,MATCH('Population Proportion'!$D$21,$G$306:$G$396,0),0,'Population Proportion'!$D$22-'Population Proportion'!$D$21+1,1)),NA())","v":56685},{"$f":"IF(AND('Population Proportion'!$D$21<>\"\",'Population Proportion'!$D$22<>\"\",'Population Proportion'!$D$21>=0,'Population Proportion'!$D$22<=90,'Population Proportion'!$D$21<='Population Proportion'!$D$22),SUM(OFFSET(BX$1,MATCH('Population Proportion'!$D$21,$G$306:$G$396,0),0,'Population Proportion'!$D$22-'Population Proportion'!$D$21+1,1)),NA())","v":56947},{"$f":"IF(AND('Population Proportion'!$D$21<>\"\",'Population Proportion'!$D$22<>\"\",'Population Proportion'!$D$21>=0,'Population Proportion'!$D$22<=90,'Population Proportion'!$D$21<='Population Proportion'!$D$22),SUM(OFFSET(BY$1,MATCH('Population Proportion'!$D$21,$G$306:$G$396,0),0,'Population Proportion'!$D$22-'Population Proportion'!$D$21+1,1)),NA())","v":57106},{"$f":"IF(AND('Population Proportion'!$D$21<>\"\",'Population Proportion'!$D$22<>\"\",'Population Proportion'!$D$21>=0,'Population Proportion'!$D$22<=90,'Population Proportion'!$D$21<='Population Proportion'!$D$22),SUM(OFFSET(BZ$1,MATCH('Population Proportion'!$D$21,$G$306:$G$396,0),0,'Population Proportion'!$D$22-'Population Proportion'!$D$21+1,1)),NA())","v":57151},{"$f":"IF(AND('Population Proportion'!$D$21<>\"\",'Population Proportion'!$D$22<>\"\",'Population Proportion'!$D$21>=0,'Population Proportion'!$D$22<=90,'Population Proportion'!$D$21<='Population Proportion'!$D$22),SUM(OFFSET(CA$1,MATCH('Population Proportion'!$D$21,$G$306:$G$396,0),0,'Population Proportion'!$D$22-'Population Proportion'!$D$21+1,1)),NA())","v":57085},{"$f":"IF(AND('Population Proportion'!$D$21<>\"\",'Population Proportion'!$D$22<>\"\",'Population Proportion'!$D$21>=0,'Population Proportion'!$D$22<=90,'Population Proportion'!$D$21<='Population Proportion'!$D$22),SUM(OFFSET(CB$1,MATCH('Population Proportion'!$D$21,$G$306:$G$396,0),0,'Population Proportion'!$D$22-'Population Proportion'!$D$21+1,1)),NA())","v":56908},{"$f":"IF(AND('Population Proportion'!$D$21<>\"\",'Population Proportion'!$D$22<>\"\",'Population Proportion'!$D$21>=0,'Population Proportion'!$D$22<=90,'Population Proportion'!$D$21<='Population Proportion'!$D$22),SUM(OFFSET(CC$1,MATCH('Population Proportion'!$D$21,$G$306:$G$396,0),0,'Population Proportion'!$D$22-'Population Proportion'!$D$21+1,1)),NA())","v":56639},{"$f":"IF(AND('Population Proportion'!$D$21<>\"\",'Population Proportion'!$D$22<>\"\",'Population Proportion'!$D$21>=0,'Population Proportion'!$D$22<=90,'Population Proportion'!$D$21<='Population Proportion'!$D$22),SUM(OFFSET(CD$1,MATCH('Population Proportion'!$D$21,$G$306:$G$396,0),0,'Population Proportion'!$D$22-'Population Proportion'!$D$21+1,1)),NA())","v":56289},{"$f":"IF(AND('Population Proportion'!$D$21<>\"\",'Population Proportion'!$D$22<>\"\",'Population Proportion'!$D$21>=0,'Population Proportion'!$D$22<=90,'Population Proportion'!$D$21<='Population Proportion'!$D$22),SUM(OFFSET(CE$1,MATCH('Population Proportion'!$D$21,$G$306:$G$396,0),0,'Population Proportion'!$D$22-'Population Proportion'!$D$21+1,1)),NA())","v":55876},{"$f":"IF(AND('Population Proportion'!$D$21<>\"\",'Population Proportion'!$D$22<>\"\",'Population Proportion'!$D$21>=0,'Population Proportion'!$D$22<=90,'Population Proportion'!$D$21<='Population Proportion'!$D$22),SUM(OFFSET(CF$1,MATCH('Population Proportion'!$D$21,$G$306:$G$396,0),0,'Population Proportion'!$D$22-'Population Proportion'!$D$21+1,1)),NA())","v":55413},{"$f":"IF(AND('Population Proportion'!$D$21<>\"\",'Population Proportion'!$D$22<>\"\",'Population Proportion'!$D$21>=0,'Population Proportion'!$D$22<=90,'Population Proportion'!$D$21<='Population Proportion'!$D$22),SUM(OFFSET(CG$1,MATCH('Population Proportion'!$D$21,$G$306:$G$396,0),0,'Population Proportion'!$D$22-'Population Proportion'!$D$21+1,1)),NA())","v":54928},{"$f":"IF(AND('Population Proportion'!$D$21<>\"\",'Population Proportion'!$D$22<>\"\",'Population Proportion'!$D$21>=0,'Population Proportion'!$D$22<=90,'Population Proportion'!$D$21<='Population Proportion'!$D$22),SUM(OFFSET(CH$1,MATCH('Population Proportion'!$D$21,$G$306:$G$396,0),0,'Population Proportion'!$D$22-'Population Proportion'!$D$21+1,1)),NA())","v":54437},{"$f":"IF(AND('Population Proportion'!$D$21<>\"\",'Population Proportion'!$D$22<>\"\",'Population Proportion'!$D$21>=0,'Population Proportion'!$D$22<=90,'Population Proportion'!$D$21<='Population Proportion'!$D$22),SUM(OFFSET(CI$1,MATCH('Population Proportion'!$D$21,$G$306:$G$396,0),0,'Population Proportion'!$D$22-'Population Proportion'!$D$21+1,1)),NA())","v":53952},{"$f":"IF(AND('Population Proportion'!$D$21<>\"\",'Population Proportion'!$D$22<>\"\",'Population Proportion'!$D$21>=0,'Population Proportion'!$D$22<=90,'Population Proportion'!$D$21<='Population Proportion'!$D$22),SUM(OFFSET(CJ$1,MATCH('Population Proportion'!$D$21,$G$306:$G$396,0),0,'Population Proportion'!$D$22-'Population Proportion'!$D$21+1,1)),NA())","v":53489},{"$f":"IF(AND('Population Proportion'!$D$21<>\"\",'Population Proportion'!$D$22<>\"\",'Population Proportion'!$D$21>=0,'Population Proportion'!$D$22<=90,'Population Proportion'!$D$21<='Population Proportion'!$D$22),SUM(OFFSET(CK$1,MATCH('Population Proportion'!$D$21,$G$306:$G$396,0),0,'Population Proportion'!$D$22-'Population Proportion'!$D$21+1,1)),NA())","v":53057},{"$f":"IF(AND('Population Proportion'!$D$21<>\"\",'Population Proportion'!$D$22<>\"\",'Population Proportion'!$D$21>=0,'Population Proportion'!$D$22<=90,'Population Proportion'!$D$21<='Population Proportion'!$D$22),SUM(OFFSET(CL$1,MATCH('Population Proportion'!$D$21,$G$306:$G$396,0),0,'Population Proportion'!$D$22-'Population Proportion'!$D$21+1,1)),NA())","v":52663},{"$f":"IF(AND('Population Proportion'!$D$21<>\"\",'Population Proportion'!$D$22<>\"\",'Population Proportion'!$D$21>=0,'Population Proportion'!$D$22<=90,'Population Proportion'!$D$21<='Population Proportion'!$D$22),SUM(OFFSET(CM$1,MATCH('Population Proportion'!$D$21,$G$306:$G$396,0),0,'Population Proportion'!$D$22-'Population Proportion'!$D$21+1,1)),NA())","v":52315},{"$f":"IF(AND('Population Proportion'!$D$21<>\"\",'Population Proportion'!$D$22<>\"\",'Population Proportion'!$D$21>=0,'Population Proportion'!$D$22<=90,'Population Proportion'!$D$21<='Population Proportion'!$D$22),SUM(OFFSET(CN$1,MATCH('Population Proportion'!$D$21,$G$306:$G$396,0),0,'Population Proportion'!$D$22-'Population Proportion'!$D$21+1,1)),NA())","v":52014},{"$f":"IF(AND('Population Proportion'!$D$21<>\"\",'Population Proportion'!$D$22<>\"\",'Population Proportion'!$D$21>=0,'Population Proportion'!$D$22<=90,'Population Proportion'!$D$21<='Population Proportion'!$D$22),SUM(OFFSET(CO$1,MATCH('Population Proportion'!$D$21,$G$306:$G$396,0),0,'Population Proportion'!$D$22-'Population Proportion'!$D$21+1,1)),NA())","v":51764},{"$f":"IF(AND('Population Proportion'!$D$21<>\"\",'Population Proportion'!$D$22<>\"\",'Population Proportion'!$D$21>=0,'Population Proportion'!$D$22<=90,'Population Proportion'!$D$21<='Population Proportion'!$D$22),SUM(OFFSET(CP$1,MATCH('Population Proportion'!$D$21,$G$306:$G$396,0),0,'Population Proportion'!$D$22-'Population Proportion'!$D$21+1,1)),NA())","v":51570},{"$f":"IF(AND('Population Proportion'!$D$21<>\"\",'Population Proportion'!$D$22<>\"\",'Population Proportion'!$D$21>=0,'Population Proportion'!$D$22<=90,'Population Proportion'!$D$21<='Population Proportion'!$D$22),SUM(OFFSET(CQ$1,MATCH('Population Proportion'!$D$21,$G$306:$G$396,0),0,'Population Proportion'!$D$22-'Population Proportion'!$D$21+1,1)),NA())","v":51429}]
["Males","All",754613,757509,755745,754993,753351,754045,753928,753571,755165,754762,756625,756737,759013,761308,764905,768383,772850,773780,775939,777884,783150,792116,798212,801946,804014,810347,815519,818669,818498,820478,824273,828986,833104,838251,845301,853110,862256,870998,878562,884535,889322,894548,897145,902711,909129,915213,920248,926200,932013,937348,942252,946677,950618,954359,957614,960633,963398,965896,968174,970260,972174,973920,975552,977091,978547,979937,981332,982739,984154,985583,987007,988399,989751,991040,992241,993313,994261,995069,995706,996185,996487,996625,996614,996472,996203,995830,995371,994832,994240,993612,992976,992333,991701]
["Females","0-15",236737,236569,234354,233036,231134,228804,226258,223208,221032,218742,216033,213721,211277,209154,207306,206138,205106,204692,203517,203042,203297,204163,204610,204402,203531,202906,202000,200721,198798,196442,193422,190783,188039,185676,184562,183801,183664,184419,184791,184943,185475,186132,186505,187109,187789,189110,190410,191745,192699,193409,193781,193629,192750,191093,189313,187484,185358,183121,181128,179357,177559,175774,174258,173026,172085,171343,170795,170467,170336,170367,170547,170858,171287,171802,172366,172938,173486,173973,174368,174648,174787,174759,174555,174175,173616,172901,172046,171075,170014,168911,167793,166695,165641]
["Females","16-39",242884,239605,235807,235719,236562,238407,241210,244975,249965,256282,261158,263808,267310,271147,274688,278112,279627,279735,280764,281784,284597,287496,290128,291998,293192,295892,296888,296665,295563,294984,293868,294840,295063,295237,296042,297555,300361,301613,301461,300312,298223,295995,293845,292914,292560,291246,289463,288749,287017,285153,283334,281948,280957,280608,279982,279062,278424,277803,277167,276198,275124,274187,273524,272772,272147,271526,270805,270399,270032,269951,270013,270069,270046,269856,269447,268677,267346,265368,263432,261560,259514,257521,255891,254577,253338,252206,251374,250823,250538,250375,250285,250280,250312]
["Females","40-64",207353,205462,203043,201169,199371,197718,196310,194628,194036,193631,196021,196831,199010,200727,201697,202565,204218,205804,207230,209017,210880,212790,215067,217163,219340,222686,226545,230811,235159,239912,245011,249568,254384,259489,265341,270922,276005,280215,284018,287728,291249,293606,296064,298510,300327,302194,304213,306183,308931,311720,313917,315355,316377,317340,317941,318338,318376,318341,317532,316506,315899,315046,313693,312320,310738,309021,307701,306064,304716,303393,301994,300579,299043,296892,294633,292695,291524,290990,290374,289645,288911,288308,287484,286712,285893,284973,283985,283254,282440,281858,281314,280631,280249]
["Females","16-64",450237,445067,438850,436888,435933,436125,437520,439603,444001,449913,457179,460639,466320,471874,476385,480677,483845,485539,487994,490801,495477,500286,505195,509161,512532,518578,523433,527476,530722,534896,538879,544408,549447,554726,561383,568477,576366,581828,585479,588040,589472,589601,589909,591424,592887,593440,593676,594932,595948,596873,597251,597303,597334,597948,597923,597400,596800,596144,594699,592704,591023,589233,587217,585092,582885,580547,578506,576463,574748,573344,572007,570648,569089,566748,564080,561372,558870,556358,553806,551205,548425,545829,543375,541289,539231,537179,535359,534077,532978,532233,531599,530911,530561]
["Females","60+",137679,138881,140342,141255,142180,142609,142573,142505,143271,144703,149935,151181,152596,154000,155281,156506,158127,159166,160610,161804,163208,164311,165034,165242,165590,166519,167284,168113,168833,169329,170534,172074,174575,177028,179560,182407,185799,188912,191852,195073,197963,200700,203460,206684,209468,213011,216722,220630,225293,229949,234970,240161,245278,250780,256495,261772,267025,272155,277049,281662,286163,290142,293910,297138,299861,302315,304621,306950,309892,313003,316023,318712,321317,323872,326404,329058,331485,333741,335582,337371,339134,340604,341462,342092,342272,342248,342182,341678,341031,340022,338818,337577,336369]
["Females","65+",98826,99832,101044,102025,103100,104547,105604,106843,108055,109356,113127,113448,113950,114981,116756,118303,120153,121429,122985,123868,125371,126698,127535,128198,129054,129920,130309,130903,130988,131128,132264,133357,134334,135389,136487,137725,139397,141907,144501,147315,150049,153353,156166,159254,161816,164374,166500,168764,171606,174226,177339,180872,184721,188591,192786,197321,202002,206600,211545,216669,221345,225967,230445,234685,238646,242478,245809,248938,251547,253666,255550,257292,259068,261454,264009,266465,268582,270602,272557,274475,276513,278330,279977,281248,282499,283757,284787,285284,285615,285564,285386,285233,284707]
["Females","Custom",{"$f":"IF(AND('Population Proportion'!$D$21<>\"\",'Population Proportion'!$D$22<>\"\",'Population Proportion'!$D$21>=0,'Population Proportion'!$D$22<=90,'Population Proportion'!$D$21<='Population Proportion'!$D$22),SUM(OFFSET(C$92,MATCH('Population Proportion'!$D$21,$G$306:$G$396,0),0,'Population Proportion'!$D$22-'Population Proportion'!$D$21+1,1)),NA())","v":77441},{"$f":"IF(AND('Population Proportion'!$D$21<>\"\",'Population Proportion'!$D$22<>\"\",'Population Proportion'!$D$21>=0,'Population Proportion'!$D$22<=90,'Population Proportion'!$D$21<='Population Proportion'!$D$22),SUM(OFFSET(D$92,MATCH('Population Proportion'!$D$21,$G$306:$G$396,0),0,'Population Proportion'!$D$22-'Population Proportion'!$D$21+1,1)),NA())","v":75459},{"$f":"IF(AND('Population Proportion'!$D$21<>\"\",'Population Proportion'!$D$22<>\"\",'Population Proportion'!$D$21>=0,'Population Proportion'!$D$22<=90,'Population Proportion'!$D$21<='Population Proportion'!$D$22),SUM(OFFSET(E$92,MATCH('Population Proportion'!$D$21,$G$306:$G$396,0),0,'Population Proportion'!$D$22-'Population Proportion'!$D$21+1,1)),NA())","v":72773},{"$f":"IF(AND('Population Proportion'!$D$21<>\"\",'Population Proportion'!$D$22<>\"\",'Population Proportion'!$D$21>=0,'Population Proportion'!$D$22<=90,'Population Proportion'!$D$21<='Population Proportion'!$D$22),SUM(OFFSET(F$92,MATCH('Population Proportion'!$D$21,$G$306:$G$396,0),0,'Population Proportion'!$D$22-'Population Proportion'!$D$21+1,1)),NA())","v":70523},{"$f":"IF(AND('Population Proportion'!$D$21<>\"\",'Population Proportion'!$D$22<>\"\",'Population Proportion'!$D$21>=0,'Population Proportion'!$D$22<=90,'Population Proportion'!$D$21<='Population Proportion'!$D$22),SUM(OFFSET(G$92,MATCH('Population Proportion'!$D$21,$G$306:$G$396,0),0,'Population Proportion'!$D$22-'Population Proportion'!$D$21+1,1)),NA())","v":68045},{"$f":"IF(AND('Population Proportion'!$D$21<>\"\",'Population Proportion'!$D$22<>\"\",'Population Proportion'!$D$21>=0,'Population Proportion'!$D$22<=90,'Population Proportion'!$D$21<='Population Proportion'!$D$22),SUM(OFFSET(H$92,MATCH('Population Proportion'!$D$21,$G$306:$G$396,0),0,'Population Proportion'!$D$22-'Population Proportion'!$D$21+1,1)),NA())","v":65602},{"$f":"IF(AND('Population Proportion'!$D$21<>\"\",'Population Proportion'!$D$22<>\"\",'Population Proportion'!$D$21>=0,'Population Proportion'!$D$22<=90,'Population Proportion'!$D$21<='Population Proportion'!$D$22),SUM(OFFSET(I$92,MATCH('Population Proportion'!$D$21,$G$306:$G$396,0),0,'Population Proportion'!$D$22-'Population Proportion'!$D$21+1,1)),NA())","v":64108},{"$f":"IF(AND('Population Proportion'!$D$21<>\"\",'Population Proportion'!$D$22<>\"\",'Population Proportion'!$D$21>=0,'Population Proportion'!$D$22<=90,'Population Proportion'!$D$21<='Population Proportion'!$D$22),SUM(OFFSET(J$92,MATCH('Population Proportion'!$D$21,$G$306:$G$396,0),0,'Population Proportion'!$D$22-'Population Proportion'!$D$21+1,1)),NA())","v":63016},{"$f":"IF(AND('Population Proportion'!$D$21<>\"\",'Population Proportion'!$D$22<>\"\",'Population Proportion'!$D$21>=0,'Population Proportion'!$D$22<=90,'Population Proportion'!$D$21<='Population Proportion'!$D$22),SUM(OFFSET(K$92,MATCH('Population Proportion'!$D$21,$G$306:$G$396,0),0,'Population Proportion'!$D$22-'Population Proportion'!$D$21+1,1)),NA())","v":63154},{"$f":"IF(AND('Population Proportion'!$D$21<>\"\",'Population Proportion'!$D$22<>\"\",'Population Proportion'!$D$21>=0,'Population Proportion'!$D$22<=90,'Population Proportion'!$D$21<='Population Proportion'!$D$22),SUM(OFFSET(L$92,MATCH('Population Proportion'!$D$21,$G$306:$G$396,0),0,'Population Proportion'!$D$22-'Population Proportion'!$D$21+1,1)),NA())","v":64054},{"$f":"IF(AND('Population Proportion'!$D$21<>\"\",'Population Proportion'!$D$22<>\"\",'Population Proportion'!$D$21>=0,'Population Proportion'!$D$22<=90,'Population Proportion'!$D$21<='Population Proportion'!$D$22),SUM(OFFSET(M$92,MATCH('Population Proportion'!$D$21,$G$306:$G$396,0),0,'Population Proportion'!$D$22-'Population Proportion'!$D$21+1,1)),NA())","v":64966},{"$f":"IF(AND('Population Proportion'!$D$21<>\"\",'Population Proportion'!$D$22<>\"\",'Population Proportion'!$D$21>=0,'Population Proportion'!$D$22<=90,'Population Proportion'!$D$21<='Population Proportion'!$D$22),SUM(OFFSET(N$92,MATCH('Population Proportion'!$D$21,$G$306:$G$396,0),0,'Population Proportion'!$D$22-'Population Proportion'!$D$21+1,1)),NA())","v":65548},{"$f":"IF(AND('Population Proportion'!$D$21<>\"\",'Population Proportion'!$D$22<>\"\",'Population Proportion'!$D$21>=0,'Population Proportion'!$D$22<=90,'Population Proportion'!$D$21<='Population Proportion'!$D$22),SUM(OFFSET(O$92,MATCH('Population Proportion'!$D$21,$G$306:$G$396,0),0,'Population Proportion'!$D$22-'Population Proportion'!$D$21+1,1)),NA())","v":65814},{"$f":"IF(AND('Population Proportion'!$D$21<>\"\",'Population Proportion'!$D$22<>\"\",'Population Proportion'!$D$21>=0,'Population Proportion'!$D$22<=90,'Population Proportion'!$D$21<='Population Proportion'!$D$22),SUM(OFFSET(P$92,MATCH('Population Proportion'!$D$21,$G$306:$G$396,0),0,'Population Proportion'!$D$22-'Population Proportion'!$D$21+1,1)),NA())","v":65708},{"$f":"IF(AND('Population Proportion'!$D$21<>\"\",'Population Proportion'!$D$22<>\"\",'Population Proportion'!$D$21>=0,'Population Proportion'!$D$22<=90,'Population Proportion'!$D$21<='Population Proportion'!$D$22),SUM(OFFSET(Q$92,MATCH('Population Proportion'!$D$21,$G$306:$G$396,0),0,'Population Proportion'!$D$22-'Population Proportion'!$D$21+1,1)),NA())","v":65371},{"$f":"IF(AND('Population Proportion'!$D$21<>\"\",'Population Proportion'!$D$22<>\"\",'Population Proportion'!$D$21>=0,'Population Proportion'!$D$22<=90,'Population Proportion'!$D$21<='Population Proportion'!$D$22),SUM(OFFSET(R$92,MATCH('Population Proportion'!$D$21,$G$306:$G$396,0),0,'Population Proportion'!$D$22-'Population Proportion'!$D$21+1,1)),NA())","v":65318},{"$f":"IF(AND('Population Proportion'!$D$21<>\"\",'Population Proportion'!$D$22<>\"\",'Population Proportion'!$D$21>=0,'Population Proportion'!$D$22<=90,'Population Proportion'!$D$21<='Population Proportion'!$D$22),SUM(OFFSET(S$92,MATCH('Population Proportion'!$D$21,$G$306:$G$396,0),0,'Population Proportion'!$D$22-'Population Proportion'!$D$21+1,1)),NA())","v":65527},{"$f":"IF(AND('Population Proportion'!$D$21<>\"\",'Population Proportion'!$D$22<>\"\",'Population Proportion'!$D$21>=0,'Population Proportion'!$D$22<=90,'Population Proportion'!$D$21<='Population Proportion'!$D$22),SUM(OFFSET(T$92,MATCH('Population Proportion'!$D$21,$G$306:$G$396,0),0,'Population Proportion'!$D$22-'Population Proportion'!$D$21+1,1)),NA())","v":65701},{"$f":"IF(AND('Population Proportion'!$D$21<>\"\",'Population Proportion'!$D$22<>\"\",'Population Proportion'!$D$21>=0,'Population Proportion'!$D$22<=90,'Population Proportion'!$D$21<='Population Proportion'!$D$22),SUM(OFFSET(U$92,MATCH('Population Proportion'!$D$21,$G$306:$G$396,0),0,'Population Proportion'!$D$22-'Population Proportion'!$D$21+1,1)),NA())","v":65052},{"$f":"IF(AND('Population Proportion'!$D$21<>\"\",'Population Proportion'!$D$22<>\"\",'Population Proportion'!$D$21>=0,'Population Proportion'!$D$22<=90,'Population Proportion'!$D$21<='Population Proportion'!$D$22),SUM(OFFSET(V$92,MATCH('Population Proportion'!$D$21,$G$306:$G$396,0),0,'Population Proportion'!$D$22-'Population Proportion'!$D$21+1,1)),NA())","v":64610},{"$f":"IF(AND('Population Proportion'!$D$21<>\"\",'Population Proportion'!$D$22<>\"\",'Population Proportion'!$D$21>=0,'Population Proportion'!$D$22<=90,'Population Proportion'!$D$21<='Population Proportion'!$D$22),SUM(OFFSET(W$92,MATCH('Population Proportion'!$D$21,$G$306:$G$396,0),0,'Population Proportion'!$D$22-'Population Proportion'!$D$21+1,1)),NA())","v":64163},{"$f":"IF(AND('Population Proportion'!$D$21<>\"\",'Population Proportion'!$D$22<>\"\",'Population Proportion'!$D$21>=0,'Population Proportion'!$D$22<=90,'Population Proportion'!$D$21<='Population Proportion'!$D$22),SUM(OFFSET(X$92,MATCH('Population Proportion'!$D$21,$G$306:$G$396,0),0,'Population Proportion'!$D$22-'Population Proportion'!$D$21+1,1)),NA())","v":63598},{"$f":"IF(AND('Population Proportion'!$D$21<>\"\",'Population Proportion'!$D$22<>\"\",'Population Proportion'!$D$21>=0,'Population Proportion'!$D$22<=90,'Population Proportion'!$D$21<='Population Proportion'!$D$22),SUM(OFFSET(Y$92,MATCH('Population Proportion'!$D$21,$G$306:$G$396,0),0,'Population Proportion'!$D$22-'Population Proportion'!$D$21+1,1)),NA())","v":62725},{"$f":"IF(AND('Population Proportion'!$D$21<>\"\",'Population Proportion'!$D$22<>\"\",'Population Proportion'!$D$21>=0,'Population Proportion'!$D$22<=90,'Population Proportion'!$D$21<='Population Proportion'!$D$22),SUM(OFFSET(Z$92,MATCH('Population Proportion'!$D$21,$G$306:$G$396,0),0,'Population Proportion'!$D$22-'Population Proportion'!$D$21+1,1)),NA())","v":61892},{"$f":"IF(AND('Population Proportion'!$D$21<>\"\",'Population Proportion'!$D$22<>\"\",'Population Proportion'!$D$21>=0,'Population Proportion'!$D$22<=90,'Population Proportion'!$D$21<='Population Proportion'!$D$22),SUM(OFFSET(AA$92,MATCH('Population Proportion'!$D$21,$G$306:$G$396,0),0,'Population Proportion'!$D$22-'Population Proportion'!$D$21+1,1)),NA())","v":60900},{"$f":"IF(AND('Population Proportion'!$D$21<>\"\",'Population Proportion'!$D$22<>\"\",'Population Proportion'!$D$21>=0,'Population Proportion'!$D$22<=90,'Population Proportion'!$D$21<='Population Proportion'!$D$22),SUM(OFFSET(AB$92,MATCH('Population Proportion'!$D$21,$G$306:$G$396,0),0,'Population Proportion'!$D$22-'Population Proportion'!$D$21+1,1)),NA())","v":59934},{"$f":"IF(AND('Population Proportion'!$D$21<>\"\",'Population Proportion'!$D$22<>\"\",'Population Proportion'!$D$21>=0,'Population Proportion'!$D$22<=90,'Population Proportion'!$D$21<='Population Proportion'!$D$22),SUM(OFFSET(AC$92,MATCH('Population Proportion'!$D$21,$G$306:$G$396,0),0,'Population Proportion'!$D$22-'Population Proportion'!$D$21+1,1)),NA())","v":59354},{"$f":"IF(AND('Population Proportion'!$D$21<>\"\",'Population Proportion'!$D$22<>\"\",'Population Proportion'!$D$21>=0,'Population Proportion'!$D$22<=90,'Population Proportion'!$D$21<='Population Proportion'!$D$22),SUM(OFFSET(AD$92,MATCH('Population Proportion'!$D$21,$G$306:$G$396,0),0,'Population Proportion'!$D$22-'Population Proportion'!$D$21+1,1)),NA())","v":58749},{"$f":"IF(AND('Population Proportion'!$D$21<>\"\",'Population Proportion'!$D$22<>\"\",'Population Proportion'!$D$21>=0,'Population Proportion'!$D$22<=90,'Population Proportion'!$D$21<='Population Proportion'!$D$22),SUM(OFFSET(AE$92,MATCH('Population Proportion'!$D$21,$G$306:$G$396,0),0,'Population Proportion'!$D$22-'Population Proportion'!$D$21+1,1)),NA())","v":57939},{"$f":"IF(AND('Population Proportion'!$D$21<>\"\",'Population Proportion'!$D$22<>\"\",'Population Proportion'!$D$21>=0,'Population Proportion'!$D$22<=90,'Population Proportion'!$D$21<='Population Proportion'!$D$22),SUM(OFFSET(AF$92,MATCH('Population Proportion'!$D$21,$G$306:$G$396,0),0,'Population Proportion'!$D$22-'Population Proportion'!$D$21+1,1)),NA())","v":56955},{"$f":"IF(AND('Population Proportion'!$D$21<>\"\",'Population Proportion'!$D$22<>\"\",'Population Proportion'!$D$21>=0,'Population Proportion'!$D$22<=90,'Population Proportion'!$D$21<='Population Proportion'!$D$22),SUM(OFFSET(AG$92,MATCH('Population Proportion'!$D$21,$G$306:$G$396,0),0,'Population Proportion'!$D$22-'Population Proportion'!$D$21+1,1)),NA())","v":55848},{"$f":"IF(AND('Population Proportion'!$D$21<>\"\",'Population Proportion'!$D$22<>\"\",'Population Proportion'!$D$21>=0,'Population Proportion'!$D$22<=90,'Population Proportion'!$D$21<='Population Proportion'!$D$22),SUM(OFFSET(AH$92,MATCH('Population Proportion'!$D$21,$G$306:$G$396,0),0,'Population Proportion'!$D$22-'Population Proportion'!$D$21+1,1)),NA())","v":54536},{"$f":"IF(AND('Population Proportion'!$D$21<>\"\",'Population Proportion'!$D$22<>\"\",'Population Proportion'!$D$21>=0,'Population Proportion'!$D$22<=90,'Population Proportion'!$D$21<='Population Proportion'!$D$22),SUM(OFFSET(AI$92,MATCH('Population Proportion'!$D$21,$G$306:$G$396,0),0,'Population Proportion'!$D$22-'Population Proportion'!$D$21+1,1)),NA())","v":53445},{"$f":"IF(AND('Population Proportion'!$D$21<>\"\",'Population Proportion'!$D$22<>\"\",'Population Proportion'!$D$21>=0,'Population Proportion'!$D$22<=90,'Population Proportion'!$D$21<='Population Proportion'!$D$22),SUM(OFFSET(AJ$92,MATCH('Population Proportion'!$D$21,$G$306:$G$396,0),0,'Population Proportion'!$D$22-'Population Proportion'!$D$21+1,1)),NA())","v":52683},{"$f":"IF(AND('Population Proportion'!$D$21<>\"\",'Population Proportion'!$D$22<>\"\",'Population Proportion'!$D$21>=0,'Population Proportion'!$D$22<=90,'Population Proportion'!$D$21<='Population Proportion'!$D$22),SUM(OFFSET(AK$92,MATCH('Population Proportion'!$D$21,$G$306:$G$396,0),0,'Population Proportion'!$D$22-'Population Proportion'!$D$21+1,1)),NA())","v":53117},{"$f":"IF(AND('Population Proportion'!$D$21<>\"\",'Population Proportion'!$D$22<>\"\",'Population Proportion'!$D$21>=0,'Population Proportion'!$D$22<=90,'Population Proportion'!$D$21<='Population Proportion'!$D$22),SUM(OFFSET(AL$92,MATCH('Population Proportion'!$D$21,$G$306:$G$396,0),0,'Population Proportion'!$D$22-'Population Proportion'!$D$21+1,1)),NA())","v":54002},{"$f":"IF(AND('Population Proportion'!$D$21<>\"\",'Population Proportion'!$D$22<>\"\",'Population Proportion'!$D$21>=0,'Population Proportion'!$D$22<=90,'Population Proportion'!$D$21<='Population Proportion'!$D$22),SUM(OFFSET(AM$92,MATCH('Population Proportion'!$D$21,$G$306:$G$396,0),0,'Population Proportion'!$D$22-'Population Proportion'!$D$21+1,1)),NA())","v":55272},{"$f":"IF(AND('Population Proportion'!$D$21<>\"\",'Population Proportion'!$D$22<>\"\",'Population Proportion'!$D$21>=0,'Population Proportion'!$D$22<=90,'Population Proportion'!$D$21<='Population Proportion'!$D$22),SUM(OFFSET(AN$92,MATCH('Population Proportion'!$D$21,$G$306:$G$396,0),0,'Population Proportion'!$D$22-'Population Proportion'!$D$21+1,1)),NA())","v":57291},{"$f":"IF(AND('Population Proportion'!$D$21<>\"\",'Population Proportion'!$D$22<>\"\",'Population Proportion'!$D$21>=0,'Population Proportion'!$D$22<=90,'Population Proportion'!$D$21<='Population Proportion'!$D$22),SUM(OFFSET(AO$92,MATCH('Population Proportion'!$D$21,$G$306:$G$396,0),0,'Population Proportion'!$D$22-'Population Proportion'!$D$21+1,1)),NA())","v":58870},{"$f":"IF(AND('Population Proportion'!$D$21<>\"\",'Population Proportion'!$D$22<>\"\",'Population Proportion'!$D$21>=0,'Population Proportion'!$D$22<=90,'Population Proportion'!$D$21<='Population Proportion'!$D$22),SUM(OFFSET(AP$92,MATCH('Population Proportion'!$D$21,$G$306:$G$396,0),0,'Population Proportion'!$D$22-'Population Proportion'!$D$21+1,1)),NA())","v":60279},{"$f":"IF(AND('Population Proportion'!$D$21<>\"\",'Population Proportion'!$D$22<>\"\",'Population Proportion'!$D$21>=0,'Population Proportion'!$D$22<=90,'Population Proportion'!$D$21<='Population Proportion'!$D$22),SUM(OFFSET(AQ$92,MATCH('Population Proportion'!$D$21,$G$306:$G$396,0),0,'Population Proportion'!$D$22-'Population Proportion'!$D$21+1,1)),NA())","v":61551},{"$f":"IF(AND('Population Proportion'!$D$21<>\"\",'Population Proportion'!$D$22<>\"\",'Population Proportion'!$D$21>=0,'Population Proportion'!$D$22<=90,'Population Proportion'!$D$21<='Population Proportion'!$D$22),SUM(OFFSET(AR$92,MATCH('Population Proportion'!$D$21,$G$306:$G$396,0),0,'Population Proportion'!$D$22-'Population Proportion'!$D$21+1,1)),NA())","v":62177},{"$f":"IF(AND('Population Proportion'!$D$21<>\"\",'Population Proportion'!$D$22<>\"\",'Population Proportion'!$D$21>=0,'Population Proportion'!$D$22<=90,'Population Proportion'!$D$21<='Population Proportion'!$D$22),SUM(OFFSET(AS$92,MATCH('Population Proportion'!$D$21,$G$306:$G$396,0),0,'Population Proportion'!$D$22-'Population Proportion'!$D$21+1,1)),NA())","v":61974},{"$f":"IF(AND('Population Proportion'!$D$21<>\"\",'Population Proportion'!$D$22<>\"\",'Population Proportion'!$D$21>=0,'Population Proportion'!$D$22<=90,'Population Proportion'!$D$21<='Population Proportion'!$D$22),SUM(OFFSET(AT$92,MATCH('Population Proportion'!$D$21,$G$306:$G$396,0),0,'Population Proportion'!$D$22-'Population Proportion'!$D$21+1,1)),NA())","v":61568},{"$f":"IF(AND('Population Proportion'!$D$21<>\"\",'Population Proportion'!$D$22<>\"\",'Population Proportion'!$D$21>=0,'Population Proportion'!$D$22<=90,'Population Proportion'!$D$21<='Population Proportion'!$D$22),SUM(OFFSET(AU$92,MATCH('Population Proportion'!$D$21,$G$306:$G$396,0),0,'Population Proportion'!$D$22-'Population Proportion'!$D$21+1,1)),NA())","v":61337},{"$f":"IF(AND('Population Proportion'!$D$21<>\"\",'Population Proportion'!$D$22<>\"\",'Population Proportion'!$D$21>=0,'Population Proportion'!$D$22<=90,'Population Proportion'!$D$21<='Population Proportion'!$D$22),SUM(OFFSET(AV$92,MATCH('Population Proportion'!$D$21,$G$306:$G$396,0),0,'Population Proportion'!$D$22-'Population Proportion'!$D$21+1,1)),NA())","v":60746},{"$f":"IF(AND('Population Proportion'!$D$21<>\"\",'Population Proportion'!$D$22<>\"\",'Population Proportion'!$D$21>=0,'Population Proportion'!$D$22<=90,'Population Proportion'!$D$21<='Population Proportion'!$D$22),SUM(OFFSET(AW$92,MATCH('Population Proportion'!$D$21,$G$306:$G$396,0),0,'Population Proportion'!$D$22-'Population Proportion'!$D$21+1,1)),NA())","v":59840},{"$f":"IF(AND('Population Proportion'!$D$21<>\"\",'Population Proportion'!$D$22<>\"\",'Population Proportion'!$D$21>=0,'Population Proportion'!$D$22<=90,'Population Proportion'!$D$21<='Population Proportion'!$D$22),SUM(OFFSET(AX$92,MATCH('Population Proportion'!$D$21,$G$306:$G$396,0),0,'Population Proportion'!$D$22-'Population Proportion'!$D$21+1,1)),NA())","v":59118},{"$f":"IF(AND('Population Proportion'!$D$21<>\"\",'Population Proportion'!$D$22<>\"\",'Population Proportion'!$D$21>=0,'Population Proportion'!$D$22<=90,'Population Proportion'!$D$21<='Population Proportion'!$D$22),SUM(OFFSET(AY$92,MATCH('Population Proportion'!$D$21,$G$306:$G$396,0),0,'Population Proportion'!$D$22-'Population Proportion'!$D$21+1,1)),NA())","v":58399},{"$f":"IF(AND('Population Proportion'!$D$21<>\"\",'Population Proportion'!$D$22<>\"\",'Population Proportion'!$D$21>=0,'Population Proportion'!$D$22<=90,'Population Proportion'!$D$21<='Population Proportion'!$D$22),SUM(OFFSET(AZ$92,MATCH('Population Proportion'!$D$21,$G$306:$G$396,0),0,'Population Proportion'!$D$22-'Population Proportion'!$D$21+1,1)),NA())","v":57545},{"$f":"IF(AND('Population Proportion'!$D$21<>\"\",'Population Proportion'!$D$22<>\"\",'Population Proportion'!$D$21>=0,'Population Proportion'!$D$22<=90,'Population Proportion'!$D$21<='Population Proportion'!$D$22),SUM(OFFSET(BA$92,MATCH('Population Proportion'!$D$21,$G$306:$G$396,0),0,'Population Proportion'!$D$22-'Population Proportion'!$D$21+1,1)),NA())","v":56588},{"$f":"IF(AND('Population Proportion'!$D$21<>\"\",'Population Proportion'!$D$22<>\"\",'Population Proportion'!$D$21>=0,'Population Proportion'!$D$22<=90,'Population Proportion'!$D$21<='Population Proportion'!$D$22),SUM(OFFSET(BB$92,MATCH('Population Proportion'!$D$21,$G$306:$G$396,0),0,'Population Proportion'!$D$22-'Population Proportion'!$D$21+1,1)),NA())","v":55751},{"$f":"IF(AND('Population Proportion'!$D$21<>\"\",'Population Proportion'!$D$22<>\"\",'Population Proportion'!$D$21>=0,'Population Proportion'!$D$22<=90,'Population Proportion'!$D$21<='Population Proportion'!$D$22),SUM(OFFSET(BC$92,MATCH('Population Proportion'!$D$21,$G$306:$G$396,0),0,'Population Proportion'!$D$22-'Population Proportion'!$D$21+1,1)),NA())","v":55047},{"$f":"IF(AND('Population Proportion'!$D$21<>\"\",'Population Proportion'!$D$22<>\"\",'Population Proportion'!$D$21>=0,'Population Proportion'!$D$22<=90,'Population Proportion'!$D$21<='Population Proportion'!$D$22),SUM(OFFSET(BD$92,MATCH('Population Proportion'!$D$21,$G$306:$G$396,0),0,'Population Proportion'!$D$22-'Population Proportion'!$D$21+1,1)),NA())","v":54510},{"$f":"IF(AND('Population Proportion'!$D$21<>\"\",'Population Proportion'!$D$22<>\"\",'Population Proportion'!$D$21>=0,'Population Proportion'!$D$22<=90,'Population Proportion'!$D$21<='Population Proportion'!$D$22),SUM(OFFSET(BE$92,MATCH('Population Proportion'!$D$21,$G$306:$G$396,0),0,'Population Proportion'!$D$22-'Population Proportion'!$D$21+1,1)),NA())","v":54003},{"$f":"IF(AND('Population Proportion'!$D$21<>\"\",'Population Proportion'!$D$22<>\"\",'Population Proportion'!$D$21>=0,'Population Proportion'!$D$22<=90,'Population Proportion'!$D$21<='Population Proportion'!$D$22),SUM(OFFSET(BF$92,MATCH('Population Proportion'!$D$21,$G$306:$G$396,0),0,'Population Proportion'!$D$22-'Population Proportion'!$D$21+1,1)),NA())","v":53533},{"$f":"IF(AND('Population Proportion'!$D$21<>\"\",'Population Proportion'!$D$22<>\"\",'Population Proportion'!$D$21>=0,'Population Proportion'!$D$22<=90,'Population Proportion'!$D$21<='Population Proportion'!$D$22),SUM(OFFSET(BG$92,MATCH('Population Proportion'!$D$21,$G$306:$G$396,0),0,'Population Proportion'!$D$22-'Population Proportion'!$D$21+1,1)),NA())","v":53111},{"$f":"IF(AND('Population Proportion'!$D$21<>\"\",'Population Proportion'!$D$22<>\"\",'Population Proportion'!$D$21>=0,'Population Proportion'!$D$22<=90,'Population Proportion'!$D$21<='Population Proportion'!$D$22),SUM(OFFSET(BH$92,MATCH('Population Proportion'!$D$21,$G$306:$G$396,0),0,'Population Proportion'!$D$22-'Population Proportion'!$D$21+1,1)),NA())","v":52723},{"$f":"IF(AND('Population Proportion'!$D$21<>\"\",'Population Proportion'!$D$22<>\"\",'Population Proportion'!$D$21>=0,'Population Proportion'!$D$22<=90,'Population Proportion'!$D$21<='Population Proportion'!$D$22),SUM(OFFSET(BI$92,MATCH('Population Proportion'!$D$21,$G$306:$G$396,0),0,'Population Proportion'!$D$22-'Population Proportion'!$D$21+1,1)),NA())","v":52353},{"$f":"IF(AND('Population Proportion'!$D$21<>\"\",'Population Proportion'!$D$22<>\"\",'Population Proportion'!$D$21>=0,'Population Proportion'!$D$22<=90,'Population Proportion'!$D$21<='Population Proportion'!$D$22),SUM(OFFSET(BJ$92,MATCH('Population Proportion'!$D$21,$G$306:$G$396,0),0,'Population Proportion'!$D$22-'Population Proportion'!$D$21+1,1)),NA())","v":52023},{"$f":"IF(AND('Population Proportion'!$D$21<>\"\",'Population Proportion'!$D$22<>\"\",'Population Proportion'!$D$21>=0,'Population Proportion'!$D$22<=90,'Population Proportion'!$D$21<='Population Proportion'!$D$22),SUM(OFFSET(BK$92,MATCH('Population Proportion'!$D$21,$G$306:$G$396,0),0,'Population Proportion'!$D$22-'Population Proportion'!$D$21+1,1)),NA())","v":51750},{"$f":"IF(AND('Population Proportion'!$D$21<>\"\",'Population Proportion'!$D$22<>\"\",'Population Proportion'!$D$21>=0,'Population Proportion'!$D$22<=90,'Population Proportion'!$D$21<='Population Proportion'!$D$22),SUM(OFFSET(BL$92,MATCH('Population Proportion'!$D$21,$G$306:$G$396,0),0,'Population Proportion'!$D$22-'Population Proportion'!$D$21+1,1)),NA())","v":51542},{"$f":"IF(AND('Population Proportion'!$D$21<>\"\",'Population Proportion'!$D$22<>\"\",'Population Proportion'!$D$21>=0,'Population Proportion'!$D$22<=90,'Population Proportion'!$D$21<='Population Proportion'!$D$22),SUM(OFFSET(BM$92,MATCH('Population Proportion'!$D$21,$G$306:$G$396,0),0,'Population Proportion'!$D$22-'Population Proportion'!$D$21+1,1)),NA())","v":51414},{"$f":"IF(AND('Population Proportion'!$D$21<>\"\",'Population Proportion'!$D$22<>\"\",'Population Proportion'!$D$21>=0,'Population Proportion'!$D$22<=90,'Population Proportion'!$D$21<='Population Proportion'!$D$22),SUM(OFFSET(BN$92,MATCH('Population Proportion'!$D$21,$G$306:$G$396,0),0,'Population Proportion'!$D$22-'Population Proportion'!$D$21+1,1)),NA())","v":51370},{"$f":"IF(AND('Population Proportion'!$D$21<>\"\",'Population Proportion'!$D$22<>\"\",'Population Proportion'!$D$21>=0,'Population Proportion'!$D$22<=90,'Population Proportion'!$D$21<='Population Proportion'!$D$22),SUM(OFFSET(BO$92,MATCH('Population Proportion'!$D$21,$G$306:$G$396,0),0,'Population Proportion'!$D$22-'Population Proportion'!$D$21+1,1)),NA())","v":51412},{"$f":"IF(AND('Population Proportion'!$D$21<>\"\",'Population Proportion'!$D$22<>\"\",'Population Proportion'!$D$21>=0,'Population Proportion'!$D$22<=90,'Population Proportion'!$D$21<='Population Proportion'!$D$22),SUM(OFFSET(BP$92,MATCH('Population Proportion'!$D$21,$G$306:$G$396,0),0,'Population Proportion'!$D$22-'Population Proportion'!$D$21+1,1)),NA())","v":51541},{"$f":"IF(AND('Population Proportion'!$D$21<>\"\",'Population Proportion'!$D$22<>\"\",'Population Proportion'!$D$21>=0,'Population Proportion'!$D$22<=90,'Population Proportion'!$D$21<='Population Proportion'!$D$22),SUM(OFFSET(BQ$92,MATCH('Population Proportion'!$D$21,$G$306:$G$396,0),0,'Population Proportion'!$D$22-'Population Proportion'!$D$21+1,1)),NA())","v":51760},{"$f":"IF(AND('Population Proportion'!$D$21<>\"\",'Population Proportion'!$D$22<>\"\",'Population Proportion'!$D$21>=0,'Population Proportion'!$D$22<=90,'Population Proportion'!$D$21<='Population Proportion'!$D$22),SUM(OFFSET(BR$92,MATCH('Population Proportion'!$D$21,$G$306:$G$396,0),0,'Population Proportion'!$D$22-'Population Proportion'!$D$21+1,1)),NA())","v":52063},{"$f":"IF(AND('Population Proportion'!$D$21<>\"\",'Population Proportion'!$D$22<>\"\",'Population Proportion'!$D$21>=0,'Population Proportion'!$D$22<=90,'Population Proportion'!$D$21<='Population Proportion'!$D$22),SUM(OFFSET(BS$92,MATCH('Population Proportion'!$D$21,$G$306:$G$396,0),0,'Population Proportion'!$D$22-'Population Proportion'!$D$21+1,1)),NA())","v":52429},{"$f":"IF(AND('Population Proportion'!$D$21<>\"\",'Population Proportion'!$D$22<>\"\",'Population Proportion'!$D$21>=0,'Population Proportion'!$D$22<=90,'Population Proportion'!$D$21<='Population Proportion'!$D$22),SUM(OFFSET(BT$92,MATCH('Population Proportion'!$D$21,$G$306:$G$396,0),0,'Population Proportion'!$D$22-'Population Proportion'!$D$21+1,1)),NA())","v":52832},{"$f":"IF(AND('Population Proportion'!$D$21<>\"\",'Population Proportion'!$D$22<>\"\",'Population Proportion'!$D$21>=0,'Population Proportion'!$D$22<=90,'Population Proportion'!$D$21<='Population Proportion'!$D$22),SUM(OFFSET(BU$92,MATCH('Population Proportion'!$D$21,$G$306:$G$396,0),0,'Population Proportion'!$D$22-'Population Proportion'!$D$21+1,1)),NA())","v":53241},{"$f":"IF(AND('Population Proportion'!$D$21<>\"\",'Population Proportion'!$D$22<>\"\",'Population Proportion'!$D$21>=0,'Population Proportion'!$D$22<=90,'Population Proportion'!$D$21<='Population Proportion'!$D$22),SUM(OFFSET(BV$92,MATCH('Population Proportion'!$D$21,$G$306:$G$396,0),0,'Population Proportion'!$D$22-'Population Proportion'!$D$21+1,1)),NA())","v":53624},{"$f":"IF(AND('Population Proportion'!$D$21<>\"\",'Population Proportion'!$D$22<>\"\",'Population Proportion'!$D$21>=0,'Population Proportion'!$D$22<=90,'Population Proportion'!$D$21<='Population Proportion'!$D$22),SUM(OFFSET(BW$92,MATCH('Population Proportion'!$D$21,$G$306:$G$396,0),0,'Population Proportion'!$D$22-'Population Proportion'!$D$21+1,1)),NA())","v":53958},{"$f":"IF(AND('Population Proportion'!$D$21<>\"\",'Population Proportion'!$D$22<>\"\",'Population Proportion'!$D$21>=0,'Population Proportion'!$D$22<=90,'Population Proportion'!$D$21<='Population Proportion'!$D$22),SUM(OFFSET(BX$92,MATCH('Population Proportion'!$D$21,$G$306:$G$396,0),0,'Population Proportion'!$D$22-'Population Proportion'!$D$21+1,1)),NA())","v":54207},{"$f":"IF(AND('Population Proportion'!$D$21<>\"\",'Population Proportion'!$D$22<>\"\",'Population Proportion'!$D$21>=0,'Population Proportion'!$D$22<=90,'Population Proportion'!$D$21<='Population Proportion'!$D$22),SUM(OFFSET(BY$92,MATCH('Population Proportion'!$D$21,$G$306:$G$396,0),0,'Population Proportion'!$D$22-'Population Proportion'!$D$21+1,1)),NA())","v":54360},{"$f":"IF(AND('Population Proportion'!$D$21<>\"\",'Population Proportion'!$D$22<>\"\",'Population Proportion'!$D$21>=0,'Population Proportion'!$D$22<=90,'Population Proportion'!$D$21<='Population Proportion'!$D$22),SUM(OFFSET(BZ$92,MATCH('Population Proportion'!$D$21,$G$306:$G$396,0),0,'Population Proportion'!$D$22-'Population Proportion'!$D$21+1,1)),NA())","v":54408},{"$f":"IF(AND('Population Proportion'!$D$21<>\"\",'Population Proportion'!$D$22<>\"\",'Population Proportion'!$D$21>=0,'Population Proportion'!$D$22<=90,'Population Proportion'!$D$21<='Population Proportion'!$D$22),SUM(OFFSET(CA$92,MATCH('Population Proportion'!$D$21,$G$306:$G$396,0),0,'Population Proportion'!$D$22-'Population Proportion'!$D$21+1,1)),NA())","v":54349},{"$f":"IF(AND('Population Proportion'!$D$21<>\"\",'Population Proportion'!$D$22<>\"\",'Population Proportion'!$D$21>=0,'Population Proportion'!$D$22<=90,'Population Proportion'!$D$21<='Population Proportion'!$D$22),SUM(OFFSET(CB$92,MATCH('Population Proportion'!$D$21,$G$306:$G$396,0),0,'Population Proportion'!$D$22-'Population Proportion'!$D$21+1,1)),NA())","v":54183},{"$f":"IF(AND('Population Proportion'!$D$21<>\"\",'Population Proportion'!$D$22<>\"\",'Population Proportion'!$D$21>=0,'Population Proportion'!$D$22<=90,'Population Proportion'!$D$21<='Population Proportion'!$D$22),SUM(OFFSET(CC$92,MATCH('Population Proportion'!$D$21,$G$306:$G$396,0),0,'Population Proportion'!$D$22-'Population Proportion'!$D$21+1,1)),NA())","v":53926},{"$f":"IF(AND('Population Proportion'!$D$21<>\"\",'Population Proportion'!$D$22<>\"\",'Population Proportion'!$D$21>=0,'Population Proportion'!$D$22<=90,'Population Proportion'!$D$21<='Population Proportion'!$D$22),SUM(OFFSET(CD$92,MATCH('Population Proportion'!$D$21,$G$306:$G$396,0),0,'Population Proportion'!$D$22-'Population Proportion'!$D$21+1,1)),NA())","v":53591},{"$f":"IF(AND('Population Proportion'!$D$21<>\"\",'Population Proportion'!$D$22<>\"\",'Population Proportion'!$D$21>=0,'Population Proportion'!$D$22<=90,'Population Proportion'!$D$21<='Population Proportion'!$D$22),SUM(OFFSET(CE$92,MATCH('Population Proportion'!$D$21,$G$306:$G$396,0),0,'Population Proportion'!$D$22-'Population Proportion'!$D$21+1,1)),NA())","v":53195},{"$f":"IF(AND('Population Proportion'!$D$21<>\"\",'Population Proportion'!$D$22<>\"\",'Population Proportion'!$D$21>=0,'Population Proportion'!$D$22<=90,'Population Proportion'!$D$21<='Population Proportion'!$D$22),SUM(OFFSET(CF$92,MATCH('Population Proportion'!$D$21,$G$306:$G$396,0),0,'Population Proportion'!$D$22-'Population Proportion'!$D$21+1,1)),NA())","v":52754},{"$f":"IF(AND('Population Proportion'!$D$21<>\"\",'Population Proportion'!$D$22<>\"\",'Population Proportion'!$D$21>=0,'Population Proportion'!$D$22<=90,'Population Proportion'!$D$21<='Population Proportion'!$D$22),SUM(OFFSET(CG$92,MATCH('Population Proportion'!$D$21,$G$306:$G$396,0),0,'Population Proportion'!$D$22-'Population Proportion'!$D$21+1,1)),NA())","v":52294},{"$f":"IF(AND('Population Proportion'!$D$21<>\"\",'Population Proportion'!$D$22<>\"\",'Population Proportion'!$D$21>=0,'Population Proportion'!$D$22<=90,'Population Proportion'!$D$21<='Population Proportion'!$D$22),SUM(OFFSET(CH$92,MATCH('Population Proportion'!$D$21,$G$306:$G$396,0),0,'Population Proportion'!$D$22-'Population Proportion'!$D$21+1,1)),NA())","v":51827},{"$f":"IF(AND('Population Proportion'!$D$21<>\"\",'Population Proportion'!$D$22<>\"\",'Population Proportion'!$D$21>=0,'Population Proportion'!$D$22<=90,'Population Proportion'!$D$21<='Population Proportion'!$D$22),SUM(OFFSET(CI$92,MATCH('Population Proportion'!$D$21,$G$306:$G$396,0),0,'Population Proportion'!$D$22-'Population Proportion'!$D$21+1,1)),NA())","v":51366},{"$f":"IF(AND('Population Proportion'!$D$21<>\"\",'Population Proportion'!$D$22<>\"\",'Population Proportion'!$D$21>=0,'Population Proportion'!$D$22<=90,'Population Proportion'!$D$21<='Population Proportion'!$D$22),SUM(OFFSET(CJ$92,MATCH('Population Proportion'!$D$21,$G$306:$G$396,0),0,'Population Proportion'!$D$22-'Population Proportion'!$D$21+1,1)),NA())","v":50926},{"$f":"IF(AND('Population Proportion'!$D$21<>\"\",'Population Proportion'!$D$22<>\"\",'Population Proportion'!$D$21>=0,'Population Proportion'!$D$22<=90,'Population Proportion'!$D$21<='Population Proportion'!$D$22),SUM(OFFSET(CK$92,MATCH('Population Proportion'!$D$21,$G$306:$G$396,0),0,'Population Proportion'!$D$22-'Population Proportion'!$D$21+1,1)),NA())","v":50515},{"$f":"IF(AND('Population Proportion'!$D$21<>\"\",'Population Proportion'!$D$22<>\"\",'Population Proportion'!$D$21>=0,'Population Proportion'!$D$22<=90,'Population Proportion'!$D$21<='Population Proportion'!$D$22),SUM(OFFSET(CL$92,MATCH('Population Proportion'!$D$21,$G$306:$G$396,0),0,'Population Proportion'!$D$22-'Population Proportion'!$D$21+1,1)),NA())","v":50141},{"$f":"IF(AND('Population Proportion'!$D$21<>\"\",'Population Proportion'!$D$22<>\"\",'Population Proportion'!$D$21>=0,'Population Proportion'!$D$22<=90,'Population Proportion'!$D$21<='Population Proportion'!$D$22),SUM(OFFSET(CM$92,MATCH('Population Proportion'!$D$21,$G$306:$G$396,0),0,'Population Proportion'!$D$22-'Population Proportion'!$D$21+1,1)),NA())","v":49808},{"$f":"IF(AND('Population Proportion'!$D$21<>\"\",'Population Proportion'!$D$22<>\"\",'Population Proportion'!$D$21>=0,'Population Proportion'!$D$22<=90,'Population Proportion'!$D$21<='Population Proportion'!$D$22),SUM(OFFSET(CN$92,MATCH('Population Proportion'!$D$21,$G$306:$G$396,0),0,'Population Proportion'!$D$22-'Population Proportion'!$D$21+1,1)),NA())","v":49524},{"$f":"IF(AND('Population Proportion'!$D$21<>\"\",'Population Proportion'!$D$22<>\"\",'Population Proportion'!$D$21>=0,'Population Proportion'!$D$22<=90,'Population Proportion'!$D$21<='Population Proportion'!$D$22),SUM(OFFSET(CO$92,MATCH('Population Proportion'!$D$21,$G$306:$G$396,0),0,'Population Proportion'!$D$22-'Population Proportion'!$D$21+1,1)),NA())","v":49287},{"$f":"IF(AND('Population Proportion'!$D$21<>\"\",'Population Proportion'!$D$22<>\"\",'Population Proportion'!$D$21>=0,'Population Proportion'!$D$22<=90,'Population Proportion'!$D$21<='Population Proportion'!$D$22),SUM(OFFSET(CP$92,MATCH('Population Proportion'!$D$21,$G$306:$G$396,0),0,'Population Proportion'!$D$22-'Population Proportion'!$D$21+1,1)),NA())","v":49104},{"$f":"IF(AND('Population Proportion'!$D$21<>\"\",'Population Proportion'!$D$22<>\"\",'Population Proportion'!$D$21>=0,'Population Proportion'!$D$22<=90,'Population Proportion'!$D$21<='Population Proportion'!$D$22),SUM(OFFSET(CQ$92,MATCH('Population Proportion'!$D$21,$G$306:$G$396,0),0,'Population Proportion'!$D$22-'Population Proportion'!$D$21+1,1)),NA())","v":48966}]
["Females","All",785800,781468,774248,771949,770167,769476,769382,769654,773088,778011,786339,787808,791547,796009,800447,805118,809104,811660,814496,817711,824145,831147,837340,841761,845117,851404,855742,859100,860508,862466,864565,868548,871820,875791,882432,890003,899427,908154,914771,920298,924996,929086,932580,937787,942492,946924,950586,955441,960253,964508,968371,971804,974805,977632,980022,982205,984160,985865,987372,988730,989927,990974,991920,992803,993616,994368,995110,995868,996631,997377,998104,998798,999444,1000004,1000455,1000775,1000938,1000933,1000731,1000328,999725,998918,997907,996712,995346,993837,992192,990436,988607,986708,984778,982839,980909]
["All","0-15",482744,482685,479429,477870,474984,470967,466056,460056,454830,450012,444058,438295,433053,428530,425098,422921,421115,419973,417569,416095,416539,417969,418528,417899,416457,415127,413448,411252,407510,403189,397533,391656,385907,381247,378770,377149,377073,378485,379520,379959,380806,382141,382607,383783,385200,388001,390684,393510,395557,396845,397456,397071,395135,391765,388056,384417,380259,375684,371779,368093,364387,360389,357159,354638,352706,351180,350057,349384,349114,349181,349550,350198,351087,352143,353295,354461,355574,356564,357368,357936,358217,358158,357741,356957,355811,354338,352583,350591,348419,346150,343859,341610,339449]
["All","16-39",491795,491595,488120,488858,490141,496039,501328,508417,518150,528395,534879,539866,546106,552180,558499,564001,567285,566310,567487,568508,572570,580158,584934,587422,587308,591941,594145,592628,588234,586115,584713,587560,588420,588731,590387,592902,597415,599331,599175,596756,592445,588557,583753,582615,583116,582157,{"$f":"AW462+AW470","v":579782},579513,577661,575387,573112,571751,571246,571727,571557,570775,570229,569945,569245,568036,566708,565862,565275,564134,562765,561371,559908,558695,557750,557218,557371,557534,557553,556983,556003,554358,551511,547490,543462,539721,535712,531612,528412,525662,523102,520462,518664,517560,516978,516650,516483,516478,516551]
["All","40-64",399796,397306,393041,389330,386091,382228,380386,377466,376546,373978,376369,378420,382953,386594,388657,390793,394500,398108,401583,405578,409912,414422,419950,425080,430389,437876,445719,454481,463124,472392,482502,491489,501238,511894,523671,535012,545267,553836,561271,568483,575305,580117,584231,588184,591481,594224,597393,600421,604380,608973,612758,615133,616709,618322,619647,620382,620818,620631,619447,618086,617260,616267,614189,612510,610878,609048,607597,606007,604892,603861,602413,600881,599175,596854,593922,591475,590723,591099,591217,590766,590345,590135,589301,588583,587696,587003,585833,584989,583787,582588,581440,580139,579072]
["All","16-64",891591,888901,881161,878188,876232,878267,881714,885883,894696,902373,911248,918286,929059,938774,947156,954794,961785,964418,969070,974086,982482,994580,1004884,1012502,1017697,1029817,1039864,1047109,1051358,1058507,1067215,1079049,1089658,1100625,1114058,1127914,1142682,1153167,1160446,1165239,1167750,1168674,1167984,1170799,1174597,1176381,1177175,1179934,1182041,1184360,1185870,1186884,1187955,1190049,1191204,1191157,1191047,1190576,1188692,1186122,1183968,1182129,1179464,1176644,1173643,1170419,1167505,1164702,1162642,1161079,1159784,1158415,1156728,1153837,1149925,1145833,1142234,1138589,1134679,1130487,1126057,1121747,1117713,1114245,1110798,1107465,1104497,1102549,1100765,1099238,1097923,1096617,1095623]
["All","60+",240576,242612,244784,245778,247015,246789,246307,245340,245961,246220,255989,258167,260397,262683,264959,266977,269864,271436,273911,275837,278456,280560,282091,282863,284062,286429,288534,290835,292874,294713,297833,301724,307328,313122,318817,325111,332218,338944,345698,353029,359791,366247,372778,380240,386902,394675,402753,410974,420525,429897,440011,450263,460810,471723,482795,493143,503174,513077,522246,530844,539125,546649,553597,559361,564237,568461,572393,576275,581036,586529,591930,596589,601115,605739,610523,615432,620173,624605,628440,632256,635954,639231,641396,643351,644930,646161,647224,647808,647957,647561,646411,645152,643950]
["All","65+",166078,167391,169403,170884,172302,174287,175540,177286,178727,180388,187658,187964,188448,190013,193098,195786,199054,201049,203796,205414,208274,210714,212140,213306,214977,216807,217949,219408,220138,221248,224090,226829,229359,232170,234905,238050,241928,247500,253367,259635,265762,272819,279134,285916,291824,297755,302975,308197,314668,320651,327297,334526,342333,350177,358376,367264,376252,385501,395075,404775,413746,422376,430849,438612,445814,452706,458880,464521,469029,472700,475777,478584,481380,485064,489476,493794,497391,500849,504390,508090,511938,515638,519067,521982,524940,527864,530483,532128,533663,534932,535972,536945,537538]
["All","Custom",{"$f":"IF(AND('Population Proportion'!$D$21<>\"\",'Population Proportion'!$D$22<>\"\",'Population Proportion'!$D$21>=0,'Population Proportion'!$D$22<=90,'Population Proportion'!$D$21<='Population Proportion'!$D$22),SUM(OFFSET(C$183,MATCH('Population Proportion'!$D$21,$G$306:$G$396,0),0,'Population Proportion'!$D$22-'Population Proportion'!$D$21+1,1)),NA())","v":157778},{"$f":"IF(AND('Population Proportion'!$D$21<>\"\",'Population Proportion'!$D$22<>\"\",'Population Proportion'!$D$21>=0,'Population Proportion'!$D$22<=90,'Population Proportion'!$D$21<='Population Proportion'!$D$22),SUM(OFFSET(D$183,MATCH('Population Proportion'!$D$21,$G$306:$G$396,0),0,'Population Proportion'!$D$22-'Population Proportion'!$D$21+1,1)),NA())","v":154565},{"$f":"IF(AND('Population Proportion'!$D$21<>\"\",'Population Proportion'!$D$22<>\"\",'Population Proportion'!$D$21>=0,'Population Proportion'!$D$22<=90,'Population Proportion'!$D$21<='Population Proportion'!$D$22),SUM(OFFSET(E$183,MATCH('Population Proportion'!$D$21,$G$306:$G$396,0),0,'Population Proportion'!$D$22-'Population Proportion'!$D$21+1,1)),NA())","v":149897},{"$f":"IF(AND('Population Proportion'!$D$21<>\"\",'Population Proportion'!$D$22<>\"\",'Population Proportion'!$D$21>=0,'Population Proportion'!$D$22<=90,'Population Proportion'!$D$21<='Population Proportion'!$D$22),SUM(OFFSET(F$183,MATCH('Population Proportion'!$D$21,$G$306:$G$396,0),0,'Population Proportion'!$D$22-'Population Proportion'!$D$21+1,1)),NA())","v":145993},{"$f":"IF(AND('Population Proportion'!$D$21<>\"\",'Population Proportion'!$D$22<>\"\",'Population Proportion'!$D$21>=0,'Population Proportion'!$D$22<=90,'Population Proportion'!$D$21<='Population Proportion'!$D$22),SUM(OFFSET(G$183,MATCH('Population Proportion'!$D$21,$G$306:$G$396,0),0,'Population Proportion'!$D$22-'Population Proportion'!$D$21+1,1)),NA())","v":141436},{"$f":"IF(AND('Population Proportion'!$D$21<>\"\",'Population Proportion'!$D$22<>\"\",'Population Proportion'!$D$21>=0,'Population Proportion'!$D$22<=90,'Population Proportion'!$D$21<='Population Proportion'!$D$22),SUM(OFFSET(H$183,MATCH('Population Proportion'!$D$21,$G$306:$G$396,0),0,'Population Proportion'!$D$22-'Population Proportion'!$D$21+1,1)),NA())","v":136884},{"$f":"IF(AND('Population Proportion'!$D$21<>\"\",'Population Proportion'!$D$22<>\"\",'Population Proportion'!$D$21>=0,'Population Proportion'!$D$22<=90,'Population Proportion'!$D$21<='Population Proportion'!$D$22),SUM(OFFSET(I$183,MATCH('Population Proportion'!$D$21,$G$306:$G$396,0),0,'Population Proportion'!$D$22-'Population Proportion'!$D$21+1,1)),NA())","v":132997},{"$f":"IF(AND('Population Proportion'!$D$21<>\"\",'Population Proportion'!$D$22<>\"\",'Population Proportion'!$D$21>=0,'Population Proportion'!$D$22<=90,'Population Proportion'!$D$21<='Population Proportion'!$D$22),SUM(OFFSET(J$183,MATCH('Population Proportion'!$D$21,$G$306:$G$396,0),0,'Population Proportion'!$D$22-'Population Proportion'!$D$21+1,1)),NA())","v":129924},{"$f":"IF(AND('Population Proportion'!$D$21<>\"\",'Population Proportion'!$D$22<>\"\",'Population Proportion'!$D$21>=0,'Population Proportion'!$D$22<=90,'Population Proportion'!$D$21<='Population Proportion'!$D$22),SUM(OFFSET(K$183,MATCH('Population Proportion'!$D$21,$G$306:$G$396,0),0,'Population Proportion'!$D$22-'Population Proportion'!$D$21+1,1)),NA())","v":129175},{"$f":"IF(AND('Population Proportion'!$D$21<>\"\",'Population Proportion'!$D$22<>\"\",'Population Proportion'!$D$21>=0,'Population Proportion'!$D$22<=90,'Population Proportion'!$D$21<='Population Proportion'!$D$22),SUM(OFFSET(L$183,MATCH('Population Proportion'!$D$21,$G$306:$G$396,0),0,'Population Proportion'!$D$22-'Population Proportion'!$D$21+1,1)),NA())","v":130611},{"$f":"IF(AND('Population Proportion'!$D$21<>\"\",'Population Proportion'!$D$22<>\"\",'Population Proportion'!$D$21>=0,'Population Proportion'!$D$22<=90,'Population Proportion'!$D$21<='Population Proportion'!$D$22),SUM(OFFSET(M$183,MATCH('Population Proportion'!$D$21,$G$306:$G$396,0),0,'Population Proportion'!$D$22-'Population Proportion'!$D$21+1,1)),NA())","v":132791},{"$f":"IF(AND('Population Proportion'!$D$21<>\"\",'Population Proportion'!$D$22<>\"\",'Population Proportion'!$D$21>=0,'Population Proportion'!$D$22<=90,'Population Proportion'!$D$21<='Population Proportion'!$D$22),SUM(OFFSET(N$183,MATCH('Population Proportion'!$D$21,$G$306:$G$396,0),0,'Population Proportion'!$D$22-'Population Proportion'!$D$21+1,1)),NA())","v":133761},{"$f":"IF(AND('Population Proportion'!$D$21<>\"\",'Population Proportion'!$D$22<>\"\",'Population Proportion'!$D$21>=0,'Population Proportion'!$D$22<=90,'Population Proportion'!$D$21<='Population Proportion'!$D$22),SUM(OFFSET(O$183,MATCH('Population Proportion'!$D$21,$G$306:$G$396,0),0,'Population Proportion'!$D$22-'Population Proportion'!$D$21+1,1)),NA())","v":134586},{"$f":"IF(AND('Population Proportion'!$D$21<>\"\",'Population Proportion'!$D$22<>\"\",'Population Proportion'!$D$21>=0,'Population Proportion'!$D$22<=90,'Population Proportion'!$D$21<='Population Proportion'!$D$22),SUM(OFFSET(P$183,MATCH('Population Proportion'!$D$21,$G$306:$G$396,0),0,'Population Proportion'!$D$22-'Population Proportion'!$D$21+1,1)),NA())","v":134621},{"$f":"IF(AND('Population Proportion'!$D$21<>\"\",'Population Proportion'!$D$22<>\"\",'Population Proportion'!$D$21>=0,'Population Proportion'!$D$22<=90,'Population Proportion'!$D$21<='Population Proportion'!$D$22),SUM(OFFSET(Q$183,MATCH('Population Proportion'!$D$21,$G$306:$G$396,0),0,'Population Proportion'!$D$22-'Population Proportion'!$D$21+1,1)),NA())","v":134134},{"$f":"IF(AND('Population Proportion'!$D$21<>\"\",'Population Proportion'!$D$22<>\"\",'Population Proportion'!$D$21>=0,'Population Proportion'!$D$22<=90,'Population Proportion'!$D$21<='Population Proportion'!$D$22),SUM(OFFSET(R$183,MATCH('Population Proportion'!$D$21,$G$306:$G$396,0),0,'Population Proportion'!$D$22-'Population Proportion'!$D$21+1,1)),NA())","v":134302},{"$f":"IF(AND('Population Proportion'!$D$21<>\"\",'Population Proportion'!$D$22<>\"\",'Population Proportion'!$D$21>=0,'Population Proportion'!$D$22<=90,'Population Proportion'!$D$21<='Population Proportion'!$D$22),SUM(OFFSET(S$183,MATCH('Population Proportion'!$D$21,$G$306:$G$396,0),0,'Population Proportion'!$D$22-'Population Proportion'!$D$21+1,1)),NA())","v":135095},{"$f":"IF(AND('Population Proportion'!$D$21<>\"\",'Population Proportion'!$D$22<>\"\",'Population Proportion'!$D$21>=0,'Population Proportion'!$D$22<=90,'Population Proportion'!$D$21<='Population Proportion'!$D$22),SUM(OFFSET(T$183,MATCH('Population Proportion'!$D$21,$G$306:$G$396,0),0,'Population Proportion'!$D$22-'Population Proportion'!$D$21+1,1)),NA())","v":135242},{"$f":"IF(AND('Population Proportion'!$D$21<>\"\",'Population Proportion'!$D$22<>\"\",'Population Proportion'!$D$21>=0,'Population Proportion'!$D$22<=90,'Population Proportion'!$D$21<='Population Proportion'!$D$22),SUM(OFFSET(U$183,MATCH('Population Proportion'!$D$21,$G$306:$G$396,0),0,'Population Proportion'!$D$22-'Population Proportion'!$D$21+1,1)),NA())","v":134124},{"$f":"IF(AND('Population Proportion'!$D$21<>\"\",'Population Proportion'!$D$22<>\"\",'Population Proportion'!$D$21>=0,'Population Proportion'!$D$22<=90,'Population Proportion'!$D$21<='Population Proportion'!$D$22),SUM(OFFSET(V$183,MATCH('Population Proportion'!$D$21,$G$306:$G$396,0),0,'Population Proportion'!$D$22-'Population Proportion'!$D$21+1,1)),NA())","v":132776},{"$f":"IF(AND('Population Proportion'!$D$21<>\"\",'Population Proportion'!$D$22<>\"\",'Population Proportion'!$D$21>=0,'Population Proportion'!$D$22<=90,'Population Proportion'!$D$21<='Population Proportion'!$D$22),SUM(OFFSET(W$183,MATCH('Population Proportion'!$D$21,$G$306:$G$396,0),0,'Population Proportion'!$D$22-'Population Proportion'!$D$21+1,1)),NA())","v":131877},{"$f":"IF(AND('Population Proportion'!$D$21<>\"\",'Population Proportion'!$D$22<>\"\",'Population Proportion'!$D$21>=0,'Population Proportion'!$D$22<=90,'Population Proportion'!$D$21<='Population Proportion'!$D$22),SUM(OFFSET(X$183,MATCH('Population Proportion'!$D$21,$G$306:$G$396,0),0,'Population Proportion'!$D$22-'Population Proportion'!$D$21+1,1)),NA())","v":130845},{"$f":"IF(AND('Population Proportion'!$D$21<>\"\",'Population Proportion'!$D$22<>\"\",'Population Proportion'!$D$21>=0,'Population Proportion'!$D$22<=90,'Population Proportion'!$D$21<='Population Proportion'!$D$22),SUM(OFFSET(Y$183,MATCH('Population Proportion'!$D$21,$G$306:$G$396,0),0,'Population Proportion'!$D$22-'Population Proportion'!$D$21+1,1)),NA())","v":128842},{"$f":"IF(AND('Population Proportion'!$D$21<>\"\",'Population Proportion'!$D$22<>\"\",'Population Proportion'!$D$21>=0,'Population Proportion'!$D$22<=90,'Population Proportion'!$D$21<='Population Proportion'!$D$22),SUM(OFFSET(Z$183,MATCH('Population Proportion'!$D$21,$G$306:$G$396,0),0,'Population Proportion'!$D$22-'Population Proportion'!$D$21+1,1)),NA())","v":126751},{"$f":"IF(AND('Population Proportion'!$D$21<>\"\",'Population Proportion'!$D$22<>\"\",'Population Proportion'!$D$21>=0,'Population Proportion'!$D$22<=90,'Population Proportion'!$D$21<='Population Proportion'!$D$22),SUM(OFFSET(AA$183,MATCH('Population Proportion'!$D$21,$G$306:$G$396,0),0,'Population Proportion'!$D$22-'Population Proportion'!$D$21+1,1)),NA())","v":124648},{"$f":"IF(AND('Population Proportion'!$D$21<>\"\",'Population Proportion'!$D$22<>\"\",'Population Proportion'!$D$21>=0,'Population Proportion'!$D$22<=90,'Population Proportion'!$D$21<='Population Proportion'!$D$22),SUM(OFFSET(AB$183,MATCH('Population Proportion'!$D$21,$G$306:$G$396,0),0,'Population Proportion'!$D$22-'Population Proportion'!$D$21+1,1)),NA())","v":122872},{"$f":"IF(AND('Population Proportion'!$D$21<>\"\",'Population Proportion'!$D$22<>\"\",'Population Proportion'!$D$21>=0,'Population Proportion'!$D$22<=90,'Population Proportion'!$D$21<='Population Proportion'!$D$22),SUM(OFFSET(AC$183,MATCH('Population Proportion'!$D$21,$G$306:$G$396,0),0,'Population Proportion'!$D$22-'Population Proportion'!$D$21+1,1)),NA())","v":121613},{"$f":"IF(AND('Population Proportion'!$D$21<>\"\",'Population Proportion'!$D$22<>\"\",'Population Proportion'!$D$21>=0,'Population Proportion'!$D$22<=90,'Population Proportion'!$D$21<='Population Proportion'!$D$22),SUM(OFFSET(AD$183,MATCH('Population Proportion'!$D$21,$G$306:$G$396,0),0,'Population Proportion'!$D$22-'Population Proportion'!$D$21+1,1)),NA())","v":120442},{"$f":"IF(AND('Population Proportion'!$D$21<>\"\",'Population Proportion'!$D$22<>\"\",'Population Proportion'!$D$21>=0,'Population Proportion'!$D$22<=90,'Population Proportion'!$D$21<='Population Proportion'!$D$22),SUM(OFFSET(AE$183,MATCH('Population Proportion'!$D$21,$G$306:$G$396,0),0,'Population Proportion'!$D$22-'Population Proportion'!$D$21+1,1)),NA())","v":119192},{"$f":"IF(AND('Population Proportion'!$D$21<>\"\",'Population Proportion'!$D$22<>\"\",'Population Proportion'!$D$21>=0,'Population Proportion'!$D$22<=90,'Population Proportion'!$D$21<='Population Proportion'!$D$22),SUM(OFFSET(AF$183,MATCH('Population Proportion'!$D$21,$G$306:$G$396,0),0,'Population Proportion'!$D$22-'Population Proportion'!$D$21+1,1)),NA())","v":117330},{"$f":"IF(AND('Population Proportion'!$D$21<>\"\",'Population Proportion'!$D$22<>\"\",'Population Proportion'!$D$21>=0,'Population Proportion'!$D$22<=90,'Population Proportion'!$D$21<='Population Proportion'!$D$22),SUM(OFFSET(AG$183,MATCH('Population Proportion'!$D$21,$G$306:$G$396,0),0,'Population Proportion'!$D$22-'Population Proportion'!$D$21+1,1)),NA())","v":114898},{"$f":"IF(AND('Population Proportion'!$D$21<>\"\",'Population Proportion'!$D$22<>\"\",'Population Proportion'!$D$21>=0,'Population Proportion'!$D$22<=90,'Population Proportion'!$D$21<='Population Proportion'!$D$22),SUM(OFFSET(AH$183,MATCH('Population Proportion'!$D$21,$G$306:$G$396,0),0,'Population Proportion'!$D$22-'Population Proportion'!$D$21+1,1)),NA())","v":112088},{"$f":"IF(AND('Population Proportion'!$D$21<>\"\",'Population Proportion'!$D$22<>\"\",'Population Proportion'!$D$21>=0,'Population Proportion'!$D$22<=90,'Population Proportion'!$D$21<='Population Proportion'!$D$22),SUM(OFFSET(AI$183,MATCH('Population Proportion'!$D$21,$G$306:$G$396,0),0,'Population Proportion'!$D$22-'Population Proportion'!$D$21+1,1)),NA())","v":109971},{"$f":"IF(AND('Population Proportion'!$D$21<>\"\",'Population Proportion'!$D$22<>\"\",'Population Proportion'!$D$21>=0,'Population Proportion'!$D$22<=90,'Population Proportion'!$D$21<='Population Proportion'!$D$22),SUM(OFFSET(AJ$183,MATCH('Population Proportion'!$D$21,$G$306:$G$396,0),0,'Population Proportion'!$D$22-'Population Proportion'!$D$21+1,1)),NA())","v":108549},{"$f":"IF(AND('Population Proportion'!$D$21<>\"\",'Population Proportion'!$D$22<>\"\",'Population Proportion'!$D$21>=0,'Population Proportion'!$D$22<=90,'Population Proportion'!$D$21<='Population Proportion'!$D$22),SUM(OFFSET(AK$183,MATCH('Population Proportion'!$D$21,$G$306:$G$396,0),0,'Population Proportion'!$D$22-'Population Proportion'!$D$21+1,1)),NA())","v":109168},{"$f":"IF(AND('Population Proportion'!$D$21<>\"\",'Population Proportion'!$D$22<>\"\",'Population Proportion'!$D$21>=0,'Population Proportion'!$D$22<=90,'Population Proportion'!$D$21<='Population Proportion'!$D$22),SUM(OFFSET(AL$183,MATCH('Population Proportion'!$D$21,$G$306:$G$396,0),0,'Population Proportion'!$D$22-'Population Proportion'!$D$21+1,1)),NA())","v":110804},{"$f":"IF(AND('Population Proportion'!$D$21<>\"\",'Population Proportion'!$D$22<>\"\",'Population Proportion'!$D$21>=0,'Population Proportion'!$D$22<=90,'Population Proportion'!$D$21<='Population Proportion'!$D$22),SUM(OFFSET(AM$183,MATCH('Population Proportion'!$D$21,$G$306:$G$396,0),0,'Population Proportion'!$D$22-'Population Proportion'!$D$21+1,1)),NA())","v":113714},{"$f":"IF(AND('Population Proportion'!$D$21<>\"\",'Population Proportion'!$D$22<>\"\",'Population Proportion'!$D$21>=0,'Population Proportion'!$D$22<=90,'Population Proportion'!$D$21<='Population Proportion'!$D$22),SUM(OFFSET(AN$183,MATCH('Population Proportion'!$D$21,$G$306:$G$396,0),0,'Population Proportion'!$D$22-'Population Proportion'!$D$21+1,1)),NA())","v":117855},{"$f":"IF(AND('Population Proportion'!$D$21<>\"\",'Population Proportion'!$D$22<>\"\",'Population Proportion'!$D$21>=0,'Population Proportion'!$D$22<=90,'Population Proportion'!$D$21<='Population Proportion'!$D$22),SUM(OFFSET(AO$183,MATCH('Population Proportion'!$D$21,$G$306:$G$396,0),0,'Population Proportion'!$D$22-'Population Proportion'!$D$21+1,1)),NA())","v":120954},{"$f":"IF(AND('Population Proportion'!$D$21<>\"\",'Population Proportion'!$D$22<>\"\",'Population Proportion'!$D$21>=0,'Population Proportion'!$D$22<=90,'Population Proportion'!$D$21<='Population Proportion'!$D$22),SUM(OFFSET(AP$183,MATCH('Population Proportion'!$D$21,$G$306:$G$396,0),0,'Population Proportion'!$D$22-'Population Proportion'!$D$21+1,1)),NA())","v":123590},{"$f":"IF(AND('Population Proportion'!$D$21<>\"\",'Population Proportion'!$D$22<>\"\",'Population Proportion'!$D$21>=0,'Population Proportion'!$D$22<=90,'Population Proportion'!$D$21<='Population Proportion'!$D$22),SUM(OFFSET(AQ$183,MATCH('Population Proportion'!$D$21,$G$306:$G$396,0),0,'Population Proportion'!$D$22-'Population Proportion'!$D$21+1,1)),NA())","v":126094},{"$f":"IF(AND('Population Proportion'!$D$21<>\"\",'Population Proportion'!$D$22<>\"\",'Population Proportion'!$D$21>=0,'Population Proportion'!$D$22<=90,'Population Proportion'!$D$21<='Population Proportion'!$D$22),SUM(OFFSET(AR$183,MATCH('Population Proportion'!$D$21,$G$306:$G$396,0),0,'Population Proportion'!$D$22-'Population Proportion'!$D$21+1,1)),NA())","v":127324},{"$f":"IF(AND('Population Proportion'!$D$21<>\"\",'Population Proportion'!$D$22<>\"\",'Population Proportion'!$D$21>=0,'Population Proportion'!$D$22<=90,'Population Proportion'!$D$21<='Population Proportion'!$D$22),SUM(OFFSET(AS$183,MATCH('Population Proportion'!$D$21,$G$306:$G$396,0),0,'Population Proportion'!$D$22-'Population Proportion'!$D$21+1,1)),NA())","v":126673},{"$f":"IF(AND('Population Proportion'!$D$21<>\"\",'Population Proportion'!$D$22<>\"\",'Population Proportion'!$D$21>=0,'Population Proportion'!$D$22<=90,'Population Proportion'!$D$21<='Population Proportion'!$D$22),SUM(OFFSET(AT$183,MATCH('Population Proportion'!$D$21,$G$306:$G$396,0),0,'Population Proportion'!$D$22-'Population Proportion'!$D$21+1,1)),NA())","v":125781},{"$f":"IF(AND('Population Proportion'!$D$21<>\"\",'Population Proportion'!$D$22<>\"\",'Population Proportion'!$D$21>=0,'Population Proportion'!$D$22<=90,'Population Proportion'!$D$21<='Population Proportion'!$D$22),SUM(OFFSET(AU$183,MATCH('Population Proportion'!$D$21,$G$306:$G$396,0),0,'Population Proportion'!$D$22-'Population Proportion'!$D$21+1,1)),NA())","v":125316},{"$f":"IF(AND('Population Proportion'!$D$21<>\"\",'Population Proportion'!$D$22<>\"\",'Population Proportion'!$D$21>=0,'Population Proportion'!$D$22<=90,'Population Proportion'!$D$21<='Population Proportion'!$D$22),SUM(OFFSET(AV$183,MATCH('Population Proportion'!$D$21,$G$306:$G$396,0),0,'Population Proportion'!$D$22-'Population Proportion'!$D$21+1,1)),NA())","v":124769},{"$f":"IF(AND('Population Proportion'!$D$21<>\"\",'Population Proportion'!$D$22<>\"\",'Population Proportion'!$D$21>=0,'Population Proportion'!$D$22<=90,'Population Proportion'!$D$21<='Population Proportion'!$D$22),SUM(OFFSET(AW$183,MATCH('Population Proportion'!$D$21,$G$306:$G$396,0),0,'Population Proportion'!$D$22-'Population Proportion'!$D$21+1,1)),NA())","v":123001},{"$f":"IF(AND('Population Proportion'!$D$21<>\"\",'Population Proportion'!$D$22<>\"\",'Population Proportion'!$D$21>=0,'Population Proportion'!$D$22<=90,'Population Proportion'!$D$21<='Population Proportion'!$D$22),SUM(OFFSET(AX$183,MATCH('Population Proportion'!$D$21,$G$306:$G$396,0),0,'Population Proportion'!$D$22-'Population Proportion'!$D$21+1,1)),NA())","v":121736},{"$f":"IF(AND('Population Proportion'!$D$21<>\"\",'Population Proportion'!$D$22<>\"\",'Population Proportion'!$D$21>=0,'Population Proportion'!$D$22<=90,'Population Proportion'!$D$21<='Population Proportion'!$D$22),SUM(OFFSET(AY$183,MATCH('Population Proportion'!$D$21,$G$306:$G$396,0),0,'Population Proportion'!$D$22-'Population Proportion'!$D$21+1,1)),NA())","v":120208},{"$f":"IF(AND('Population Proportion'!$D$21<>\"\",'Population Proportion'!$D$22<>\"\",'Population Proportion'!$D$21>=0,'Population Proportion'!$D$22<=90,'Population Proportion'!$D$21<='Population Proportion'!$D$22),SUM(OFFSET(AZ$183,MATCH('Population Proportion'!$D$21,$G$306:$G$396,0),0,'Population Proportion'!$D$22-'Population Proportion'!$D$21+1,1)),NA())","v":118445},{"$f":"IF(AND('Population Proportion'!$D$21<>\"\",'Population Proportion'!$D$22<>\"\",'Population Proportion'!$D$21>=0,'Population Proportion'!$D$22<=90,'Population Proportion'!$D$21<='Population Proportion'!$D$22),SUM(OFFSET(BA$183,MATCH('Population Proportion'!$D$21,$G$306:$G$396,0),0,'Population Proportion'!$D$22-'Population Proportion'!$D$21+1,1)),NA())","v":116146},{"$f":"IF(AND('Population Proportion'!$D$21<>\"\",'Population Proportion'!$D$22<>\"\",'Population Proportion'!$D$21>=0,'Population Proportion'!$D$22<=90,'Population Proportion'!$D$21<='Population Proportion'!$D$22),SUM(OFFSET(BB$183,MATCH('Population Proportion'!$D$21,$G$306:$G$396,0),0,'Population Proportion'!$D$22-'Population Proportion'!$D$21+1,1)),NA())","v":114312},{"$f":"IF(AND('Population Proportion'!$D$21<>\"\",'Population Proportion'!$D$22<>\"\",'Population Proportion'!$D$21>=0,'Population Proportion'!$D$22<=90,'Population Proportion'!$D$21<='Population Proportion'!$D$22),SUM(OFFSET(BC$183,MATCH('Population Proportion'!$D$21,$G$306:$G$396,0),0,'Population Proportion'!$D$22-'Population Proportion'!$D$21+1,1)),NA())","v":112871},{"$f":"IF(AND('Population Proportion'!$D$21<>\"\",'Population Proportion'!$D$22<>\"\",'Population Proportion'!$D$21>=0,'Population Proportion'!$D$22<=90,'Population Proportion'!$D$21<='Population Proportion'!$D$22),SUM(OFFSET(BD$183,MATCH('Population Proportion'!$D$21,$G$306:$G$396,0),0,'Population Proportion'!$D$22-'Population Proportion'!$D$21+1,1)),NA())","v":111766},{"$f":"IF(AND('Population Proportion'!$D$21<>\"\",'Population Proportion'!$D$22<>\"\",'Population Proportion'!$D$21>=0,'Population Proportion'!$D$22<=90,'Population Proportion'!$D$21<='Population Proportion'!$D$22),SUM(OFFSET(BE$183,MATCH('Population Proportion'!$D$21,$G$306:$G$396,0),0,'Population Proportion'!$D$22-'Population Proportion'!$D$21+1,1)),NA())","v":110734},{"$f":"IF(AND('Population Proportion'!$D$21<>\"\",'Population Proportion'!$D$22<>\"\",'Population Proportion'!$D$21>=0,'Population Proportion'!$D$22<=90,'Population Proportion'!$D$21<='Population Proportion'!$D$22),SUM(OFFSET(BF$183,MATCH('Population Proportion'!$D$21,$G$306:$G$396,0),0,'Population Proportion'!$D$22-'Population Proportion'!$D$21+1,1)),NA())","v":109771},{"$f":"IF(AND('Population Proportion'!$D$21<>\"\",'Population Proportion'!$D$22<>\"\",'Population Proportion'!$D$21>=0,'Population Proportion'!$D$22<=90,'Population Proportion'!$D$21<='Population Proportion'!$D$22),SUM(OFFSET(BG$183,MATCH('Population Proportion'!$D$21,$G$306:$G$396,0),0,'Population Proportion'!$D$22-'Population Proportion'!$D$21+1,1)),NA())","v":108908},{"$f":"IF(AND('Population Proportion'!$D$21<>\"\",'Population Proportion'!$D$22<>\"\",'Population Proportion'!$D$21>=0,'Population Proportion'!$D$22<=90,'Population Proportion'!$D$21<='Population Proportion'!$D$22),SUM(OFFSET(BH$183,MATCH('Population Proportion'!$D$21,$G$306:$G$396,0),0,'Population Proportion'!$D$22-'Population Proportion'!$D$21+1,1)),NA())","v":108111},{"$f":"IF(AND('Population Proportion'!$D$21<>\"\",'Population Proportion'!$D$22<>\"\",'Population Proportion'!$D$21>=0,'Population Proportion'!$D$22<=90,'Population Proportion'!$D$21<='Population Proportion'!$D$22),SUM(OFFSET(BI$183,MATCH('Population Proportion'!$D$21,$G$306:$G$396,0),0,'Population Proportion'!$D$22-'Population Proportion'!$D$21+1,1)),NA())","v":107356},{"$f":"IF(AND('Population Proportion'!$D$21<>\"\",'Population Proportion'!$D$22<>\"\",'Population Proportion'!$D$21>=0,'Population Proportion'!$D$22<=90,'Population Proportion'!$D$21<='Population Proportion'!$D$22),SUM(OFFSET(BJ$183,MATCH('Population Proportion'!$D$21,$G$306:$G$396,0),0,'Population Proportion'!$D$22-'Population Proportion'!$D$21+1,1)),NA())","v":106676},{"$f":"IF(AND('Population Proportion'!$D$21<>\"\",'Population Proportion'!$D$22<>\"\",'Population Proportion'!$D$21>=0,'Population Proportion'!$D$22<=90,'Population Proportion'!$D$21<='Population Proportion'!$D$22),SUM(OFFSET(BK$183,MATCH('Population Proportion'!$D$21,$G$306:$G$396,0),0,'Population Proportion'!$D$22-'Population Proportion'!$D$21+1,1)),NA())","v":106116},{"$f":"IF(AND('Population Proportion'!$D$21<>\"\",'Population Proportion'!$D$22<>\"\",'Population Proportion'!$D$21>=0,'Population Proportion'!$D$22<=90,'Population Proportion'!$D$21<='Population Proportion'!$D$22),SUM(OFFSET(BL$183,MATCH('Population Proportion'!$D$21,$G$306:$G$396,0),0,'Population Proportion'!$D$22-'Population Proportion'!$D$21+1,1)),NA())","v":105691},{"$f":"IF(AND('Population Proportion'!$D$21<>\"\",'Population Proportion'!$D$22<>\"\",'Population Proportion'!$D$21>=0,'Population Proportion'!$D$22<=90,'Population Proportion'!$D$21<='Population Proportion'!$D$22),SUM(OFFSET(BM$183,MATCH('Population Proportion'!$D$21,$G$306:$G$396,0),0,'Population Proportion'!$D$22-'Population Proportion'!$D$21+1,1)),NA())","v":105427},{"$f":"IF(AND('Population Proportion'!$D$21<>\"\",'Population Proportion'!$D$22<>\"\",'Population Proportion'!$D$21>=0,'Population Proportion'!$D$22<=90,'Population Proportion'!$D$21<='Population Proportion'!$D$22),SUM(OFFSET(BN$183,MATCH('Population Proportion'!$D$21,$G$306:$G$396,0),0,'Population Proportion'!$D$22-'Population Proportion'!$D$21+1,1)),NA())","v":105334},{"$f":"IF(AND('Population Proportion'!$D$21<>\"\",'Population Proportion'!$D$22<>\"\",'Population Proportion'!$D$21>=0,'Population Proportion'!$D$22<=90,'Population Proportion'!$D$21<='Population Proportion'!$D$22),SUM(OFFSET(BO$183,MATCH('Population Proportion'!$D$21,$G$306:$G$396,0),0,'Population Proportion'!$D$22-'Population Proportion'!$D$21+1,1)),NA())","v":105418},{"$f":"IF(AND('Population Proportion'!$D$21<>\"\",'Population Proportion'!$D$22<>\"\",'Population Proportion'!$D$21>=0,'Population Proportion'!$D$22<=90,'Population Proportion'!$D$21<='Population Proportion'!$D$22),SUM(OFFSET(BP$183,MATCH('Population Proportion'!$D$21,$G$306:$G$396,0),0,'Population Proportion'!$D$22-'Population Proportion'!$D$21+1,1)),NA())","v":105681},{"$f":"IF(AND('Population Proportion'!$D$21<>\"\",'Population Proportion'!$D$22<>\"\",'Population Proportion'!$D$21>=0,'Population Proportion'!$D$22<=90,'Population Proportion'!$D$21<='Population Proportion'!$D$22),SUM(OFFSET(BQ$183,MATCH('Population Proportion'!$D$21,$G$306:$G$396,0),0,'Population Proportion'!$D$22-'Population Proportion'!$D$21+1,1)),NA())","v":106129},{"$f":"IF(AND('Population Proportion'!$D$21<>\"\",'Population Proportion'!$D$22<>\"\",'Population Proportion'!$D$21>=0,'Population Proportion'!$D$22<=90,'Population Proportion'!$D$21<='Population Proportion'!$D$22),SUM(OFFSET(BR$183,MATCH('Population Proportion'!$D$21,$G$306:$G$396,0),0,'Population Proportion'!$D$22-'Population Proportion'!$D$21+1,1)),NA())","v":106750},{"$f":"IF(AND('Population Proportion'!$D$21<>\"\",'Population Proportion'!$D$22<>\"\",'Population Proportion'!$D$21>=0,'Population Proportion'!$D$22<=90,'Population Proportion'!$D$21<='Population Proportion'!$D$22),SUM(OFFSET(BS$183,MATCH('Population Proportion'!$D$21,$G$306:$G$396,0),0,'Population Proportion'!$D$22-'Population Proportion'!$D$21+1,1)),NA())","v":107503},{"$f":"IF(AND('Population Proportion'!$D$21<>\"\",'Population Proportion'!$D$22<>\"\",'Population Proportion'!$D$21>=0,'Population Proportion'!$D$22<=90,'Population Proportion'!$D$21<='Population Proportion'!$D$22),SUM(OFFSET(BT$183,MATCH('Population Proportion'!$D$21,$G$306:$G$396,0),0,'Population Proportion'!$D$22-'Population Proportion'!$D$21+1,1)),NA())","v":108333},{"$f":"IF(AND('Population Proportion'!$D$21<>\"\",'Population Proportion'!$D$22<>\"\",'Population Proportion'!$D$21>=0,'Population Proportion'!$D$22<=90,'Population Proportion'!$D$21<='Population Proportion'!$D$22),SUM(OFFSET(BU$183,MATCH('Population Proportion'!$D$21,$G$306:$G$396,0),0,'Population Proportion'!$D$22-'Population Proportion'!$D$21+1,1)),NA())","v":109173},{"$f":"IF(AND('Population Proportion'!$D$21<>\"\",'Population Proportion'!$D$22<>\"\",'Population Proportion'!$D$21>=0,'Population Proportion'!$D$22<=90,'Population Proportion'!$D$21<='Population Proportion'!$D$22),SUM(OFFSET(BV$183,MATCH('Population Proportion'!$D$21,$G$306:$G$396,0),0,'Population Proportion'!$D$22-'Population Proportion'!$D$21+1,1)),NA())","v":109960},{"$f":"IF(AND('Population Proportion'!$D$21<>\"\",'Population Proportion'!$D$22<>\"\",'Population Proportion'!$D$21>=0,'Population Proportion'!$D$22<=90,'Population Proportion'!$D$21<='Population Proportion'!$D$22),SUM(OFFSET(BW$183,MATCH('Population Proportion'!$D$21,$G$306:$G$396,0),0,'Population Proportion'!$D$22-'Population Proportion'!$D$21+1,1)),NA())","v":110643},{"$f":"IF(AND('Population Proportion'!$D$21<>\"\",'Population Proportion'!$D$22<>\"\",'Population Proportion'!$D$21>=0,'Population Proportion'!$D$22<=90,'Population Proportion'!$D$21<='Population Proportion'!$D$22),SUM(OFFSET(BX$183,MATCH('Population Proportion'!$D$21,$G$306:$G$396,0),0,'Population Proportion'!$D$22-'Population Proportion'!$D$21+1,1)),NA())","v":111154},{"$f":"IF(AND('Population Proportion'!$D$21<>\"\",'Population Proportion'!$D$22<>\"\",'Population Proportion'!$D$21>=0,'Population Proportion'!$D$22<=90,'Population Proportion'!$D$21<='Population Proportion'!$D$22),SUM(OFFSET(BY$183,MATCH('Population Proportion'!$D$21,$G$306:$G$396,0),0,'Population Proportion'!$D$22-'Population Proportion'!$D$21+1,1)),NA())","v":111466},{"$f":"IF(AND('Population Proportion'!$D$21<>\"\",'Population Proportion'!$D$22<>\"\",'Population Proportion'!$D$21>=0,'Population Proportion'!$D$22<=90,'Population Proportion'!$D$21<='Population Proportion'!$D$22),SUM(OFFSET(BZ$183,MATCH('Population Proportion'!$D$21,$G$306:$G$396,0),0,'Population Proportion'!$D$22-'Population Proportion'!$D$21+1,1)),NA())","v":111559},{"$f":"IF(AND('Population Proportion'!$D$21<>\"\",'Population Proportion'!$D$22<>\"\",'Population Proportion'!$D$21>=0,'Population Proportion'!$D$22<=90,'Population Proportion'!$D$21<='Population Proportion'!$D$22),SUM(OFFSET(CA$183,MATCH('Population Proportion'!$D$21,$G$306:$G$396,0),0,'Population Proportion'!$D$22-'Population Proportion'!$D$21+1,1)),NA())","v":111434},{"$f":"IF(AND('Population Proportion'!$D$21<>\"\",'Population Proportion'!$D$22<>\"\",'Population Proportion'!$D$21>=0,'Population Proportion'!$D$22<=90,'Population Proportion'!$D$21<='Population Proportion'!$D$22),SUM(OFFSET(CB$183,MATCH('Population Proportion'!$D$21,$G$306:$G$396,0),0,'Population Proportion'!$D$22-'Population Proportion'!$D$21+1,1)),NA())","v":111091},{"$f":"IF(AND('Population Proportion'!$D$21<>\"\",'Population Proportion'!$D$22<>\"\",'Population Proportion'!$D$21>=0,'Population Proportion'!$D$22<=90,'Population Proportion'!$D$21<='Population Proportion'!$D$22),SUM(OFFSET(CC$183,MATCH('Population Proportion'!$D$21,$G$306:$G$396,0),0,'Population Proportion'!$D$22-'Population Proportion'!$D$21+1,1)),NA())","v":110565},{"$f":"IF(AND('Population Proportion'!$D$21<>\"\",'Population Proportion'!$D$22<>\"\",'Population Proportion'!$D$21>=0,'Population Proportion'!$D$22<=90,'Population Proportion'!$D$21<='Population Proportion'!$D$22),SUM(OFFSET(CD$183,MATCH('Population Proportion'!$D$21,$G$306:$G$396,0),0,'Population Proportion'!$D$22-'Population Proportion'!$D$21+1,1)),NA())","v":109880},{"$f":"IF(AND('Population Proportion'!$D$21<>\"\",'Population Proportion'!$D$22<>\"\",'Population Proportion'!$D$21>=0,'Population Proportion'!$D$22<=90,'Population Proportion'!$D$21<='Population Proportion'!$D$22),SUM(OFFSET(CE$183,MATCH('Population Proportion'!$D$21,$G$306:$G$396,0),0,'Population Proportion'!$D$22-'Population Proportion'!$D$21+1,1)),NA())","v":109071},{"$f":"IF(AND('Population Proportion'!$D$21<>\"\",'Population Proportion'!$D$22<>\"\",'Population Proportion'!$D$21>=0,'Population Proportion'!$D$22<=90,'Population Proportion'!$D$21<='Population Proportion'!$D$22),SUM(OFFSET(CF$183,MATCH('Population Proportion'!$D$21,$G$306:$G$396,0),0,'Population Proportion'!$D$22-'Population Proportion'!$D$21+1,1)),NA())","v":108167},{"$f":"IF(AND('Population Proportion'!$D$21<>\"\",'Population Proportion'!$D$22<>\"\",'Population Proportion'!$D$21>=0,'Population Proportion'!$D$22<=90,'Population Proportion'!$D$21<='Population Proportion'!$D$22),SUM(OFFSET(CG$183,MATCH('Population Proportion'!$D$21,$G$306:$G$396,0),0,'Population Proportion'!$D$22-'Population Proportion'!$D$21+1,1)),NA())","v":107222},{"$f":"IF(AND('Population Proportion'!$D$21<>\"\",'Population Proportion'!$D$22<>\"\",'Population Proportion'!$D$21>=0,'Population Proportion'!$D$22<=90,'Population Proportion'!$D$21<='Population Proportion'!$D$22),SUM(OFFSET(CH$183,MATCH('Population Proportion'!$D$21,$G$306:$G$396,0),0,'Population Proportion'!$D$22-'Population Proportion'!$D$21+1,1)),NA())","v":106264},{"$f":"IF(AND('Population Proportion'!$D$21<>\"\",'Population Proportion'!$D$22<>\"\",'Population Proportion'!$D$21>=0,'Population Proportion'!$D$22<=90,'Population Proportion'!$D$21<='Population Proportion'!$D$22),SUM(OFFSET(CI$183,MATCH('Population Proportion'!$D$21,$G$306:$G$396,0),0,'Population Proportion'!$D$22-'Population Proportion'!$D$21+1,1)),NA())","v":105318},{"$f":"IF(AND('Population Proportion'!$D$21<>\"\",'Population Proportion'!$D$22<>\"\",'Population Proportion'!$D$21>=0,'Population Proportion'!$D$22<=90,'Population Proportion'!$D$21<='Population Proportion'!$D$22),SUM(OFFSET(CJ$183,MATCH('Population Proportion'!$D$21,$G$306:$G$396,0),0,'Population Proportion'!$D$22-'Population Proportion'!$D$21+1,1)),NA())","v":104415},{"$f":"IF(AND('Population Proportion'!$D$21<>\"\",'Population Proportion'!$D$22<>\"\",'Population Proportion'!$D$21>=0,'Population Proportion'!$D$22<=90,'Population Proportion'!$D$21<='Population Proportion'!$D$22),SUM(OFFSET(CK$183,MATCH('Population Proportion'!$D$21,$G$306:$G$396,0),0,'Population Proportion'!$D$22-'Population Proportion'!$D$21+1,1)),NA())","v":103572},{"$f":"IF(AND('Population Proportion'!$D$21<>\"\",'Population Proportion'!$D$22<>\"\",'Population Proportion'!$D$21>=0,'Population Proportion'!$D$22<=90,'Population Proportion'!$D$21<='Population Proportion'!$D$22),SUM(OFFSET(CL$183,MATCH('Population Proportion'!$D$21,$G$306:$G$396,0),0,'Population Proportion'!$D$22-'Population Proportion'!$D$21+1,1)),NA())","v":102804},{"$f":"IF(AND('Population Proportion'!$D$21<>\"\",'Population Proportion'!$D$22<>\"\",'Population Proportion'!$D$21>=0,'Population Proportion'!$D$22<=90,'Population Proportion'!$D$21<='Population Proportion'!$D$22),SUM(OFFSET(CM$183,MATCH('Population Proportion'!$D$21,$G$306:$G$396,0),0,'Population Proportion'!$D$22-'Population Proportion'!$D$21+1,1)),NA())","v":102123},{"$f":"IF(AND('Population Proportion'!$D$21<>\"\",'Population Proportion'!$D$22<>\"\",'Population Proportion'!$D$21>=0,'Population Proportion'!$D$22<=90,'Population Proportion'!$D$21<='Population Proportion'!$D$22),SUM(OFFSET(CN$183,MATCH('Population Proportion'!$D$21,$G$306:$G$396,0),0,'Population Proportion'!$D$22-'Population Proportion'!$D$21+1,1)),NA())","v":101538},{"$f":"IF(AND('Population Proportion'!$D$21<>\"\",'Population Proportion'!$D$22<>\"\",'Population Proportion'!$D$21>=0,'Population Proportion'!$D$22<=90,'Population Proportion'!$D$21<='Population Proportion'!$D$22),SUM(OFFSET(CO$183,MATCH('Population Proportion'!$D$21,$G$306:$G$396,0),0,'Population Proportion'!$D$22-'Population Proportion'!$D$21+1,1)),NA())","v":101051},{"$f":"IF(AND('Population Proportion'!$D$21<>\"\",'Population Proportion'!$D$22<>\"\",'Population Proportion'!$D$21>=0,'Population Proportion'!$D$22<=90,'Population Proportion'!$D$21<='Population Proportion'!$D$22),SUM(OFFSET(CP$183,MATCH('Population Proportion'!$D$21,$G$306:$G$396,0),0,'Population Proportion'!$D$22-'Population Proportion'!$D$21+1,1)),NA())","v":100674},{"$f":"IF(AND('Population Proportion'!$D$21<>\"\",'Population Proportion'!$D$22<>\"\",'Population Proportion'!$D$21>=0,'Population Proportion'!$D$22<=90,'Population Proportion'!$D$21<='Population Proportion'!$D$22),SUM(OFFSET(CQ$183,MATCH('Population Proportion'!$D$21,$G$306:$G$396,0),0,'Population Proportion'!$D$22-'Population Proportion'!$D$21+1,1)),NA())","v":100395}]
["All","All",{"$f":"C468+C476","v":1540413},1538977,1529993,1526942,1523518,1523521,1523310,1523225,1528253,1532773,1542964,1544545,1550560,1557317,1565352,1573501,1581954,1585440,1590435,1595595,1607295,1623263,1635552,1643707,1649131,1661751,1671261,1677769,1679006,1682944,1688838,1697534,1704924,1714042,1727733,1743113,1761683,1779152,1793333,1804833,1814318,1823634,1829725,1840498,1851621,1862137,1870834,1881641,1892266,1901856,1910623,1918481,1925423,1931991,1937636,1942838,1947558,1951761,1955546,1958990,1962101,1964894,1967472,1969894,1972163,1974305,1976442,1978607,1980785,1982960,1985111,1987197,1989195,1991044,1992696,1994088,1995199,1996002,1996437,1996513,1996212,1995543,1994521,1993184,1991549,1989667,1987563,1985268,1982847,1980320,1977754,1975172,1972610]
["Males","0-15",0.32600419022730859,0.32490175034224017,0.32428266147973189,0.32428645033795017,0.32368709937333329,0.32115192064134102,0.31806485499941639,0.3143008422564032,0.30959856455211776,0.3064144723767227,0.30137122088220719,0.29676624771882437,0.29218998884077085,0.28815669873428362,0.28473078356135728,0.28212883418815876,0.27949666817623081,0.27821990746723874,0.27586189120536536,0.27388788045518353,0.27228755666219756,0.26991753733039098,0.26799647211517741,0.26622366094475192,0.26482872188792733,0.26188904259533263,0.25928028654145396,0.25716254066051114,0.25499390346708239,0.25198359980401669,0.24762548330468181,0.24231169163291058,0.23750696191591927,0.23330840046716317,0.22975011268175477,0.22663900317661262,0.22430577461913864,0.22280877797652807,0.22164514285844369,0.22047290384213175,0.21964035523691081,0.2191151285341871,0.2185845097503748,0.21787039262842703,0.21714300170822842,0.21731662465458859,0.21763046483121942,0.21784171885122003,0.21765576231232825,0.2170335883791292,0.21615767331881491,0.21490117537449416,0.21289834612851849,0.21026888204543573,0.20753978116443578,0.20500336757117443,0.2023057967735038,0.1993620431185138,0.19691811595849507,0.19452105621173707,0.192175474760691,0.18955869065220962,0.18748462408974612,0.18587009807684238,0.18458081216334013,0.18351894050331807,0.18267212319581955,0.18205952953937923,0.18165652936430682,0.18142967157509818,0.18135940271953491,0.18144494278120477,0.18166185232447352,0.18197146432030997,0.18234380558755384,0.18274501592146686,0.18313903492141401,0.18349581787795621,0.18378919078523179,0.18398992155071597,0.18407666131118619,0.18402006772858398,0.18380837515828596,0.18342913799885999,0.18288943117015308,0.1821967604912485,0.18137659224550445,0.18044855814851152,0.17943856614097201,0.17837848174136384,0.17731143552311435,0.17626643475526865,0.17526250351668496]
["Males","16-39",0.32985252043100238,0.33265611365673542,0.33385996599382067,0.33528655232565069,0.33660139828579239,0.3416666114091334,0.34501703080400248,0.34959147844065125,0.35513430839617832,0.36052821949170732,0.36176573599867834,0.36480045246895554,0.36731386682441541,0.36914494527838931,0.3710408482099084,0.37206575366711653,0.37220417933622307,0.3703572074749929,0.36951744918092788,0.36859480333828692,0.36771116644321011,0.36946861318291763,0.36933295916373093,0.36838390614829425,0.365809550579965,0.36533608441815668,0.36450039790611866,0.36151729209240852,0.35757081874360108,0.35483096438905126,0.35285032992709942,0.35310608381806208,0.35212530488390403,0.35012663271502209,0.34821324001746123,0.34620037275380666,0.34450789556697781,0.34181249555108051,0.33886510001570747,0.33514106281831696,0.33083854891704018,0.32705008562983762,0.32314508802924835,0.32092330768097432,0.3195982088350498,0.31786152513130822,0,0.31327170169479801,0.31327170169479801,0.31327170169479801,0.31327170169479801,0.31327170169479801,0.31327170169479801,0.31327170169479801,0.31327170169479801,0.31327170169479801,0.31327170169479801,0.31327170169479801,0.31327170169479801,0.31327170169479801,0.31327170169479801,0.31327170169479801,0.31327170169479801,0.31327170169479801,0.31327170169479801,0.31327170169479801,0.31327170169479801,0.31327170169479801,0.31327170169479801,0.31327170169479801,0.31327170169479801,0.31327170169479801,0.31327170169479801,0.31327170169479801,0.31327170169479801,0.31327170169479801,0.31327170169479801,0.31327170169479801,0.31327170169479801,0.31327170169479801,0.31327170169479801,0.31327170169479801,0.31327170169479801,0.31327170169479801,0.31327170169479801,0.31327170169479801,0.31327170169479801,0.31327170169479801,0.31327170169479801,0.31327170169479801,0.31327170169479801,0.31327170169479801,0.31327170169479801]
["Males","40-64",0.25502211067129776,0.25325639695369956,0.25140490509364932,0.24922217821887091,0.24785259460729461,0.24469361908108933,0.24415594062032447,0.24262876358033947,0.24168228135573019,0.23894552189961868,0.23835849991739633,0.23996315760957901,0.24234499277350982,0.24414166145633567,0.24442250998490009,0.24496637744458166,0.24620819046386749,0.24852542066220373,0.25047458627546754,0.25268677592031719,0.25414288450488415,0.25454857621863464,0.25667742404273552,0.25926558646093378,0.26249418542463193,0.26555290511348845,0.26875400818374556,0.2732117620185936,0.27851625782836364,0.2833470245393539,0.28812177518856008,0.29182760625631798,0.29630634350573276,0.30110909500853561,0.30560711509864535,0.30956148679537221,0.3122761685624687,0.31414653076126464,0.31557590699347343,0.31740405976021302,0.31940736875957187,0.3202857756095816,0.32120448756889913,0.32089339777625397,0.32025598127438459,0.31908419133032417,0,0.31764868668830115,0.31764868668830115,0.31764868668830115,0.31764868668830115,0.31764868668830115,0.31764868668830115,0.31764868668830115,0.31764868668830115,0.31764868668830115,0.31764868668830115,0.31764868668830115,0.31764868668830115,0.31764868668830115,0.31764868668830115,0.31764868668830115,0.31764868668830115,0.31764868668830115,0.31764868668830115,0.31764868668830115,0.31764868668830115,0.31764868668830115,0.31764868668830115,0.31764868668830115,0.31764868668830115,0.31764868668830115,0.31764868668830115,0.31764868668830115,0.31764868668830115,0.31764868668830115,0.31764868668830115,0.31764868668830115,0.31764868668830115,0.31764868668830115,0.31764868668830115,0.31764868668830115,0.31764868668830115,0.31764868668830115,0.31764868668830115,0.31764868668830115,0.31764868668830115,0.31764868668830115,0.31764868668830115,0.31764868668830115,0.31764868668830115,0.31764868668830115,0.31764868668830115]
["Males","16-64",0.58487463110230009,0.58591251061043503,0.58526487108746994,0.58450873054452157,0.58445399289308697,0.58636023049022268,0.58917297142432701,0.59222024202099077,0.59681658975190854,0.59947374139132603,0.60012423591607467,0.60476361007853452,0.60965885959792521,0.61328660673472501,0.61546335819480846,0.61703213111169819,0.61841236980009062,0.61888262813719663,0.61999203545639536,0.62128157925860406,0.62185405094809421,0.62401718940155226,0.6260103832064664,0.62764949260922809,0.62830373600459688,0.63088898953164507,0.63325440608986427,0.63472905411100211,0.63608707657196473,0.63817798892840516,0.6409721051156595,0.64493369007438006,0.64843164838963685,0.65123572772355776,0.65382035511610659,0.65576185954917887,0.65678406412944645,0.65595902631234515,0.65444100700918095,0.65254512257852992,0.65024591767661211,0.64733586123941922,0.64434957559814743,0.64181670545722824,0.63985419010943445,0.63694571646163245,0.63406712103693785,0.63161520190023757,0.62884637875222771,0.6267544177829365,0.62469381863875062,0.6227900329256969,0.62130214239578885,0.62041747392752622,0.61954085884291588,0.61808932235307346,0.61682399174588276,0.61542029369621576,0.61351885095034575,0.61160719807062025,0.60991653757454944,0.6087727944800394,0.60708911467558879,0.60542160351492336,0.60370937727058593,0.60194890079668384,0.60020360082010982,0.59857093287230889,0.59735976280135017,0.59633232310216389,0.5955145201604447,0.59466571698271653,0.59372407807620298,0.59239687600904101,0.59042611623587415,0.58839560138647129,0.58673125064746579,0.58511620802175524,0.58337802524038218,0.58150042411801017,0.5796683750013798,0.57786830553116764,0.57628931562269847,0.57498454547644084,0.57374551170795507,0.57267405079180178,0.57178479180124797,0.57142512504623899,0.57107640006437077,0.57065031420715528,0.57032999790528671,0.57007677866200157,0.56979069296088236]
["Males","60+",0.13635731162860965,0.13693698688728451,0.13819740785582438,0.13844234317404266,0.13915824097930446,0.13816151555941622,0.13759138803705392,0.13646358471862638,0.13598352677891587,0.13450200195558334,0.14016718982322815,0.14137804811975627,0.14202787040538173,0.14275825290158517,0.14338774096129583,0.14377074974329207,0.14457786116322702,0.14509292046835018,0.14601792151187143,0.1465938366131711,0.1471595479793143,0.14675754561200632,0.14664901053855367,0.14666947649841761,0.14735066802319363,0.14797364585788558,0.14867832631735128,0.14990429587537821,0.1515471021309765,0.15281823522385732,0.15443791074073759,0.15639588605838942,0.15934745241890569,0.16235471237135415,0.16474250000887258,0.1672750290114991,0.16980919819635931,0.17225297876688581,0.17511114753426621,0.17857518357102883,0.18196783617182527,0.18506217665234287,0.18872980398932168,0.1922608675423253,0.19516922240958104,0.1984936839839469,0,0.20652039962554022,1.20652039962554,2.20652039962554,3.20652039962554,4.20652039962554,5.20652039962554,6.20652039962554,7.20652039962554,8.2065203996255391,9.2065203996255391,10.2065203996255,11.2065203996255,12.2065203996255,13.2065203996255,14.2065203996255,15.2065203996255,16.2065203996255,17.2065203996255,18.2065203996255,19.2065203996255,20.2065203996255,21.2065203996255,22.2065203996255,23.2065203996255,24.2065203996255,25.2065203996255,26.2065203996255,27.2065203996255,28.2065203996255,29.2065203996255,30.2065203996255,31.2065203996255,32.206520399625497,33.206520399625497,34.206520399625497,35.206520399625497,36.206520399625497,37.206520399625497,38.206520399625497,39.206520399625497,40.206520399625497,41.206520399625497,42.206520399625497,43.206520399625497,44.206520399625497,45.206520399625497]
["Males","65+",8.9121178670391307E-2,8.9185739047324852E-2,9.0452467432798098E-2,9.1204819117528244E-2,9.1858907733579701E-2,9.2487848868436237E-2,9.2762173576256615E-2,9.3478915722606096E-2,9.3584845695973723E-2,9.4111786231951267E-2,9.8504543201718156E-2,9.8470142202641081E-2,9.8151151561303954E-2,9.8556694530991404E-2,9.98058582438342E-2,0.10083903470014302,0.10209096202367859,0.10289746439556463,0.10414607333823922,0.10483054028621235,0.10585839238970823,0.1060652732680567,0.10599314467835613,0.10612684644602005,0.10686754210747575,0.10722196787302229,0.10746530736868179,0.10810840522848672,0.10891901996095286,0.10983841126757816,0.11140241157965868,0.11275461829270941,0.1140613896944439,0.11545587180927908,0.11642953220213864,0.11759913727420848,0.11891016125141489,0.12123219571112677,0.12391385013237541,0.1269819735793383,0.13011372708647712,0.13354901022639368,0.13706591465147774,0.14031290191434467,0.14300280818233715,0.14573765888377896,0.14830241413184272,0.15054307924854243,0.15349785893544404,0.15621199383793424,0.15914850804243449,0.16230879169980891,0.16579951147569266,0.16931364402703805,0.1729193599926484,0.17690731007575214,0.18087021148061341,0.18521766318527047,0.18956303309115924,0.19387174571764271,0.19790798766475959,0.20166851486775095,0.20542626123466509,0.20870829840823424,0.21170981056607399,0.21453215869999806,0.21712427598407064,0.21936953758831185,0.22098370783434301,0.22223800532273791,0.22312607712002042,0.22388934023607876,0.22461406959932348,0.22563165967064902,0.22723007817657201,0.22885938269206182,0.23012971443112021,0.23138797410028852,0.232832783974386,0.2345096543312738,0.23625496368743396,0.23811162674024833,0.23990230921901559,0.24158631652469914,0.24336505712189183,0.24512918871694969,0.24683861595324758,0.24812631680524952,0.24948503379465722,0.25097120405148088,0.25235856657159889,0.25365678658272978,0.25494680352243265]
["Males","Custom",{"$f":"C467/C468","v":0.10646119269082298},{"$f":"D467/D468","v":0.10442912229425658},0.10205029474227419,9.9961191693168014E-2,9.7419396801756417E-2,9.4532819659304157E-2,9.1373446801286062E-2,8.8787917794076465E-2,8.7425926784212724E-2,8.8182764898073834E-2,8.9641500082603673E-2,9.0140960465789302E-2,9.0607143751161051E-2,9.0519211672542524E-2,8.9897438243964942E-2,8.9778144493045789E-2,9.0014879989648702E-2,8.9871798185530774E-2,8.901730677282621E-2,8.7630032241311037E-2,8.6463640426482788E-2,8.4895394108943645E-2,8.2831378130120814E-2,8.0877016656981895E-2,7.9287176591452388E-2,7.766796199652741E-2,7.6342795201583283E-2,7.5357684241127973E-2,7.4835857876256268E-2,7.3585154019973717E-2,7.1638886631006954E-2,6.9424574118260141E-2,6.7849872284852786E-2,6.664590916085994E-2,6.6308924276677769E-2,6.6582269578366216E-2,6.7778014881891224E-2,6.9534028780777912E-2,7.0665473808336807E-2,7.1575460552719794E-2,7.2575512581494667E-2,7.2826723663794446E-2,7.2116547492322866E-2,7.1133507844703348E-2,7.0373951331439213E-2,6.9954207381232564E-2,6.8634759325746975E-2,6.7607428201252429E-2,6.6317744494980221E-2,6.4970533889227911E-2,6.3208143893565633E-2,6.1859536040275616E-2,6.0827798337502549E-2,5.9994195056577243E-2,5.9242032802360865E-2,5.8542648441184092E-2,5.79168734001939E-2,5.7343647763320273E-2,5.6811069084689324E-2,5.6328200688475251E-2,5.5922088021280139E-2,5.5599022506982093E-2,5.5366602702880012E-2,5.5229246815291511E-2,5.5189990874224742E-2,5.5248449645232296E-2,5.5403268210962246E-2,5.5647532050727609E-2,5.5960754109621057E-2,5.6312862539228049E-2,5.6668291106344734E-2,5.6997224804962367E-2,5.7271980528435941E-2,5.7461858249919277E-2,5.7552550237291139E-2,5.7535741503433463E-2,5.7414501825979299E-2,5.7190003909276643E-2,5.6883256704288211E-2,5.6504564915151302E-2,5.6072984394176746E-2,5.5600652201178977E-2,5.5114618096876025E-2,5.4629733700495349E-2,5.4157636545965032E-2,5.371298313969252E-2,5.3303743026469529E-2,5.2936576225935637E-2,5.261808014161571E-2,5.2348401589352785E-2,5.2130162259712218E-2,5.196844204516024E-2,5.1859381002943426E-2]
["Males","All",1,1,1,1,1,1,1,1,1,1,1,1,1,1,1,1,1,1,1,1,1,1,1,1,1,1,1,1,1,1,1,1,1,1,1,1,1,1,1,1,1,1,1,1,1,1,1,1,1,1,1,1,1,1,1,1,1,1,1,1,1,1,1,1,1,1,1,1,1,1,1,1,1,1,1,1,1,1,1,1,1,1,1,1,1,1,1,1,1,1,1,1,1]
["Females","0-15",0.3012687706795622,0.30272384793747154,0.30268596108740353,0.30188004647975447,0.30010893741227551,0.2973504046909845,0.29407758434691739,0.29001083603801187,0.28590794320956991,0.28115540782842402,0.27473265347388343,0.27128564320240467,0.26691655707115308,0.26275331057814671,0.25898779057201787,0.25603451916365055,0.25349769621704998,0.25218934036419188,0.24986863041684673,0.24830533036733027,0.24667625235850488,0.24564006126473414,0.24435713091456279,0.24282664556804129,0.2408317428237747,0.23831929377827682,0.23605245506239031,0.23364101967174949,0.23102399977687599,0.22776781925316475,0.2237217560275977,0.21965740523264116,0.21568557729806612,0.21200948628154434,0.20915152668987524,0.20651728140242223,0.20420111915697439,0.2030701841317662,0.20200793422616153,0.2009599064650798,0.20051438060272694,0.20033882762198549,0.19998820476527482,0.19952185304338832,0.19924731456606529,0.19970979719597348,0.20030802052628588,0.20068743124902533,0.20067523871313081,0.20052607132341049,0.20011028830892291,0.19924696749550322,0.19773185406312033,0.19546516480638931,0.19317219409360198,0.19088072245610641,0.18834132661355876,0.18574652716142676,0.18344453762107898,0.18140139370707878,0.17936575121195805,0.17737498662931619,0.17567747398983788,0.17428029528516734,0.17319064910387916,0.1723134694599987,0.17163429168634622,0.17117429217526819,0.17091180186046792,0.17081504787056448,0.17087097136170179,0.17106361846940021,0.17138228855243515,0.17180131279474883,0.17228760913784227,0.17280407684044866,0.17332342262957345,0.17381083449141951,0.17424063009939733,0.17459073423916954,0.1748350796469029,0.17494829405416662,0.17492110988298509,0.17474957660788673,0.1744277869203272,0.17397319681195206,0.17339990646971554,0.17272696065167259,0.1719732917124803,0.17118640975851013,0.17038662520893033,0.16960560173131103,0.16886479785586633]
["Females","16-39",0.30909137185034358,0.30660884386820703,0.3045626207623397,0.3053556646876931,0.30715675950800281,0.30983032609204186,0.31351136366590326,0.31829237553498063,0.32333317811167683,0.32940665363343191,0.33211884441697537,0.3348633169503229,0.33770578373741544,0.34063308329428438,0.34316825473766532,0.34543011086573644,0.34560081275089483,0.34464554123647834,0.34470887518170745,0.34460096537774348,0.34532394178208931,0.34590271035087655,0.34648768719994266,0.34688943773826536,0.34692474533111983,0.34753419058402357,0.34693634296318282,0.34532068443720171,0.34347501708293243,0.3420239174645725,0.33990272564815832,0.33946310393898782,0.3384448624716111,0.33710896777884219,0.3354842072816942,0.33433033371797621,0.33394705740432518,0.33211657934667466,0.32954805082364874,0.32632038752664899,0.32240463742545916,0.31858729977633932,0.31508824980162559,0.31234598048384121,0.31041112285303218,0.30757061812774839,0,0.30175976766918,0.30175976766918,0.30175976766918,0.30175976766918,0.30175976766918,0.30175976766918,0.30175976766918,0.30175976766918,0.30175976766918,0.30175976766918,0.30175976766918,0.30175976766918,0.30175976766918,0.30175976766918,0.30175976766918,0.30175976766918,0.30175976766918,0.30175976766918,0.30175976766918,0.30175976766918,0.30175976766918,0.30175976766918,0.30175976766918,0.30175976766918,0.30175976766918,0.30175976766918,0.30175976766918,0.30175976766918,0.30175976766918,0.30175976766918,0.30175976766918,0.30175976766918,0.30175976766918,0.30175976766918,0.30175976766918,0.30175976766918,0.30175976766918,0.30175976766918,0.30175976766918,0.30175976766918,0.30175976766918,0.30175976766918,0.30175976766918,0.30175976766918,0.30175976766918,0.30175976766918]
["Females","40-64",0.26387503181471111,0.26291799536257404,0.2622454304047282,0.26059882194290035,0.25886723269109169,0.25695148386694322,0.25515283695225521,0.25287726692773638,0.25098824454654578,0.24887951455699212,0.24928307002450598,0.24984640927738738,0.25141905660687236,0.2521667468583898,0.25198045592025453,0.25159666036531292,0.25240018588463287,0.25355937215090063,0.25442727772757634,0.25561231290761649,0.25587730314447094,0.25601969326725599,0.25684548689898967,0.25798653061854848,0.25953802846233126,0.26155150786230741,0.26473516550549114,0.26866604586194853,0.27327927224383736,0.27816980611409609,0.28339222614840992,0.28733932954770491,0.29178500149113351,0.29629101006975411,0.30069285791993039,0.30440571548635231,0.30686759459077834,0.30855449626384951,0.3104798905955698,0.31264655578953776,0.31486514536279075,0.31601595546590949,0.31746767033391238,0.31831322037946785,0.31865204160884125,0.31913226404653383,0,0.32028672573417943,0.32028672573417943,0.32028672573417943,0.32028672573417943,0.32028672573417943,0.32028672573417943,0.32028672573417943,0.32028672573417943,0.32028672573417943,0.32028672573417943,0.32028672573417943,0.32028672573417943,0.32028672573417943,0.32028672573417943,0.32028672573417943,0.32028672573417943,0.32028672573417943,0.32028672573417943,0.32028672573417943,0.32028672573417943,0.32028672573417943,0.32028672573417943,0.32028672573417943,0.32028672573417943,0.32028672573417943,0.32028672573417943,0.32028672573417943,0.32028672573417943,0.32028672573417943,0.32028672573417943,0.32028672573417943,0.32028672573417943,0.32028672573417943,0.32028672573417943,0.32028672573417943,0.32028672573417943,0.32028672573417943,0.32028672573417943,0.32028672573417943,0.32028672573417943,0.32028672573417943,0.32028672573417943,0.32028672573417943,0.32028672573417943,0.32028672573417943,0.32028672573417943]
["Females","16-64",0.57296640366505469,0.56952683923078107,0.56680805116706789,0.56595448663059345,0.56602399219909449,0.56678180995898508,0.56866420061815848,0.57116964246271706,0.57432142265822261,0.578286168190424,0.58140191444148137,0.58470972622771034,0.5891248403442878,0.59279983015267412,0.59514871065791985,0.59702677123104941,0.59800099863552769,0.59820491338737891,0.59913615290928379,0.60021327828535997,0.60120124492656024,0.60192240361813254,0.60333317409893228,0.6048759683568139,0.60646277379345104,0.60908569844633098,0.61167150846867402,0.6139867302991503,0.61675428932676979,0.62019372357866864,0.62329495179656824,0.62680243348669273,0.63022986396274461,0.63339997784859625,0.63617706520162465,0.63873604920432847,0.64081465199510357,0.64067107561052417,0.64002794141921859,0.63896694331618675,0.63726978278824986,0.63460325524224881,0.63255592013553796,0.63065920086330907,0.62906316446187338,0.62670288217428216,0.62453686462876579,0.62267790475811691,0.62061560859481824,0.61883675407565308,0.61675845311352773,0.61463319764067648,0.61277281097245095,0.61162891558377797,0.61011181381642454,0.60822333423267039,0.60640546252641847,0.60469131169074875,0.60230490635748224,0.59945991322201209,0.59703695322988459,0.59459985832120721,0.59200036293249458,0.58933343271525163,0.58663004621503678,0.58383515961897403,0.58134879561053554,0.5788548281499154,0.57669087154623933,0.57485183636679005,0.57309358543799038,0.57133474436272402,0.56940558950776632,0.56674573301706788,0.56382346032555186,0.56093727361294998,0.55834627119761659,0.55583940183808511,0.5534014635301594,0.55102426404139437,0.54857585836104927,0.54642022668527346,0.54451466920264113,0.54307462938140605,0.54175231527529122,0.54051016414160469,0.53957197800425727,0.53923423623535494,0.53912019639755737,0.53940274123651577,0.53981608037547546,0.54018104694665148,0.54088707515172152]
["Females","60+",0.17520870450496309,0.17771808954429355,0.18126233454913671,0.18298488630725604,0.18460931200635705,0.18533261596203129,0.18530846835512138,0.18515462792371637,0.18532301626722961,0.18599094357277726,0.19067475986819934,0.19190081847353671,0.19278198262389978,0.19346514926338773,0.19399285649143541,0.19438889703124262,0.19543470307896141,0.19609935194539585,0.19718942757238833,0.19787431011689949,0.1980331131050968,0.19769186437537523,0.19709317600974516,0.19630512698972749,0.19593736725210828,0.19558165101408967,0.19548415293394505,0.19568501920614598,0.19620154606348808,0.19633121769437867,0.1972483271934441,0.19811685709943491,0.2002420224358239,0.20213498425994331,0.20348310124746155,0.20495099454720939,0.2065748526561911,0.20801758292095834,0.20972680594378265,0.21196721062090756,0.21401497952423579,0.21601875391513811,0.21816895065302708,0.22039546293561332,0.22224910131863188,0.22495047120993872,0,0.23170012393910536,1.2317001239391101,2.2317001239391101,3.2317001239391101,4.2317001239391097,5.2317001239391097,6.2317001239391097,7.2317001239391097,8.2317001239391097,9.2317001239391097,10.231700123939101,11.231700123939101,12.231700123939101,13.231700123939101,14.231700123939101,15.231700123939101,16.231700123939099,17.231700123939099,18.231700123939099,19.231700123939099,20.231700123939099,21.231700123939099,22.231700123939099,23.231700123939099,24.231700123939099,25.231700123939099,26.231700123939099,27.231700123939099,28.231700123939099,29.231700123939099,30.231700123939099,31.231700123939099,32.231700123939099,33.231700123939099,34.231700123939099,35.231700123939099,36.231700123939099,37.231700123939099,38.231700123939099,39.231700123939099,40.231700123939099,41.231700123939099,42.231700123939099,43.231700123939099,44.231700123939099,45.231700123939099]
["Females","65+",0.12576482565538305,0.12774931283174742,0.13050598774552857,0.13216546688965203,0.13386707038862999,0.13586778535003041,0.13725821503492414,0.1388195214992711,0.13977063413220747,0.14055842398115193,0.14386543208463526,0.14400463056988505,0.14395860258455909,0.14444685926917911,0.14586349877006222,0.14693870960530009,0.14850130514742232,0.14960574624842915,0.15099521667386948,0.15148139134730976,0.15212250271493488,0.15243753511713332,0.15230969498650487,0.15229738607514484,0.15270548338277423,0.15259500777539217,0.15227603646893573,0.15237225002910021,0.15222171089635425,0.15203845716816664,0.15298329217583409,0.15354016128066611,0.15408455873918928,0.15459053586985935,0.15467140810850014,0.15474666939324924,0.15498422884792207,0.15625874025770958,0.1579641243546199,0.1600731502187335,0.16221583660902317,0.16505791713576567,0.16745587509918719,0.16981894609330264,0.1716895209720613,0.1735873206297443,0.17515511484494828,0.17663466399285774,0.17870915269205095,0.18063717460093642,0.18313125857754931,0.18611983486382028,0.18949533496442877,0.19290591960983275,0.19671599208997348,0.20089594331122321,0.20525321086002277,0.2095621611478245,0.21425055602143872,0.21913869307090914,0.22359729555815733,0.22802515504947657,0.23232216307766757,0.23638627199958098,0.24017930468108403,0.24385137092102724,0.24701691270311824,0.24997087967481635,0.25239732659329278,0.25433311576264545,0.2560354432003078,0.25760163716787576,0.25921212193979853,0.26145295418818326,0.26388893053660584,0.26625864954660139,0.2683303061728099,0.2703497636704954,0.27235790637044321,0.27438500171943603,0.2765890619920478,0.27863147926055992,0.28056422091437377,0.28217579401070719,0.2838198978043816,0.28551663904644325,0.28702811552602719,0.28803880311297247,0.28890651188996236,0.2894108490049741,0.28979729441559415,0.29021335132203746,0.29024812699241215]
["Females","Custom",{"$f":"C475/C476","v":9.8550521761262402E-2},{"$f":"D475/D476","v":9.6560575736946361E-2},9.3991847573387341E-2,9.135707151638256E-2,8.835096803680241E-2,8.5255420571921675E-2,8.3324018497963295E-2,8.1875751961270907E-2,8.1690570801771598E-2,8.2330455481991902E-2,8.2618310932053476E-2,8.3203013932328693E-2,8.3146041864854525E-2,8.2546805375316112E-2,8.1668117939101531E-2,8.1128480545708828E-2,8.0987116612944693E-2,8.0946455412364782E-2,7.9867795544729503E-2,7.9013245510944574E-2,7.7854018406955092E-2,7.6518353552380028E-2,7.4909833520433761E-2,7.3526808678472874E-2,7.206102823632704E-2,7.039431339293685E-2,6.9359690186995615E-2,6.8384355721103476E-2,6.7331157874185948E-2,6.6037385821586012E-2,6.4596646868656488E-2,6.2789851568364669E-2,6.130279186070519E-2,6.0154762951434758E-2,6.0193873295619378E-2,6.0676199967865274E-2,6.1452458064968032E-2,6.3085115520054968E-2,6.4354904123545678E-2,6.5499436052235252E-2,6.65419093704189E-2,6.6922760648637475E-2,6.6454352441613587E-2,6.5652434934585363E-2,6.507959749260471E-2,6.4150871664463038E-2,6.2950643077007234E-2,6.1875092234894673E-2,6.0816264047079259E-2,5.9662542975278586E-2,5.8436281136052197E-2,5.7368564031430209E-2,5.6469755489559452E-2,5.5757176524500018E-2,5.5103865015275165E-2,5.4502878726946001E-2,5.3965818566086815E-2,5.3478924599209832E-2,5.3022569001349037E-2,5.2615982118475214E-2,5.2276582010592702E-2,5.2011455396407981E-2,5.1832809097507863E-2,5.1742389980691035E-2,5.1742322989967955E-2,5.1832923022462507E-2,5.2014350172342759E-2,5.2279016897821801E-2,5.2606230390184534E-2,5.2970942782919597E-2,5.3342136691166449E-2,5.3688533617408121E-2,5.3988017337639728E-2,5.4206783172867305E-2,5.4335277448760815E-2,5.4365866453498536E-2,5.4298068411829707E-2,5.4132494382740905E-2,5.3886608888902211E-2,5.3573427915643672E-2,5.3209632648978468E-2,5.2811141655271003E-2,5.2403680904132346E-2,5.1997969323134469E-2,5.1606175139097356E-2,5.1241803233326992E-2,5.0912524995162224E-2,5.0625179214002725E-2,5.0382002150500656E-2,5.0191140641405563E-2,5.0048843495691414E-2,4.9961387368633113E-2,4.9919003699629629E-2]
["Females","All",1,1,1,1,1,1,1,1,1,1,1,1,1,1,1,1,1,1,1,1,1,1,1,1,1,1,1,1,1,1,1,1,1,1,1,1,1,1,1,1,1,1,1,1,1,1,1,1,1,1,1,1,1,1,1,1,1,1,1,1,1,1,1,1,1,1,1,1,1,1,1,1,1,1,1,1,1,1,1,1,1,1,1,1,1,1,1,1,1,1,1,1,1]
["All","0-15",0.31338608541994906,0.31364016486276275,0.31335372122617555,0.31295884192064927,0.31176789509543046,0.30913062570191024,0.30594954408492031,0.30202760590195143,0.29761433479927735,0.29359337618812442,0.28779543787152517,0.28376965384627834,0.27928812816014859,0.27517197847323316,0.27156703412395422,0.26877707735806966,0.26619927001670085,0.26489365728125946,0.26255018281162074,0.26077732757999367,0.25915528885487732,0.25748692602492634,0.25589403455224902,0.25424178396758057,0.25253118157381071,0.24981299845765101,0.24738685339991778,0.2451183685000736,0.2427090790622547,0.23957362811834498,0.23538847420534117,0.23072056288710566,0.22634850585715258,0.22242570485437346,0.21922947585072461,0.21636520409175997,0.21404134569045624,0.2127333696052951,0.21162829212421785,0.21052307886657656,0.20988933582756716,0.20954917488925959,0.20910628646381288,0.20852128065338837,0.20803393351015137,0.20836329443000165,0.20882878972693461,0.20913128487315061,0.20903879264331759,0.20866195968569651,0.20802429364662731,0.2069715571850855,0.20521984000398874,0.20277785973123064,0.2002729098757455,0.19786364071528351,0.19524912736873562,0.19248463310825453,0.19011519033558913,0.18789937671963614,0.18571266209027976,0.18341396533349891,0.18153193539730172,0.18002897617841365,0.17884221537469266,0.17787525230397533,0.17711473445717102,0.17658079648965155,0.17625032499741264,0.17609079356114091,0.17608587126865954,0.17622711789520618,0.176497025178527,0.17686349472939825,0.1772949812716039,0.17775594657808483,0.17821480463853481,0.17863909956002047,0.17900289365504646,0.17928057568370454,0.17944837522267174,0.17947896888215387,0.17936186182045713,0.17908883474882401,0.17866042964546691,0.17808909732131056,0.17739462849731052,0.17659630840773136,0.17571653284393601,0.17479498262907006,0.1738633824024626,0.17295202645643012,0.17208115136798455]
["All","16-39",0.31926178239212472,0.31942972507061507,0.31903413937187947,0.32015492402461915,0.32171657965314487,0.32558724165928793,0.32910438453105406,0.33377669090252587,0.33904726507980026,0.34473141163107651,0.34665682413847632,0.34953076796079102,0.35219920544835415,0.35457135573553744,0.35678812177708275,0.35843701402159894,0.35859765833899088,0.35719421737814111,0.35681244439414372,0.3562984341264544,0.35623205447662065,0.35740234330481258,0.35763705464577095,0.35737634505419763,0.3561318051749679,0.3562152211733286,0.35550700937794877,0.35322383474721492,0.35034657410396391,0.34826767854426527,0.34622207695468721,0.34612561515704543,0.34512975358432402,0.34347524739767171,0.34171194275967409,0.34013973850232315,0.33911606117559173,0.3368632921751486,0.33411251563429661,0.33064333375996563,0.32653867734322206,0.32273855389842482,0.31903865334954706,0.31655291122294077,0.3149218981638251,0.31262844785319233,0,0.30742559323503765,0.30742559323503765,0.30742559323503765,0.30742559323503765,0.30742559323503765,0.30742559323503765,0.30742559323503765,0.30742559323503765,0.30742559323503765,0.30742559323503765,0.30742559323503765,0.30742559323503765,0.30742559323503765,0.30742559323503765,0.30742559323503765,0.30742559323503765,0.30742559323503765,0.30742559323503765,0.30742559323503765,0.30742559323503765,0.30742559323503765,0.30742559323503765,0.30742559323503765,0.30742559323503765,0.30742559323503765,0.30742559323503765,0.30742559323503765,0.30742559323503765,0.30742559323503765,0.30742559323503765,0.30742559323503765,0.30742559323503765,0.30742559323503765,0.30742559323503765,0.30742559323503765,0.30742559323503765,0.30742559323503765,0.30742559323503765,0.30742559323503765,0.30742559323503765,0.30742559323503765,0.30742559323503765,0.30742559323503765,0.30742559323503765,0.30742559323503765,0.30742559323503765]
["All","40-64",0.25953818878443641,0.25816240268697971,0.25689071780066969,0.25497366632131413,0.25342070129791705,0.2508846284363655,0.24971017061530482,0.24780711976234635,0.24638983205005976,0.24398785730176614,0.24392597623794204,0.24500419217309952,0.24697722113301002,0.24824361385639532,0.24828728618227722,0.24835891429366744,0.24937513985868109,0.25110253305076191,0.25249884465570738,0.25418605598538474,0.25503221250610497,0.25530182108506139,0.25676346579014303,0.25861056745514865,0.26097926726257648,0.26350277508483522,0.26669622518565322,0.27088413244016307,0.27583224836599751,0.28069383176148466,0.28570058229386125,0.28953116697515335,0.29399433640443795,0.29864729102320714,0.30309717994620694,0.3069290401712339,0.30951482190609775,0.3112921211903199,0.31297645222610637,0.31497817249573784,0.3170916013620545,0.31811043224682145,0.31929989479293336,0.31957872271526511,0.3194395613357161,0.31910863701220693,0,0.31898836274524933,0.31898836274524933,0.31898836274524933,0.31898836274524933,0.31898836274524933,0.31898836274524933,0.31898836274524933,0.31898836274524933,0.31898836274524933,0.31898836274524933,0.31898836274524933,0.31898836274524933,0.31898836274524933,0.31898836274524933,0.31898836274524933,0.31898836274524933,0.31898836274524933,0.31898836274524933,0.31898836274524933,0.31898836274524933,0.31898836274524933,0.31898836274524933,0.31898836274524933,0.31898836274524933,0.31898836274524933,0.31898836274524933,0.31898836274524933,0.31898836274524933,0.31898836274524933,0.31898836274524933,0.31898836274524933,0.31898836274524933,0.31898836274524933,0.31898836274524933,0.31898836274524933,0.31898836274524933,0.31898836274524933,0.31898836274524933,0.31898836274524933,0.31898836274524933,0.31898836274524933,0.31898836274524933,0.31898836274524933,0.31898836274524933,0.31898836274524933,0.31898836274524933]
["All","16-64",0.57879997117656112,0.57759212775759483,0.57592485717254915,0.57512859034593322,0.57513728095106198,0.57647187009565337,0.57881455514635893,0.58158381066487219,0.58543709712986003,0.58871926893284265,0.59058280037641842,0.59453496013389051,0.59917642658136416,0.60281496959193281,0.60507540795935999,0.60679592831526641,0.60797279819767203,0.60829675042890297,0.6093112890498511,0.61048449011183914,0.61126426698272562,0.61270416438987396,0.61440052043591398,0.61598691250934623,0.61711107243754437,0.61971799625816382,0.62220323456360194,0.62410796718737804,0.62617882246996137,0.62896151030574987,0.6319226592485484,0.63565678213219878,0.63912408998876191,0.64212253842087885,0.64480912270588109,0.64706877867355705,0.64863088308168948,0.64815541336546845,0.64708896786040293,0.64562150625570347,0.64363027870527656,0.64084898614524621,0.63833854814248048,0.63613163393820582,0.63436145949954126,0.63173708486539926,0.62922472009809527,0.62707710982062992,0.62466957605326101,0.62273905069574143,0.62067189602553718,0.6186581988562827,0.61698390431609051,0.61597026073102823,0.61477181472681142,0.61310155555944446,0.61155919361579991,0.61000091712048765,0.60785683384589262,0.60547629135421821,0.60341847845753094,0.60162482047377619,0.59948197483877785,0.5973133579776374,0.59510446144664508,0.5928258298489848,0.59071047872894833,0.58864746763758546,0.58696022031669259,0.58552820026626862,0.58424138499056222,0.58293918519401955,0.58150558391711216,0.57951356172942436,0.57706995949206508,0.57461506212363744,0.5724912652823102,0.57043479916352791,0.56835201912206601,0.56623072326601431,0.56409689952770548,0.56212619823276166,0.56039169304309155,0.55902766628670508,0.55775579712073364,0.55660821634977109,0.55570414623335207,0.55536532095414826,0.55514368985605045,0.55508099701058411,0.55513628085191591,0.55520076226272952,0.55541794880893847]
["All","60+",0.15617629817458045,0.15764498104909949,0.159990274465308,0.16096092713410201,0.16213461212798275,0.16198595227765158,0.16169197340003019,0.16106615897191814,0.1609425926204627,0.16063696320329232,0.16590730567919926,0.16714760657669411,0.16793739036219171,0.16867664065826032,0.16926480433793806,0.16967068975488417,0.17058903103377215,0.17120546977495207,0.17222395130891863,0.17287406892099813,0.17324511057397676,0.17283705721130832,0.17247449179237345,0.17208845615429028,0.17224950595192257,0.17236577561860952,0.17264448820381736,0.17334627114936563,0.17443296807754111,0.17511753213416489,0.17635380066057255,0.17774253711560417,0.18025906140097742,0.18268047107363763,0.18452909101116896,0.18651171782896461,0.18857989774550812,0.19050873674649496,0.19276843731755341,0.19560203076960583,0.19830647108169572,0.20083361025293453,0.20373444096790502,0.20659625818664296,0.20895312809694858,0.21194734866446455,0,0.21930742559323504,1.2193074255932399,2.2193074255932399,3.2193074255932399,4.2193074255932403,5.2193074255932403,6.2193074255932403,7.2193074255932403,8.2193074255932395,9.2193074255932395,10.2193074255932,11.2193074255932,12.2193074255932,13.2193074255932,14.2193074255932,15.2193074255932,16.2193074255932,17.2193074255932,18.2193074255932,19.2193074255932,20.2193074255932,21.2193074255932,22.2193074255932,23.2193074255932,24.2193074255932,25.2193074255932,26.2193074255932,27.2193074255932,28.2193074255932,29.2193074255932,30.2193074255932,31.2193074255932,32.2193074255932,33.2193074255932,34.2193074255932,35.2193074255932,36.2193074255932,37.2193074255932,38.2193074255932,39.2193074255932,40.2193074255932,41.2193074255932,42.2193074255932,43.2193074255932,44.2193074255932,45.2193074255932]
["All","65+",0.10781394340348985,0.10876770737964245,0.11072142160127529,0.11191256773341751,0.1130948239535076,0.11439750420243633,0.11523590076872074,0.11638858343317632,0.11694856807086261,0.11768735487903297,0.12162176175205643,0.12169538601983108,0.12153544525848725,0.12201305193483408,0.12335755791668583,0.12442699432666392,0.12582793178562715,0.12680959228983751,0.12813852813852813,0.12873818230816717,0.12958044416239706,0.12980890958519969,0.12970544501183698,0.12977130352307314,0.13035774598864494,0.13046900528418517,0.13040991203648025,0.13077366431254839,0.13111209846778391,0.13146486157590509,0.1326888665461104,0.13362265498069553,0.13452740415408546,0.13545175672474771,0.13596140144339433,0.13656601723468301,0.13732777122785428,0.1391112170292364,0.14128274001537919,0.14385541487771999,0.14648038546715625,0.14960183896549417,0.1525551653937067,0.15534708540840578,0.1576046069903074,0.15989962070459907,0.16194649017497009,0.16379160530621942,0.16629163130342139,0.16859898961856207,0.17130381032783548,0.17437024395863185,0.17779625567992072,0.18125187953774111,0.18495527539744308,0.18903480372527201,0.1931916790154645,0.19751444977125784,0.2020279758185182,0.20662433192614563,0.21086885945218925,0.2149612141927249,0.21898608976392039,0.22265766584394897,0.2260533231786622,0.22929891784703985,0.23217478681388071,0.23477173587276301,0.23678945468589474,0.23838100617259048,0.23967274374077821,0.24083369691077433,0.24199739090436082,0.24362294354117739,0.24563505923633108,0.2476289912982777,0.24929393007915501,0.25092610127645165,0.25264508722288759,0.25448870105028115,0.25645472524962276,0.25839483288508441,0.26024644513645129,0.26188349896447094,0.26358377323379945,0.26530268632891835,0.26690122526933735,0.26803837063812042,0.26913977730001359,0.27012402036034583,0.27100033674562157,0.27184721128084033,0.27250089982307701]
["All","Custom",{"$f":"C483/C484","v":0.10242577802186816},{"$f":"D483/D484","v":0.100433599722413},9.7972343664317424E-2,9.561135917408782E-2,9.2835135521864523E-2,8.9847136993845181E-2,8.7307901871582272E-2,8.5295343760770734E-2,8.4524617324487503E-2,8.5212226467976673E-2,8.6062280130968713E-2,8.6602203237846745E-2,8.6798318027035387E-2,8.6444185737393223E-2,8.568935293786957E-2,8.5352344866638147E-2,8.5397552646916411E-2,8.5302502775254821E-2,8.4331645115958837E-2,8.3214098815802259E-2,8.2049032691571863E-2,8.0606161786475755E-2,7.8775850599675221E-2,7.7112891774507253E-2,7.5584050023921684E-2,7.3941282418364729E-2,7.2767209909164396E-2,7.1786998090917167E-2,7.0989621240186151E-2,6.9717114770307273E-2,6.8033760490941106E-2,6.6029899842948658E-2,6.4501995396862272E-2,6.332925330884541E-2,6.3185688992454275E-2,6.3566733768837702E-2,6.4548502766956367E-2,6.6242232254467293E-2,6.7446480938007605E-2,6.8477249695678213E-2,6.9499393160405182E-2,6.9818834261699436E-2,6.9230622088018695E-2,6.8340742559894113E-2,6.7679076873723085E-2,6.7003125978378611E-2,6.5746613542409432E-2,6.469671951238308E-2,6.3525952482367698E-2,6.2278637289048172E-2,6.078959585433652E-2,5.9584640139777253E-2,5.8621404231693507E-2,5.7850165968682046E-2,5.7149020765510136E-2,5.650033610625281E-2,5.592028581433775E-2,5.5391515662009845E-2,5.4898222798134125E-2,5.4454591396587017E-2,5.4082842830211086E-2,5.378967007889484E-2,5.3585006546471817E-2,5.3471912701901728E-2,5.3452985376969346E-2,5.3528203595695698E-2,5.3696996926800786E-2,5.3952098622920067E-2,5.4272927147570281E-2,5.4631964336143944E-2,5.4995917104887333E-2,5.53342220222756E-2,5.5621997843348689E-2,5.5826993275889435E-2,5.5937282957360279E-2,5.5944873044720192E-2,5.5851070494722585E-2,5.5656757858960064E-2,5.5381161539282228E-2,5.503595518787005E-2,5.4638986239938445E-2,5.4204294269780205E-2,5.3758270782809509E-2,5.3313693065968823E-2,5.2882454812811536E-2,5.2478630846267242E-2,5.2110046323059947E-2,5.1783436795435178E-2,5.1503217343546931E-2,5.127353155045649E-2,5.1093816521164917E-2,5.0969738331649091E-2,5.0894500179964615E-2]
["All","All",1,1,1,1,1,1,1,1,1,1,1,1,1,1,1,1,1,1,1,1,1,1,1,1,1,1,1,1,1,1,1,1,1,1,1,1,1,1,1,1,1,1,1,1,1,1,1,1,1,1,1,1,1,1,1,1,1,1,1,1,1,1,1,1,1,1,1,1,1,1,1,1,1,1,1,1,1,1,1,1,1,1,1,1,1,1,1,1,1,1,1,1,1]
[]
["check1",false]
["check2",true]
["check3",false]
["check4",true]
["check5",false]
["check6",true]
["check7",false]
["labels",true]
[]
["LGDs (2001 to 2039)"]
[1,"Area","Code",2001,2002,2003,2004,2005,2006,2007,2008,2009,2010,2011,2012,2013,2014,2015,2016,2017,2018,2019,2020,2021,2022,2023,2024,2025,2026,2027,2028,2029,2030,2031,2032,2033,2034,2035,2036,2037,2038,2039]
[null,"Northern Ireland","N92000002",1688838,1697534,1704924,1714042,1727733,1743113,1761683,1779152,1793333,1804833,1814318,1823634,1829725,1840498,1851621,1862137,1873502,1883987,1894073,1903663,1912816,1921749,1930407,1938715,1946628,1954144,1961241,1967885,1974120,1980017,1985568,1990810,1995764,2000483,2005005,2009315,2013447,2017453,2021322]
["Bubblealt","Antrim & Newtownabbey","N09000001",128760,129502,130356,131067,132350,133216,134756,136122,137422,138044,138651,139157,139536,139966,140467,141032,141516,142005,142450,142862,143243,143612,143955,144248,144530,144777,144984,145155,145298,145401,145487,145534,145572,145576,145555,145530,145479,145421,145347]
["Bubblealt","Armagh City, Banbridge & Craigavon","N09000002",176014,177357,178954,180828,183933,187196,190505,193603,196203,198202,200298,202398,203757,205711,207797,210260,212524,214715,216870,218965,221048,223102,225127,227134,229115,231039,232952,234803,236603,238414,240156,241880,243617,245318,247006,248682,250351,252036,253717]
["Bubblealt","Belfast","N09000003",328695,328471,327176,326268,325483,325985,327383,330052,331763,333489,333895,333962,335133,336830,338907,339579,341188,342505,343687,344729,345614,346514,347319,348109,348800,349450,350022,350518,350988,351396,351772,352127,352412,352694,352977,353219,353435,353658,353842]
["Bubblealt","Causeway Coast & Glens","N09000004",131374,132827,134152,135209,136340,137438,138375,139004,139616,140107,140907,141434,141699,142303,143148,143525,144027,144433,144861,145189,145535,145817,146083,146308,146475,146644,146746,146829,146868,146898,146877,146831,146763,146658,146540,146381,146219,146024,145801]
["Bubblealt","Derry City & Strabane","N09000005",143810,144280,144629,145041,145447,145855,146742,147496,148053,148148,148191,148619,148632,149198,149473,150142,150114,150405,150658,150872,151053,151189,151314,151402,151443,151459,151435,151375,151288,151169,151026,150856,150645,150433,150183,149931,149659,149365,149059]
["Bubblealt","Fermanagh & Omagh","N09000006",105751,106663,107332,107923,108586,109344,110345,111494,111998,112919,113501,114230,114365,114992,115311,115799,116794,117415,118012,118569,119097,119613,120102,120557,121002,121411,121807,122160,122500,122800,123073,123336,123591,123803,124009,124196,124367,124511,124645]
["Bubblealt","Lisburn & Castlereagh","N09000007",124585,124757,125001,125764,127043,128185,129179,130584,132386,133909,135280,136311,136808,138627,140205,141181,142853,144199,145519,146831,148118,149411,150666,151916,153139,154316,155456,156541,157596,158618,159594,160551,161484,162387,163290,164158,165025,165879,166739]
["Bubblealt","Mid & East Antrim","N09000008",127452,128281,129181,129925,130980,132021,133270,134169,134774,135157,135365,135838,135997,136642,137145,137821,138200,138644,139072,139485,139843,140223,140565,140903,141200,141456,141686,141888,142039,142164,142296,142355,142390,142422,142422,142413,142370,142314,142253]
["Bubblealt","Mid Ulster","N09000009",119112,120214,121324,122645,124885,127662,131088,133595,135408,137221,139011,140357,141329,142895,144002,145389,147470,148988,150460,151909,153339,154715,156101,157455,158787,160090,161376,162639,163858,165063,166244,167423,168561,169680,170813,171923,173028,174148,175249]
["Bubblealt","Newry, Mourne & Down","N09000010",153726,154984,156395,158460,160453,162723,165634,168019,169652,171119,172276,173691,174829,175403,176369,177816,179419,180796,182152,183471,184751,186019,187266,188464,189643,190786,191894,192968,193999,194994,195957,196895,197792,198689,199550,200402,201235,202050,202861]
["Bubblealt","Ards & North Down","N09000011",149559,150198,150424,150912,152233,153488,154406,155014,156058,156518,156943,157637,157640,157931,158797,159593,159397,159882,160332,160781,161175,161534,161909,162219,162494,162716,162883,163009,163083,163100,163086,163022,162937,162823,162660,162480,162279,162047,161809]
["Bubble","Antrim & Newtownabbey","N09000001",7.6241770969151565E-2,7.6288309983776462E-2,7.6458540087417384E-2,7.6466621004619484E-2,7.6603271454559238E-2,7.6424190514326959E-2,7.6492762886398974E-2,7.6509483169509965E-2,7.6629382273119384E-2,7.6485746880736338E-2,7.642045110063396E-2,7.6307526619924834E-2,7.626064026014838E-2,7.6047895732568038E-2,7.5861636911657412E-2,7.5736640214978806E-2,7.5535547867042571E-2,7.5374723923254242E-2,7.520829450607236E-2,7.5045845824602359E-2,7.4885927344815181E-2,7.4729842450809131E-2,7.4572357021084154E-2,7.4403922185571375E-2,7.4246337769722823E-2,7.4087170648631837E-2,7.3924622216239619E-2,7.3761932226730734E-2,7.3601402143740002E-2,7.3434217989037473E-2,7.3272232429209175E-2,7.310290786162417E-2,7.2940487953485483E-2,7.2770425942134981E-2,7.2595828938082446E-2,7.2427668135658166E-2,7.2253702233036177E-2,7.2081480956433686E-2,7.1906900533413282E-2]
["Bubble","Armagh City, Banbridge & Craigavon","N09000002",0.10422195616157381,0.10447920336205342,0.10496303647552618,0.10549799829875814,0.10645915775180539,0.1073917755188562,0.10813807024305735,0.10881757151721719,0.10940689765927465,0.10981736260363147,0.11039850786907257,0.11098608602384032,0.11135935728046564,0.11176920594317408,0.11222436988995048,0.11291328189064499,0.11343676174351562,0.11396840848689507,0.1144992827625968,0.11502298463541079,0.11556155950180258,0.11609320467969542,0.1166215207466612,0.11715698284688569,0.11769839948875697,0.11823028395041511,0.11877785544968722,0.11931743978941858,0.11985238992563775,0.12041007728721521,0.12095078083450177,0.12149828461781888,0.12206703798645531,0.12262938500352165,0.1231947052501116,0.1237645665313801,0.12433950334923144,0.12492781740144628,0.125520327785479]
["Bubble","Belfast","N09000003",0.19462790391973653,0.1934989225547176,0.19190063604008156,0.19035006143373384,0.18838732605095809,0.18701311963137215,0.18583536311583865,0.18551085011286275,0.18499798977657803,0.18477554433014023,0.18403333924923856,0.1831299482242599,0.18316031097569307,0.18301025048655309,0.18303259684352252,0.18235983711187737,0.18211242902329433,0.18179796357405864,0.18145393551357314,0.18108719873212853,0.18068334852907963,0.18031178889646879,0.17992008939047568,0.17955656194953873,0.1791816412791761,0.17882510193721651,0.17846965263320519,0.17811914822258415,0.17779466293842319,0.1774712035300707,0.17716441844348821,0.17687624635198737,0.1765799964324439,0.17630442248197059,0.17604794003007473,0.17579075456063384,0.175537275130659,0.17529925108540323,0.17505474140191418]
["Bubble","Causeway Coast & Glens","N09000004",7.7789580764999366E-2,7.8247033638206953E-2,7.868503229469466E-2,7.8883131218488223E-2,7.8912656064334008E-2,7.8846293957993543E-2,7.8547048475804099E-2,7.8129356007805961E-2,7.7852802574870372E-2,7.7628788923961384E-2,7.7663893540162204E-2,7.7556132425695062E-2,7.7442785117982207E-2,7.7317660763554216E-2,7.730955740942666E-2,7.7075424633096273E-2,7.6875818654050007E-2,7.6663480162018099E-2,7.6481212709330629E-2,7.6268226046311768E-2,7.608416073474919E-2,7.5877234748138289E-2,7.567471522844664E-2,7.5466481664401425E-2,7.5245501451741165E-2,7.5042576186811205E-2,7.4823032967391567E-2,7.4612591691079505E-2,7.4396693210139198E-2,7.4190272103724364E-2,7.3972284001353764E-2,7.3754401474776604E-2,7.353725189952319E-2,7.3311295322179698E-2,7.3087099533417618E-2,7.2851195556694698E-2,7.2621231152347199E-2,7.2380372677826946E-2,7.2131506014380689E-2]
["Bubble","Derry City & Strabane","N09000005",8.515322369581925E-2,8.4993879356761046E-2,8.4830174248236287E-2,8.4619280040979156E-2,8.4183725147346261E-2,8.3675011315961736E-2,8.3296484100715051E-2,8.2902416432097989E-2,8.2557450289488896E-2,8.2084048773487628E-2,8.1678625246511358E-2,8.149606774166307E-2,8.1231879107516156E-2,8.1063929436489476E-2,8.0725483238740542E-2,8.0628868874846479E-2,8.012481438503935E-2,7.9833353414859018E-2,7.954181280235767E-2,7.9253523338952331E-2,7.8968912848909667E-2,7.8672605007209573E-2,7.838450647972163E-2,7.8093995249430684E-2,7.7797606938767958E-2,7.7506570651906928E-2,7.7213866118442359E-2,7.692268603094185E-2,7.6635665511721685E-2,7.6347324290650026E-2,7.60618623990717E-2,7.5776191600403858E-2,7.5482371663182626E-2,7.5198339600986361E-2,7.4904052608347607E-2,7.4617966819538001E-2,7.4329743966441625E-2,7.4036421170654287E-2,7.3743322439472778E-2]
["Bubble","Fermanagh & Omagh","N09000006",6.2617610451683348E-2,6.2834087564667337E-2,6.2954125814405806E-2,6.2964034720269402E-2,6.2848831387720211E-2,6.2729151810582556E-2,6.2636126930895056E-2,6.2666933460435087E-2,6.245242796513531E-2,6.2564791313102094E-2,6.2558493053588182E-2,6.2638665433963181E-2,6.2503928185929578E-2,6.2478742166522321E-2,6.2275703289172028E-2,6.2186079756752589E-2,6.2339938788429368E-2,6.2322616875806466E-2,6.2305940689719987E-2,6.2284658576649332E-2,6.2262653595536635E-2,6.224173916572872E-2,6.221589540444062E-2,6.218397237345355E-2,6.2159796324721517E-2,6.2130017030474723E-2,6.2107104634259634E-2,6.2076798186885919E-2,6.2052965371912551E-2,6.2019669528089912E-2,6.1983774919821433E-2,6.1952672530276622E-2,6.1926660667293326E-2,6.1886554397113096E-2,6.1849721073014778E-2,6.1810119369038699E-2,6.1768201497233353E-2,6.1716927234488239E-2,6.166508849159115E-2]
["Bubble","Lisburn & Castlereagh","N09000007",7.3769657006770337E-2,7.349307878369446E-2,7.3317637619037562E-2,7.3372764494685661E-2,7.3531616285618204E-2,7.3537974875983375E-2,7.3327040108805044E-2,7.3396764301195169E-2,7.3821203312491326E-2,7.4194676183336625E-2,7.4562452668165122E-2,7.4746906451623518E-2,7.4769705830111083E-2,7.5320375246264865E-2,7.5720139272561715E-2,7.5816655809964578E-2,7.6249184681948565E-2,7.6539275483323399E-2,7.6828612202380797E-2,7.7130773671600483E-2,7.7434525850892083E-2,7.7747406138887018E-2,7.8048825972968389E-2,7.8359119313565942E-2,7.8668857121134597E-2,7.8968591874498506E-2,7.9264098598795352E-2,7.9547839431674108E-2,7.9831013312260654E-2,8.0109413202007859E-2,8.037700043513997E-2,8.0646068685610375E-2,8.0913374527248713E-2,8.1173896503994286E-2,8.1441193413482757E-2,8.1698489286149756E-2,8.1961432309864621E-2,8.2221989805958309E-2,8.2490073328247551E-2]
["Bubble","Mid & East Antrim","N09000008",7.5467273948122915E-2,7.5569031312480342E-2,7.5769359807240672E-2,7.5800359617792329E-2,7.5810324859223038E-2,7.5738635418357847E-2,7.5649251312523313E-2,7.5411769202406539E-2,7.5152802073011532E-2,7.4886152901681213E-2,7.4609302228165073E-2,7.4487534231101202E-2,7.4326469824700439E-2,7.4241862800176903E-2,7.4067533258696028E-2,7.4012277292164863E-2,7.3765600463730485E-2,7.3590741337387147E-2,7.3424836318346759E-2,7.3271897389401375E-2,7.3108443258525654E-2,7.2966344720356305E-2,7.281625066631027E-2,7.2678552546403152E-2,7.2535687352693987E-2,7.2387705307285444E-2,7.2243033874980184E-2,7.2101774239856489E-2,7.1950539987437445E-2,7.1799383540646369E-2,7.166513561862399E-2,7.1506070393457938E-2,7.1346111063231923E-2,7.1193806695682996E-2,7.1033239318605196E-2,7.0876393198677168E-2,7.0709584111228158E-2,7.0541420295788804E-2,7.0376219127877698E-2]
["Bubble","Mid Ulster","N09000009",7.0528967254408062E-2,7.0816843727430495E-2,7.1160943244390956E-2,7.1553089130838105E-2,7.2282580699679869E-2,7.3237936955320743E-2,7.4410662985338452E-2,7.5089143592003388E-2,7.5506333737236753E-2,7.6029749012789555E-2,7.6618872766516119E-2,7.6965553395034317E-2,7.7240568937955154E-2,7.7639312838155755E-2,7.7770774904799639E-2,7.8076425096542307E-2,7.8713553548381582E-2,7.9081225082763315E-2,7.943727617678939E-2,7.9798262612657808E-2,8.0164009502220815E-2,8.0507391964299194E-2,8.0864294420813845E-2,8.1216166378245386E-2,8.1570284615242364E-2,8.1923338300555135E-2,8.228259556066797E-2,8.264659774326244E-2,8.3003059591108944E-2,8.3364435759894995E-2,8.3726168028493614E-2,8.4097929988296224E-2,8.445938497738209E-2,8.4819516086865027E-2,8.5193303757347238E-2,8.5562990372340816E-2,8.593620790614305E-2,8.6320722217568396E-2,8.6700189282063911E-2]
["Bubble","Newry, Mourne & Down","N09000010",9.1024716402638969E-2,9.1299496799475008E-2,9.1731361632541975E-2,9.2448143044336142E-2,9.2869094935386434E-2,9.3351951365172534E-2,9.4020320341400815E-2,9.4437687167819279E-2,9.4601504572770362E-2,9.4811542120517525E-2,9.495358586532239E-2,9.5244440496283791E-2,9.554933118364782E-2,9.5301923718471848E-2,9.5251134006365229E-2,9.5490288845557547E-2,9.5766644497844139E-2,9.5964568757640048E-2,9.6169471820779881E-2,9.6377877807153886E-2,9.6585871301787515E-2,9.6796720071143524E-2,9.700855829884579E-2,9.7210781368071125E-2,9.742128439537498E-2,9.7631494915420766E-2,9.7843151351618696E-2,9.8058575577333024E-2,9.8271128401515612E-2,9.8480972638113715E-2,9.8690651742977323E-2,9.8901954480839452E-2,9.910590630956366E-2,9.9320514095845858E-2,9.9525936344298391E-2,9.9736477356711123E-2,9.9945516321015657E-2,0.10015103201908546,0.10036055611129746]
["Bubble","Ards & North Down","N09000011",8.8557339425095832E-2,8.8480112916736867E-2,8.8229152736426966E-2,8.8044516995499533E-2,8.8111415363369222E-2,8.8053958636072363E-2,8.7646869499223193E-2,8.712802503664667E-2,8.7021205766023374E-2,8.6721596956615937E-2,8.6502476412624471E-2,8.6441138956610805E-2,8.6155023295850466E-2,8.5808840868069405E-2,8.5761070975107753E-2,8.5704220473574177E-2,8.5079706346723946E-2,8.4863642901994552E-2,8.4649324498052611E-2,8.4458751365131327E-2,8.4260587531681044E-2,8.4055722157264035E-2,8.3872986370231772E-2,8.3673464124432939E-2,8.3474603262667549E-2,8.3267149196783866E-2,8.3050986594712231E-2,8.283461686023319E-2,8.2610479606102974E-2,8.2373030130549391E-2,8.2135691147319057E-2,8.1887272014908502E-2,8.1641416520189761E-2,8.1391843869705466E-2,8.1126979733217627E-2,8.0863378813177622E-2,8.0597602022799711E-2,8.0322565135346399E-2,8.0051075484262282E-2]
["y","Antrim & Newtownabbey","N09000001",0.12829294812053432,0.13006748930518447,0.13135567215931757,0.13271838067553235,0.13335851907820173,0.13550924813836177,0.13644661462198343,0.13814813182292354,0.14103273129484362,0.14414244733563211,0.14697333592978054,0.15059249624524818,0.15360910446049764,0.15713816212508752,0.15931855880740672,0.1616725282205457,0.1648788829531643,0.16780395056512096,0.17061425061425062,0.1734891013705534,0.17687426261667236,0.18050023674901819,0.18472439303949151,0.18885530475292553,0.19313637307133466,0.19778694129592408,0.20240854163218011,0.20760566291205954,0.21331332846976558,0.21875365368876418,0.22355261982170227,0.22830403891874063,0.23299123457807822,0.23757350112655931,0.24182611384012917,0.24587370301656017,0.24974051237635672,0.25287957035091219,0.25538194802782305]
["y","Armagh City, Banbridge & Craigavon","N09000002",0.12530253275307646,0.12690787507682244,0.12790437766129845,0.12945450925741589,0.12987337780604893,0.12984785999700849,0.13054250544605128,0.13231199929753154,0.13406522836042262,0.13654251722989677,0.13906778899439834,0.14175041255348372,0.14468705369631474,0.14702179270918911,0.14909262405135781,0.15068486635594028,0.15247689672695788,0.15436741727406098,0.15641167519712271,0.15863722512730344,0.16114599543990446,0.16390260956871744,0.16708346844225705,0.17040161314466351,0.173934487047989,0.17750682785157484,0.18142364092173496,0.18535112413384838,0.18958762145873045,0.19395673072890016,0.19778810439880745,0.20139738713411609,0.20513757250109804,0.20850487938104828,0.21167097155534684,0.2147079402610563,0.21741874408330703,0.2197860623085591,0.22169976785158266]
["y","Belfast","N09000003",0.15094844764903634,0.15030246201338932,0.14972063965572047,0.14878259590275478,0.14774965205556051,0.1465282144883967,0.14538323614848664,0.14478627610194758,0.14431084840684463,0.14426262935209258,0.14493178993396127,0.14512429557853887,0.14551237866757377,0.14596087046878248,0.14549124095990937,0.14578934504194901,0.14607782219773263,0.14715113647975941,0.14856540980601535,0.15036448920746442,0.15267032006805281,0.15565316264277923,0.1588971521857428,0.16216185160395163,0.16582282110091742,0.16994133638574904,0.17407477244287503,0.178193416600574,0.18241079467104288,0.18666974012225523,0.19079403704672346,0.1947649569615508,0.19820550946051779,0.20133883763262206,0.2043674233731943,0.20727367440596345,0.20966514352002491,0.21195618365765798,0.2140277298907422]
["y","Causeway Coast & Glens","N09000004",0.13053572244127454,0.13215686569748619,0.13407925338422089,0.13576019347824478,0.13731113392988117,0.13921186280359144,0.1415356820234869,0.14489511093205951,0.14849300939720375,0.15204094013860836,0.15527972350557459,0.15952316981772416,0.1630286734557054,0.16712929453349543,0.1706765026406237,0.1742135516460547,0.17815409610697994,0.18203596131078079,0.18602660481427022,0.18986975597324865,0.19414573813859209,0.19876969077679557,0.20358974007927,0.20895644804111874,0.21431643625192012,0.22011128992662501,0.22577106019925586,0.23152102105169958,0.23802325898085355,0.24478890114228921,0.25110807001776997,0.25700975951944754,0.26309083352071028,0.26867951288030656,0.27382967107956874,0.2787998442420806,0.28334894917897124,0.28776091601380593,0.29112969046851528]
["y","Derry City & Strabane","N09000005",0.10277449412419164,0.10438730246742445,0.10604373949899398,0.1076454243972394,0.1095725590765021,0.11142573103424634,0.11302149350560849,0.11551499701686825,0.11874801591322026,0.12197262197262197,0.12557442759681761,0.12908847455574321,0.1326766779697508,0.13636241772677918,0.14005873970549865,0.14323107458272835,0.14621554285409755,0.14918387021708054,0.15260391084442909,0.15601304416989237,0.15954664918935738,0.16313356130406312,0.16697727903564771,0.1709488646120923,0.17522764340378888,0.18028641414508217,0.18531383101660778,0.19061271676300579,0.19601025857966264,0.20182709417936218,0.20722921881000622,0.21232831309328101,0.21738524345315144,0.22197921998497669,0.22615076273612858,0.23015253683361012,0.23370462184031698,0.23651457838181636,0.23862363225300048]
["y","Fermanagh & Omagh","N09000006",0.12775292905031632,0.12867629824775226,0.12936496105541684,0.13065796910760449,0.13123238723223987,0.13200541410594088,0.13221260591780326,0.13434803666565018,0.13660958231396989,0.1390022936795402,0.14204280138500983,0.14624879628819049,0.15028199186814148,0.15371504104633366,0.15745245466607696,0.16082176875447973,0.16467455519975341,0.16866669505599796,0.17259261769989492,0.17678313893176126,0.18115485696533079,0.185815923018401,0.1904464538475629,0.19525203845483879,0.20010413051023951,0.20470138620059139,0.20946251036475735,0.21484937786509495,0.22,0.22517915309446254,0.22997733052741057,0.23418142310436532,0.23853678665922276,0.24274048286390476,0.24685305098823473,0.25059583239395794,0.25419122436015984,0.25727044196898263,0.26001845240482974]
["y","Lisburn & Castlereagh","N09000007",0.13420556246739174,0.13579197960835865,0.13812689498484013,0.14031837409751599,0.14240847587037458,0.14450988805242423,0.14690468264965667,0.15009495803467499,0.15225174867433111,0.15512773599982077,0.15767297457125962,0.16140296821239666,0.16477106601953101,0.16687946792471886,0.16860311686459115,0.17076660457143666,0.17254800389211286,0.17502201818320515,0.17746136243377153,0.17975087004787818,0.18271918335381251,0.18598362905006993,0.18985039756813082,0.19388346191316252,0.19814678168200131,0.20329713056325979,0.20825828530259366,0.21322209516995547,0.21834310515495317,0.22385227401682029,0.22867401030113915,0.23377618326886784,0.23834559460999233,0.24222998146403346,0.2459611733725274,0.2493695098624496,0.25216179366762614,0.25477004322427793,0.25674257372300424]
["y","Mid & East Antrim","N09000008",0.14184948058877067,0.14364559053951872,0.14538515725996856,0.14735424283240331,0.14849595358069934,0.14978677634618734,0.15214226757709912,0.15559480953126281,0.15904402926380459,0.16274406800979602,0.1666161858678388,0.17151312592941592,0.17495974175900939,0.17828339749125452,0.18125341791534508,0.18391246616988702,0.18787988422575977,0.19125962897781368,0.1944748044178555,0.19792809262644728,0.20199080397302691,0.20614307210657309,0.21072813289225625,0.2153609220527597,0.22007790368271954,0.2247978169890284,0.22987451124317151,0.23548150654036987,0.24103239251191574,0.24659548127514702,0.25206611570247933,0.25734958378701134,0.26263782569000632,0.26769740629958855,0.27200151661962335,0.27604923707807572,0.27960946828685818,0.28299394297117642,0.28553352126141451]
["y","Mid Ulster","N09000009",0.11901403720867755,0.11953682599364467,0.12035541195476575,0.12090994333238207,0.12114345197581776,0.12060754179003932,0.12001861345050653,0.12045360979078558,0.12208289022805152,0.12474766981730202,0.12622742085158728,0.12928460995889055,0.13211725831216523,0.13375555477798384,0.13619255288120999,0.13857306948943868,0.14072014647046857,0.14325985985448492,0.14573973149009703,0.14818081877966413,0.15104441792368542,0.15417380344504411,0.15754543532712795,0.16090946619669111,0.16437113869523323,0.16831157473920919,0.17216934364465597,0.17622464476540067,0.18014988587679576,0.18407517129823159,0.18805490724477275,0.19176576694958281,0.19518749888764306,0.19854431871758604,0.20175279399108967,0.20491731763638374,0.2079374436507386,0.2108379079863105,0.21326227253793173]
["y","Newry, Mourne & Down","N09000010",0.12099449670192421,0.12210937903267434,0.12287477221138783,0.12356430644957718,0.12396776626177136,0.12443846290936131,0.1244611613557603,0.12615835113885929,0.12846297125881215,0.1312010939755375,0.13434837121827764,0.13719190977079987,0.14025705117572027,0.14361784005974812,0.14663007671416178,0.1494691141404598,0.15223025432089132,0.15505874023761587,0.15837871667618253,0.16182393947817367,0.16543888801684428,0.16913326058090841,0.17311738382835112,0.17706829951608796,0.18117726464989481,0.1855586887926787,0.19019354435261135,0.19500124372953029,0.19997525760442064,0.20485245699867688,0.20943370229182934,0.2138957312273039,0.21842642776249799,0.22233238880864065,0.22577800050112753,0.22924920908972965,0.23218624990682535,0.23473397673843108,0.23691098831219407]
["y","Ards & North Down","N09000011",0.1530232216048516,0.15382361948894127,0.15480907302026273,0.15606446140797287,0.15638527783069375,0.15741295736474512,0.16007149981218347,0.16365618589288711,0.16837329710748569,0.17351358949130452,0.17809013463486745,0.18384008830414181,0.18977416899264146,0.19572471522373694,0.19939293563480417,0.20333598591416918,0.20831006857092668,0.21236286761486597,0.21639473093331338,0.22018770874668026,0.22447029626182721,0.22921490212586823,0.23430445497161986,0.23909036549356116,0.24423055620515219,0.24977260994616388,0.25518930766255532,0.26093651270788731,0.26674760704671852,0.27244022072348251,0.27752228885373359,0.28268577247242704,0.28792723568004813,0.29264907291967351,0.29677240870527483,0.30086164451009356,0.30435238077631732,0.30746018130542374,0.30987769530743037]
["x","Antrim & Newtownabbey","N09000001",0,5.762659210934995E-3,1.2395153774464207E-2,1.7917054986020586E-2,2.7881329605467631E-2,3.4607020813917311E-2,4.656725691208452E-2,5.7176141658900281E-2,6.7272444858651692E-2,7.2103137620378899E-2,7.6817334575955298E-2,8.0747126436781613E-2,8.3690587138862904E-2,8.7030133581857738E-2,9.0921093507300377E-2,9.5309102205654028E-2,9.9068033550792078E-2,0.10286579683131403,0.10632183908045967,0.10952159055607336,0.11248058403230821,0.11534638086362214,0.11801025163094137,0.12028580304442382,0.12247592420006215,0.12439422180801496,0.12600186393289836,0.12732991612301947,0.1284405094749923,0.12924044734389573,0.12990835663249456,0.13027337682510098,0.13056849953401684,0.13059956508232373,0.13043647095371225,0.13024231127679409,0.12984622553588077,0.12939577508543021,0.12882106244175207]
["x","Armagh City, Banbridge & Craigavon","N09000002",0,7.6300748804072338E-3,1.6703216789573538E-2,2.735009715136294E-2,4.4990739373004462E-2,6.352903746292915E-2,8.2328678400581667E-2,9.9929551058438593E-2,0.11470110332132677,0.12605815446498569,0.13796629813537553,0.14989716727078517,0.15761814401127183,0.16871953367345771,0.18057086368129815,0.19456406876725718,0.2074266819684798,0.21987455543309053,0.23211789971252283,0.24402036201665767,0.25585464792573309,0.2675241742134149,0.27902894087970265,0.2904314429534014,0.30168622950447133,0.31261717817900858,0.32348563182474122,0.33400184076266659,0.34422830002158911,0.35451725430931624,0.3644141943254513,0.37420886974899714,0.38407740293385761,0.39374140693353943,0.40333155317190683,0.41285352301521461,0.42233572329473801,0.43190882543434039,0.4414592021089232]
["x","Belfast","N09000003",0,-6.8148283363000939E-4,-4.6213054655531716E-3,-7.3837448090174895E-3,-9.7719770608010181E-3,-8.2447253532910159E-3,-3.9915423112611981E-3,4.128447344802888E-3,9.3338809534675438E-3,1.4584949573312578E-2,1.5820137209267005E-2,1.6023973592540264E-2,1.9586546798703974E-2,2.4749387730266692E-2,3.1068315611737285E-2,3.3112764112627202E-2,3.8007879645263865E-2,4.2014633626918485E-2,4.5610672507948147E-2,4.8780784617958872E-2,5.1473250277612959E-2,5.4211350948447645E-2,5.6660429881805419E-2,5.906387380398237E-2,6.1166126652367758E-2,6.3143643803525995E-2,6.4883858896545465E-2,6.6392856599583272E-2,6.7822753616574527E-2,6.9064025920686278E-2,7.0207943534279504E-2,7.1287972132219934E-2,7.2155037344650896E-2,7.3012975554845649E-2,7.3873956099119287E-2,7.4610200946165994E-2,7.526734510716615E-2,7.5945785606717386E-2,7.6505575077199239E-2]
["x","Causeway Coast & Glens","N09000004",0,1.1060027098208192E-2,2.1145736599327059E-2,2.9191468631540429E-2,3.7800478024571094E-2,4.6158296162102097E-2,5.3290605447044337E-2,5.8078463013990556E-2,6.2736919025073501E-2,6.6474340432657986E-2,7.2563825414465599E-2,7.657527364623129E-2,7.8592415546455241E-2,8.3189976707719993E-2,8.9621995219754336E-2,9.2491665017431224E-2,9.6312816843515447E-2,9.94032304717829E-2,0.10266110493705005,0.10515779377959111,0.107791496034223,0.10993803949031,0.11196279324676106,0.11367546089789449,0.11494664088784701,0.11623304459025374,0.11700945392543427,0.11764123799229687,0.11793810038515984,0.11816645607197773,0.11800660709120536,0.1176564617047513,0.11713885548129777,0.11633961057743547,0.11544141154261878,0.11423112640248445,0.11299800569366836,0.11151369372935283,0.10981624979067406]
["x","Derry City & Strabane","N09000005",0,3.2682010986717636E-3,5.6950142549196947E-3,8.5599054307767819E-3,1.1383074890480405E-2,1.4220151588901997E-2,2.0388011960225327E-2,2.5631040956818119E-2,2.950420693971223E-2,3.0164800778805345E-2,3.0463806411237027E-2,3.3439955496836093E-2,3.3530352548501563E-2,3.7466101105625427E-2,3.937834642931648E-2,4.4030317780404671E-2,4.3835616438356206E-2,4.5859119671789239E-2,4.7618385369584848E-2,4.9106459912384492E-2,5.0365065016340971E-2,5.1310757249148242E-2,5.2179959669007792E-2,5.2791878172588902E-2,5.3076976566302836E-2,5.3188234476044816E-2,5.3021347611431846E-2,5.26041304498992E-2,5.1999165565676853E-2,5.1171684861970546E-2,5.0177317293651269E-2,4.8995202002642291E-2,4.7527988317919379E-2,4.6053821013837704E-2,4.4315416174118605E-2,4.2563104095681759E-2,4.0671719630067438E-2,3.8627355538557895E-2,3.6499548014741645E-2]
["x","Fermanagh & Omagh","N09000006",0,8.6240319240480368E-3,1.4950213236754273E-2,2.053881287174586E-2,2.6808257132320268E-2,3.3976038051649615E-2,4.3441669582320763E-2,5.4306815065578551E-2,5.9072727444657636E-2,6.7781864946903525E-2,7.3285359003697259E-2,8.0178910837722661E-2,8.145549451069023E-2,8.7384516458473227E-2,9.0401036396818846E-2,9.5015649970213056E-2,0.10442454444875215,0.11029682934440332,0.11594216603152696,0.12120925570443775,0.12620211629204459,0.13108150277538755,0.13570557252413695,0.14000813231080556,0.14421613034392111,0.14808370606424526,0.15182835150495033,0.15516638140537675,0.1583814810261841,0.16121833363277882,0.1637998695047802,0.1662868436232281,0.16869816833883378,0.17070287751416058,0.17265084963735577,0.17441915442879963,0.17603616041455883,0.17739784966572425,0.17866497716333662]
["x","Lisburn & Castlereagh","N09000007",0,1.3805835373439379E-3,3.3390857647388472E-3,9.4634185495845458E-3,1.972950194646228E-2,2.889593450254857E-2,3.687442308464095E-2,4.8151864189107885E-2,6.2615884737327931E-2,7.4840470361600575E-2,8.5845005417987785E-2,9.4120479993578643E-2,9.8109724284624944E-2,0.11271019785688496,0.12537624914716861,0.13321025805674847,0.14663081430348757,0.15743468314805154,0.16802985913231927,0.17856082192880374,0.18889111851346474,0.19926957498896325,0.20934301882249073,0.21937632941365326,0.22919292049604678,0.23864028574868557,0.24779066500782587,0.25649957860095518,0.26496769273989651,0.27317092747923111,0.28100493638881074,0.28868643897740509,0.29617530200264874,0.30342336557370464,0.31067142914476054,0.31763856001926394,0.32459766424529435,0.33145242204117675,0.33835533972789666]
["x","Mid & East Antrim","N09000008",0,6.5044095031854265E-3,1.3565891472868241E-2,1.940338323447266E-2,2.7681009321156136E-2,3.584879013275577E-2,4.5648557888460006E-2,5.2702193767065308E-2,5.7449078868907488E-2,6.0454131751561446E-2,6.2086118695665826E-2,6.579731977528791E-2,6.7044848256598621E-2,7.2105577001537746E-2,7.6052160813482761E-2,8.1356118381822107E-2,8.4329786900166237E-2,8.7813451338543125E-2,9.1171578319681146E-2,9.4412013934657812E-2,9.7220914540375958E-2,0.1002024291497976,0.1028857922982771,0.10553777108244677,0.10786806013244199,0.10987665944826297,0.11168126039607063,0.1132661707937106,0.11445093054640187,0.11543169193107983,0.11646737595330015,0.11693029532686805,0.1172049085145781,0.11745598342905561,0.11745598342905561,0.11738536860935889,0.11704798669302963,0.11660860559269381,0.11612999403697088]
["x","Mid Ulster","N09000009",0,9.2517966283833797E-3,1.8570756934649824E-2,2.9661159245080171E-2,4.8466989052320608E-2,7.1781180737457095E-2,0.10054402579085231,0.12159144334743766,0.13681241184767279,0.15203338034790792,0.16706125327422927,0.17836154207804422,0.18652192894082886,0.19966921888642619,0.2089629928134864,0.22060749546645164,0.23807844717576732,0.2508227550540667,0.26318087178453897,0.27534589294109746,0.28735140036268381,0.29890355295855997,0.31053966015179002,0.32190711263348781,0.33308986500100746,0.3440291490362013,0.3548257102558936,0.36542917590167234,0.37566324131909457,0.3857797703002217,0.39569480824769965,0.40559305527570699,0.41514708845456383,0.42454160789844853,0.43405366377862853,0.44337262408489497,0.45264960709248436,0.46205252199610447,0.47129592316475244]
["x","Newry, Mourne & Down","N09000010",0,8.183391228549608E-3,1.7362059768679439E-2,3.0795050934780077E-2,4.3759676307195905E-2,5.8526208969204907E-2,7.7462498211102959E-2,9.2977115126914089E-2,0.10359991153090564,0.11314286457723477,0.12066924267853185,0.12987393154053306,0.13727671311294132,0.14101062930148456,0.1472945370334231,0.15670738847039534,0.16713503246035155,0.17609252826457467,0.18491341737897304,0.19349361851606095,0.20182012151490314,0.21006856354813119,0.21818039889153429,0.225973485292013,0.23364297516360288,0.24107828213835014,0.24828591129672284,0.2552723677191886,0.26197910568153726,0.26845166074704352,0.27471605323757853,0.28081781871641742,0.28665287589607491,0.29248793307573218,0.29808880735854704,0.3036311359171513,0.30904986794686651,0.31435150852816052,0.31962712878758315]
["x","Ards & North Down","N09000011",0,4.2725613303111754E-3,5.7836706584024622E-3,9.0465969951658565E-3,1.7879231607593082E-2,2.6270568805621952E-2,3.2408614660434987E-2,3.6473899932468079E-2,4.3454422669314541E-2,4.6530131921181717E-2,4.9371819816928397E-2,5.4012128992571462E-2,5.4032187965953327E-2,5.59779083839822E-2,6.176826536684521E-2,6.7090579637467451E-2,6.57800600431937E-2,6.902292740657523E-2,7.2031773413836708E-2,7.5033933096637417E-2,7.7668344934106237E-2,8.0068735415454784E-2,8.2576107088172535E-2,8.4648867670952699E-2,8.6487606897612368E-2,8.7971970927861243E-2,8.9088587112778228E-2,8.9931063994811433E-2,9.0425852004894391E-2,9.0539519520724365E-2,9.0445910978276034E-2,9.0017986212798995E-2,8.944964863364957E-2,8.8687407645143379E-2,8.7597536758068806E-2,8.6393998355164259E-2,8.5050047138587548E-2,8.3498819863732754E-2,8.1907474642114453E-2]
[]
[{"$f":"\"Local Government District population (mid-\"&2000+$A$520&\")\"","v":"Local Government District population (mid-2001)"}]

{"sheet":"Landing","index":1,"n_rows":28,"n_cols":2,"rows_kept":28,"cut":false,"hidden":false,"merged":[[3,1,4,27],[7,1,8,15],[29,1,30,15],[10,1,10,15],[12,1,13,15],[9,1,9,15],[15,1,16,15],[18,1,19,15],[21,1,22,15],[24,1,25,15],[27,1,28,15]]}
[]
[null,"Population Statistics Analysis Package"]
[]
[null,"This package is a macro enabled Excel workbook which provides the functionality to explore population estimates and projections from 1971 through to 2063. It allows users to select relevant years of interest or population sub-groups in order to return or chart the relevant statistics."]
[]
[]
[]
[null,"The following functionality is provided:"]
[]
[null,"Population Comparison:"]
[null,"Provides the functionality to select years of interest in order to return information relating to population by sex and age."]
[null,"Population Proportion"]
[null,"Allows users to select years of interest and population sub-groups (by age) in order to update the chart which shows the proportion of the overall popualtion in each year which is made up by the selected sub-groups."]
[]
[null,"Population Pyramid"]
[null,"Allows users to select years of interest to return information relating to the age/sex breakdown of the poppulation in the form of a population pyramid.  The pyramid can be played to visualise how the structure of the population changes over a time series."]
[]
[null,"Dependency Ratios"]
[null,"Users can select years of interest and population sub-groups (by age) in order to update the charts to show the dependency ratios. Dependency ratios relate to the ratio between one population age group and another."]
[]
[null,"Popuilation Share"]
[null,"This chart provides the population share that Northern Ireland has of a number of regions in the UK.  Users can select the years of interest and the region that they are interested in."]
[]
[null,"Households"]
[null,"Allows users to select years of interest and household sub-categories in order to update the chart.  The source of the information is the most recently available Household Projections."]
[]
[null,"LGDs"]
[null,"Provides the functionality to chart information relating to the growth and ageing of Northern Ireland's Local Government Districts (LGDs).  The information can be played across the time series to visualise the changes."]

{"sheet":"Population Comparison","index":2,"n_rows":22,"n_cols":19,"rows_kept":22,"cut":false,"hidden":false,"merged":[[6,5,7,5],[19,5,20,5]]}
[]
[null,"Population by age and gender"]
[null,"This section allows you to enter years of reference (current, past and future) in order to obtain population figures."]
[null,"Main age groups of interest are provided but custom age groups are also available to select below."]
[]
[]
[null,"Select current year:",null,null,null,{"$f":"Data!$B$312","v":"All"},{"$f":"Data!B309","v":2063},null,{"$f":"Data!B310","v":2062},null,{"$f":"Data!B311","v":2063},null,null,{"$f":"G7&\" to \"&I7","v":"2063 to 2062"},null,{"$f":"I7&\" to \"&K7","v":"2062 to 2063"},null,{"$f":"G7&\" to \"&K7","v":"2063 to 2063"}]
[null,null,null,null,null,null,"Population","Proportion","Population","Proportion","Population","Proportion",null,"Change","% change","Change","% change","Change","% change"]
[null,"Select previous year:",null,null,null,"Aged 0-15",{"$f":"OFFSET(Data!$B$276,MATCH(Data!$B$312,Data!$A$277:$A$300,0),Data!$B$305)","v":339449},{"$f":"G9/G$13","v":0.17208115136798455},{"$f":"OFFSET(Data!$B$276,MATCH(Data!$B$312,Data!$A$277:$A$300,0),Data!$B$306)","v":341610},{"$f":"I9/I$13","v":0.17295202645643012},{"$f":"OFFSET(Data!$B$276,MATCH(Data!$B$312,Data!$A$277:$A$300,0),Data!$B$307)","v":339449},{"$f":"K9/K$13","v":0.17208115136798455},null,{"$f":"IF(G$7<=I$7,I9-G9,\"invalid\")","v":"invalid"},{"$f":"IF(N9<>\"invalid\",(I9/G9-1),\"invalid\")","v":"invalid"},{"$f":"IF(I$7<=K$7,K9-I9,\"invalid\")","v":-2161},{"$f":"IF(P9<>\"invalid\",(K9/I9-1),\"invalid\")","v":-6.3259272269546862E-3},{"$f":"IF(G$7<=K$7,K9-G9,\"invalid\")","v":0},{"$f":"IF(R9<>\"invalid\",(K9/G9-1),\"invalid\")","v":0}]
[null,null,null,null,null,"Aged 16-64",{"$f":"OFFSET(Data!$B$276,MATCH(Data!$B$312,Data!$A$277:$A$300,0)+1,Data!$B$305)","v":1095623},{"$f":"G10/G$13","v":0.55541794880893847},{"$f":"OFFSET(Data!$B$276,MATCH(Data!$B$312,Data!$A$277:$A$300,0)+1,Data!$B$306)","v":1096617},0.55520076226272952,{"$f":"OFFSET(Data!$B$276,MATCH(Data!$B$312,Data!$A$277:$A$300,0)+1,Data!$B$307)","v":1095623},{"$f":"K10/K$13","v":0.55541794880893847},null,{"$f":"IF(G$7<=I$7,I10-G10,\"invalid\")","v":"invalid"},{"$f":"IF(N10<>\"invalid\",(I10/G10-1),\"invalid\")","v":"invalid"},{"$f":"IF(I$7<=K$7,K10-I10,\"invalid\")","v":-994},{"$f":"IF(P10<>\"invalid\",(K10/I10-1),\"invalid\")","v":-9.0642402953811096E-4},{"$f":"IF(G$7<=K$7,K10-G10,\"invalid\")","v":0},{"$f":"IF(R10<>\"invalid\",(K10/G10-1),\"invalid\")","v":0}]
[null,"Select future year:",null,null,null,"Aged 65+",{"$f":"OFFSET(Data!$B$276,MATCH(Data!$B$312,Data!$A$277:$A$300,0)+2,Data!$B$305)","v":537538},0.27250089982307701,{"$f":"OFFSET(Data!$B$276,MATCH(Data!$B$312,Data!$A$277:$A$300,0)+2,Data!$B$306)","v":536945},0.27184721128084033,{"$f":"OFFSET(Data!$B$276,MATCH(Data!$B$312,Data!$A$277:$A$300,0)+2,Data!$B$307)","v":537538},{"$f":"K11/K$13","v":0.27250089982307701},null,"invalid","invalid",593,1.1043961672052571E-3,0,0]
[null,null,null,null,null,"Aged 85+",{"$f":"OFFSET(Data!$B$276,MATCH(Data!$B$312,Data!$A$277:$A$300,0)+3,Data!$B$305)","v":117548},5.9590086230932621E-2,{"$f":"OFFSET(Data!$B$276,MATCH(Data!$B$312,Data!$A$277:$A$300,0)+3,Data!$B$306)","v":117415},5.944545588941115E-2,{"$f":"OFFSET(Data!$B$276,MATCH(Data!$B$312,Data!$A$277:$A$300,0)+3,Data!$B$307)","v":117548},{"$f":"K12/K$13","v":5.9590086230932621E-2},null,"invalid","invalid",133,1.1327343184430738E-3,0,0]
[null,"Select gender:",null,null,null,"All persons",{"$f":"OFFSET(Data!$B$276,MATCH(Data!$B$312,Data!$A$277:$A$300,0)+4,Data!$B$305)","v":1972610},1,{"$f":"OFFSET(Data!$B$276,MATCH(Data!$B$312,Data!$A$277:$A$300,0)+4,Data!$B$306)","v":1975172},1,{"$f":"OFFSET(Data!$B$276,MATCH(Data!$B$312,Data!$A$277:$A$300,0)+4,Data!$B$307)","v":1972610},{"$f":"K13/K$13","v":1},null,"invalid","invalid",-2562,-1.2971022270465982E-3,0,0]
[null,null,null,null,null,"Median age",{"$f":"OFFSET(Data!$B$276,MATCH(Data!$B$312,Data!$A$277:$A$300,0)+5,Data!$B$305)","v":45.780378229999997},null,{"$f":"OFFSET(Data!$B$276,MATCH(Data!$B$312,Data!$A$277:$A$300,0)+5,Data!$B$306)","v":45.670519990000003},null,{"$f":"OFFSET(Data!$B$276,MATCH(Data!$B$312,Data!$A$277:$A$300,0)+5,Data!$B$307)","v":45.780378229999997},null,null,{"$f":"IF(G7<=I7,I14-G14,\"invalid\")","v":"invalid"},null,{"$f":"IF(I7<=K7,K14-I14,\"invalid\")","v":0.10985823999999411},null,{"$f":"IF(G7<=K7,K14-G14,\"invalid\")","v":0}]
[]
[null,"Custom age selection"]
[null,"This section allows you to choose your own custom ages for which the population information is provided."]
[null,"Simply select the lower and upper bound of your age band (note that 90 refers to 90+)"]
[]
[null,"Select lower bound:",null,null,null,{"$f":"Data!$B$312","v":"All"},{"$f":"G7","v":2063},null,{"$f":"I7","v":2062},null,{"$f":"K7","v":2063},null,null,{"$f":"G20&\" to \"&I20","v":"2063 to 2062"},null,{"$f":"I20&\" to \"&K20","v":"2062 to 2063"},null,{"$f":"G20&\" to \"&K20","v":"2063 to 2063"}]
[null,null,null,null,null,null,"Population","Proportion","Population","Proportion","Population","Proportion",null,"Change","% change","Change","% change","Change","% change"]
[null,"Select upper bound:",null,null,null,{"$f":"IF(Data!B316<=Data!B317,IF(Data!B317=90,\"Aged \"&Data!B316&\"+\",\"Aged \"&Data!B316&\"-\"&Data!B317),\"invalid\")","v":"Aged 12+"},{"$f":"IF(Data!$B$315>=Data!$B$314,SUM(OFFSET(Data!$B$1,MATCH(Data!$B$312,Data!$A$2:$A$274,0)+Data!$B$314-1,Data!$B$305,Data!$B$315-Data!$B$314+1,1)),\"invalid\")","v":1723657},{"$f":"IF(G22<>\"invalid\",G22/G$13,\"invalid\")","v":0.87379512422627892},{"$f":"IF(Data!$B$315>=Data!$B$314,SUM(OFFSET(Data!$B$1,MATCH(Data!$B$312,Data!$A$2:$A$274,0)+Data!$B$314-1,Data!$B$306,Data!$B$315-Data!$B$314+1,1)),\"invalid\")","v":1724769},{"$f":"IF(I22<>\"invalid\",I22/I$13,\"invalid\")","v":0.87322471156942283},{"$f":"IF(Data!$B$315>=Data!$B$314,SUM(OFFSET(Data!$B$1,MATCH(Data!$B$312,Data!$A$2:$A$274,0)+Data!$B$314-1,Data!$B$307,Data!$B$315-Data!$B$314+1,1)),\"invalid\")","v":1723657},{"$f":"IF(K22<>\"invalid\",K22/K$13,\"invalid\")","v":0.87379512422627892},null,{"$f":"IF(AND(G22<>\"invalid\",G20<=I20),I22-G22,\"invalid\")","v":"invalid"},{"$f":"IF(N22<>\"invalid\",(I22/G22-1),\"invalid\")","v":"invalid"},{"$f":"IF(AND(I22<>\"invalid\",I20<=K20),K22-I22,\"invalid\")","v":-1112},{"$f":"IF(P22<>\"invalid\",(K22/I22-1),\"invalid\")","v":-6.4472401811488389E-4},{"$f":"IF(AND(G22<>\"invalid\",G20<=K20),K22-G22,\"invalid\")","v":0},{"$f":"IF(R22<>\"invalid\",(K22/G22-1),\"invalid\")","v":0}]

{"sheet":"Population Proportion","index":3,"n_rows":24,"n_cols":4,"rows_kept":24,"cut":false,"hidden":false,"merged":[]}
[]
[null,"Population Proportion"]
[null,"The following chart displays the time series for selected age groups as a proportion of the population.  Simply select the years of interest, the gender (Males, Females or All persons) and the age groups of interest."]
[null,"Alternatively you can define a custom age band by checking the \"custom\" box and entering lower and upper bounds of your age group of interest (use the same value in the lower and upper bound for single years of age)."]
[]
[null,"Select start year:"]
[]
[null,"Select end year:"]
[]
[null,"Select gender:"]
[]
[null,"Select age group:"]
[null,"(select any: check on or off)"]
[null,null,"Children (aged 0-15)"]
[null,null,"Aged 16-39"]
[null,null,"Aged 40-64"]
[null,null,"Aged 16-64"]
[null,null,"Aged 60+"]
[null,null,"Aged 65+"]
[null,null,"Custom"]
[null,null,"Enter lower bound:",0]
[null,null,"Enter upper bound:",4]
[null,null,null,{"$f":"IF(AND(D21<>\"\",D22<>\"\",D22<D21),\"Invalid age band\",\"\")","v":""}]
[null,null,null,{"$f":"IF(AND(D21<>\"\",D22<>\"\",D22<D21),\"Please try again\",\"\")","v":""}]

{"sheet":"Population Pyramid","index":4,"n_rows":23,"n_cols":13,"rows_kept":23,"cut":false,"hidden":false,"merged":[[13,2,14,2],[13,3,14,3],[13,1,14,1]]}
[]
[null,"Population pyramids"]
[null,"This section shows how the age-sex distribution of the population changes over time in the form of population pyramids."]
[null,"It also provides population data for some pre-defined and custom age groups in the table."]
[null,"For custom ages simply enter the upper and lower bounds of the age band (0-90; 90 = 90 and above)"]
[null,"Use the \"Play\", \"Stop\" and \"Reset\" buttons to control the pyramid."]
[]
[null,"Select reference year:"]
[]
[null,"Select start year:"]
[]
[null,"Select end year:"]
[]
[null,null,"Lower bound","Upper bound",{"$f":"Data!$B$323","v":2036},null,null,{"$f":"Data!$B$322","v":2018},null,null,{"$f":"Data!$B$324","v":2043}]
[null,null,null,null,"All persons","% Male","% Female","All persons","% Male","% Female","All persons","% Male","% Female"]
[null,{"$f":"IF(AND(C16<>\"\",D16<>\"\"),IF(D16>C16,IF(D16=90,\"Aged \"&C16&\"+\",\"Aged \"&C16&\"-\"&D16),IF(C16=D16,\"Aged \"&C16,\"invalid\")),\"\")","v":"Aged 0-15"},0,15,{"$f":"IF(AND($C16<>\"\",$D16<>\"\",$D16>=$C16),SUM(OFFSET(Data!$B$183,MATCH($C16,Data!$G$306:$G$396,0),Data!$B$320,$D16-$C16+1,1)),\"\")","v":351180},{"$f":"IF(AND($C16<>\"\",$D16<>\"\",$D16>=$C16),SUM(OFFSET(Data!$B$1,MATCH($C16,Data!$G$306:$G$396,0),Data!$B$320,$D16-$C16+1,1))/$E16,\"\")","v":0.51209351329802377},{"$f":"IF(AND($C16<>\"\",$D16<>\"\",$D16>=$C16),SUM(OFFSET(Data!$B$92,MATCH($C16,Data!$G$306:$G$396,0),Data!$B$320,$D16-$C16+1,1))/$E16,\"\")","v":0.48790648670197617},{"$f":"IF(AND($C16<>\"\",$D16<>\"\",$D16>=$C16),SUM(OFFSET(Data!$B$183,MATCH($C16,Data!$G$306:$G$396,0),Data!$B$319,$D16-$C16+1,1)),\"\")","v":393510},{"$f":"IF(AND($C16<>\"\",$D16<>\"\",$D16>=$C16),SUM(OFFSET(Data!$B$1,MATCH($C16,Data!$G$306:$G$396,0),Data!$B$319,$D16-$C16+1,1))/$H16,\"\")","v":0.51273156971868572},{"$f":"IF(AND($C16<>\"\",$D16<>\"\",$D16>=$C16),SUM(OFFSET(Data!$B$92,MATCH($C16,Data!$G$306:$G$396,0),Data!$B$319,$D16-$C16+1,1))/$H16,\"\")","v":0.48726843028131434},{"$f":"IF(AND($C16<>\"\",$D16<>\"\",$D16>=$C16),SUM(OFFSET(Data!$B$183,MATCH($C16,Data!$G$306:$G$396,0),Data!$B$321,$D16-$C16+1,1)),\"\")","v":351087},{"$f":"IF(AND($C16<>\"\",$D16<>\"\",$D16>=$C16),SUM(OFFSET(Data!$B$1,MATCH($C16,Data!$G$306:$G$396,0),Data!$B$321,$D16-$C16+1,1))/$K16,\"\")","v":0.51212377558838695},{"$f":"IF(AND($C16<>\"\",$D16<>\"\",$D16>=$C16),SUM(OFFSET(Data!$B$92,MATCH($C16,Data!$G$306:$G$396,0),Data!$B$321,$D16-$C16+1,1))/$K16,\"\")","v":0.4878762244116131}]
[null,{"$f":"IF(AND(C17<>\"\",D17<>\"\"),IF(D17>C17,IF(D17=90,\"Aged \"&C17&\"+\",\"Aged \"&C17&\"-\"&D17),IF(C17=D17,\"Aged \"&C17,\"invalid\")),\"\")","v":"Aged 16-39"},16,39,{"$f":"IF(AND($C17<>\"\",$D17<>\"\",$D17>=$C17),SUM(OFFSET(Data!$B$183,MATCH($C17,Data!$G$306:$G$396,0),Data!$B$320,$D17-$C17+1,1)),\"\")","v":561371},{"$f":"IF(AND($C17<>\"\",$D17<>\"\",$D17>=$C17),SUM(OFFSET(Data!$B$1,MATCH($C17,Data!$G$306:$G$396,0),Data!$B$320,$D17-$C17+1,1))/$E17,\"\")","v":0.51631630419098951},{"$f":"IF(AND($C17<>\"\",$D17<>\"\",$D17>=$C17),SUM(OFFSET(Data!$B$92,MATCH($C17,Data!$G$306:$G$396,0),Data!$B$320,$D17-$C17+1,1))/$E17,\"\")","v":0.48368369580901044},{"$f":"IF(AND($C17<>\"\",$D17<>\"\",$D17>=$C17),SUM(OFFSET(Data!$B$183,MATCH($C17,Data!$G$306:$G$396,0),Data!$B$319,$D17-$C17+1,1)),\"\")","v":579513},{"$f":"IF(AND($C17<>\"\",$D17<>\"\",$D17>=$C17),SUM(OFFSET(Data!$B$1,MATCH($C17,Data!$G$306:$G$396,0),Data!$B$319,$D17-$C17+1,1))/$H17,\"\")","v":0.5017385287301579},{"$f":"IF(AND($C17<>\"\",$D17<>\"\",$D17>=$C17),SUM(OFFSET(Data!$B$92,MATCH($C17,Data!$G$306:$G$396,0),Data!$B$319,$D17-$C17+1,1))/$H17,\"\")","v":0.4982614712698421},{"$f":"IF(AND($C17<>\"\",$D17<>\"\",$D17>=$C17),SUM(OFFSET(Data!$B$183,MATCH($C17,Data!$G$306:$G$396,0),Data!$B$321,$D17-$C17+1,1)),\"\")","v":557553},{"$f":"IF(AND($C17<>\"\",$D17<>\"\",$D17>=$C17),SUM(OFFSET(Data!$B$1,MATCH($C17,Data!$G$306:$G$396,0),Data!$B$321,$D17-$C17+1,1))/$K17,\"\")","v":0.51565860106572825},{"$f":"IF(AND($C17<>\"\",$D17<>\"\",$D17>=$C17),SUM(OFFSET(Data!$B$92,MATCH($C17,Data!$G$306:$G$396,0),Data!$B$321,$D17-$C17+1,1))/$K17,\"\")","v":0.48434139893427169}]
[null,"Aged 40-64",40,64,{"$f":"IF(AND($C18<>\"\",$D18<>\"\",$D18>=$C18),SUM(OFFSET(Data!$B$183,MATCH($C18,Data!$G$306:$G$396,0),Data!$B$320,$D18-$C18+1,1)),\"\")","v":609048},{"$f":"IF(AND($C18<>\"\",$D18<>\"\",$D18>=$C18),SUM(OFFSET(Data!$B$1,MATCH($C18,Data!$G$306:$G$396,0),Data!$B$320,$D18-$C18+1,1))/$E18,\"\")","v":0.4926163455097135},{"$f":"IF(AND($C18<>\"\",$D18<>\"\",$D18>=$C18),SUM(OFFSET(Data!$B$92,MATCH($C18,Data!$G$306:$G$396,0),Data!$B$320,$D18-$C18+1,1))/$E18,\"\")","v":0.50738365449028644},{"$f":"IF(AND($C18<>\"\",$D18<>\"\",$D18>=$C18),SUM(OFFSET(Data!$B$183,MATCH($C18,Data!$G$306:$G$396,0),Data!$B$319,$D18-$C18+1,1)),\"\")","v":600421},{"$f":"IF(AND($C18<>\"\",$D18<>\"\",$D18>=$C18),SUM(OFFSET(Data!$B$1,MATCH($C18,Data!$G$306:$G$396,0),Data!$B$319,$D18-$C18+1,1))/$H18,\"\")","v":0.49005281294291836},{"$f":"IF(AND($C18<>\"\",$D18<>\"\",$D18>=$C18),SUM(OFFSET(Data!$B$92,MATCH($C18,Data!$G$306:$G$396,0),Data!$B$319,$D18-$C18+1,1))/$H18,\"\")","v":0.50994718705708164},{"$f":"IF(AND($C18<>\"\",$D18<>\"\",$D18>=$C18),SUM(OFFSET(Data!$B$183,MATCH($C18,Data!$G$306:$G$396,0),Data!$B$321,$D18-$C18+1,1)),\"\")","v":599175},{"$f":"IF(AND($C18<>\"\",$D18<>\"\",$D18>=$C18),SUM(OFFSET(Data!$B$1,MATCH($C18,Data!$G$306:$G$396,0),Data!$B$321,$D18-$C18+1,1))/$K18,\"\")","v":0.5009087495306046},{"$f":"IF(AND($C18<>\"\",$D18<>\"\",$D18>=$C18),SUM(OFFSET(Data!$B$92,MATCH($C18,Data!$G$306:$G$396,0),Data!$B$321,$D18-$C18+1,1))/$K18,\"\")","v":0.4990912504693954}]
[null,"Aged 65+",65,90,{"$f":"IF(AND($C19<>\"\",$D19<>\"\",$D19>=$C19),SUM(OFFSET(Data!$B$183,MATCH($C19,Data!$G$306:$G$396,0),Data!$B$320,$D19-$C19+1,1)),\"\")","v":452706},{"$f":"IF(AND($C19<>\"\",$D19<>\"\",$D19>=$C19),SUM(OFFSET(Data!$B$1,MATCH($C19,Data!$G$306:$G$396,0),Data!$B$320,$D19-$C19+1,1))/$E19,\"\")","v":0.46438085644988136},{"$f":"IF(AND($C19<>\"\",$D19<>\"\",$D19>=$C19),SUM(OFFSET(Data!$B$92,MATCH($C19,Data!$G$306:$G$396,0),Data!$B$320,$D19-$C19+1,1))/$E19,\"\")","v":0.53561914355011864},{"$f":"IF(AND($C19<>\"\",$D19<>\"\",$D19>=$C19),SUM(OFFSET(Data!$B$183,MATCH($C19,Data!$G$306:$G$396,0),Data!$B$319,$D19-$C19+1,1)),\"\")","v":308197},{"$f":"IF(AND($C19<>\"\",$D19<>\"\",$D19>=$C19),SUM(OFFSET(Data!$B$1,MATCH($C19,Data!$G$306:$G$396,0),Data!$B$319,$D19-$C19+1,1))/$H19,\"\")","v":0.4524151760075536},{"$f":"IF(AND($C19<>\"\",$D19<>\"\",$D19>=$C19),SUM(OFFSET(Data!$B$92,MATCH($C19,Data!$G$306:$G$396,0),Data!$B$319,$D19-$C19+1,1))/$H19,\"\")","v":0.54758482399244635},{"$f":"IF(AND($C19<>\"\",$D19<>\"\",$D19>=$C19),SUM(OFFSET(Data!$B$183,MATCH($C19,Data!$G$306:$G$396,0),Data!$B$321,$D19-$C19+1,1)),\"\")","v":481380},{"$f":"IF(AND($C19<>\"\",$D19<>\"\",$D19>=$C19),SUM(OFFSET(Data!$B$1,MATCH($C19,Data!$G$306:$G$396,0),Data!$B$321,$D19-$C19+1,1))/$K19,\"\")","v":0.46182226099962609},{"$f":"IF(AND($C19<>\"\",$D19<>\"\",$D19>=$C19),SUM(OFFSET(Data!$B$92,MATCH($C19,Data!$G$306:$G$396,0),Data!$B$321,$D19-$C19+1,1))/$K19,\"\")","v":0.53817773900037391}]
[null,"Aged 85+",85,90,{"$f":"IF(AND($C20<>\"\",$D20<>\"\",$D20>=$C20),SUM(OFFSET(Data!$B$183,MATCH($C20,Data!$G$306:$G$396,0),Data!$B$320,$D20-$C20+1,1)),\"\")","v":65184},{"$f":"IF(AND($C20<>\"\",$D20<>\"\",$D20>=$C20),SUM(OFFSET(Data!$B$1,MATCH($C20,Data!$G$306:$G$396,0),Data!$B$320,$D20-$C20+1,1))/$E20,\"\")","v":0.40983983799705448},{"$f":"IF(AND($C20<>\"\",$D20<>\"\",$D20>=$C20),SUM(OFFSET(Data!$B$92,MATCH($C20,Data!$G$306:$G$396,0),Data!$B$320,$D20-$C20+1,1))/$E20,\"\")","v":0.59016016200294552},{"$f":"IF(AND($C20<>\"\",$D20<>\"\",$D20>=$C20),SUM(OFFSET(Data!$B$183,MATCH($C20,Data!$G$306:$G$396,0),Data!$B$319,$D20-$C20+1,1)),\"\")","v":37720},{"$f":"IF(AND($C20<>\"\",$D20<>\"\",$D20>=$C20),SUM(OFFSET(Data!$B$1,MATCH($C20,Data!$G$306:$G$396,0),Data!$B$319,$D20-$C20+1,1))/$H20,\"\")","v":0.34350477200424179},{"$f":"IF(AND($C20<>\"\",$D20<>\"\",$D20>=$C20),SUM(OFFSET(Data!$B$92,MATCH($C20,Data!$G$306:$G$396,0),Data!$B$319,$D20-$C20+1,1))/$H20,\"\")","v":0.65649522799575821},{"$f":"IF(AND($C20<>\"\",$D20<>\"\",$D20>=$C20),SUM(OFFSET(Data!$B$183,MATCH($C20,Data!$G$306:$G$396,0),Data!$B$321,$D20-$C20+1,1)),\"\")","v":77854},{"$f":"IF(AND($C20<>\"\",$D20<>\"\",$D20>=$C20),SUM(OFFSET(Data!$B$1,MATCH($C20,Data!$G$306:$G$396,0),Data!$B$321,$D20-$C20+1,1))/$K20,\"\")","v":0.42101883011791302},{"$f":"IF(AND($C20<>\"\",$D20<>\"\",$D20>=$C20),SUM(OFFSET(Data!$B$92,MATCH($C20,Data!$G$306:$G$396,0),Data!$B$321,$D20-$C20+1,1))/$K20,\"\")","v":0.57898116988208703}]
[null,"Aged 0+",0,90,{"$f":"IF(AND($C21<>\"\",$D21<>\"\",$D21>=$C21),SUM(OFFSET(Data!$B$183,MATCH($C21,Data!$G$306:$G$396,0),Data!$B$320,$D21-$C21+1,1)),\"\")","v":1974305},{"$f":"IF(AND($C21<>\"\",$D21<>\"\",$D21>=$C21),SUM(OFFSET(Data!$B$1,MATCH($C21,Data!$G$306:$G$396,0),Data!$B$320,$D21-$C21+1,1))/$E21,\"\")","v":0.49634529619283746},{"$f":"IF(AND($C21<>\"\",$D21<>\"\",$D21>=$C21),SUM(OFFSET(Data!$B$92,MATCH($C21,Data!$G$306:$G$396,0),Data!$B$320,$D21-$C21+1,1))/$E21,\"\")","v":0.50365470380716248},{"$f":"IF(AND($C21<>\"\",$D21<>\"\",$D21>=$C21),SUM(OFFSET(Data!$B$183,MATCH($C21,Data!$G$306:$G$396,0),Data!$B$319,$D21-$C21+1,1)),\"\")","v":1881641},{"$f":"IF(AND($C21<>\"\",$D21<>\"\",$D21>=$C21),SUM(OFFSET(Data!$B$1,MATCH($C21,Data!$G$306:$G$396,0),Data!$B$319,$D21-$C21+1,1))/$H21,\"\")","v":0.49222992058527637},{"$f":"IF(AND($C21<>\"\",$D21<>\"\",$D21>=$C21),SUM(OFFSET(Data!$B$92,MATCH($C21,Data!$G$306:$G$396,0),Data!$B$319,$D21-$C21+1,1))/$H21,\"\")","v":0.50777007941472363},{"$f":"IF(AND($C21<>\"\",$D21<>\"\",$D21>=$C21),SUM(OFFSET(Data!$B$183,MATCH($C21,Data!$G$306:$G$396,0),Data!$B$321,$D21-$C21+1,1)),\"\")","v":1989195},{"$f":"IF(AND($C21<>\"\",$D21<>\"\",$D21>=$C21),SUM(OFFSET(Data!$B$1,MATCH($C21,Data!$G$306:$G$396,0),Data!$B$321,$D21-$C21+1,1))/$K21,\"\")","v":0.49756358728028172},{"$f":"IF(AND($C21<>\"\",$D21<>\"\",$D21>=$C21),SUM(OFFSET(Data!$B$92,MATCH($C21,Data!$G$306:$G$396,0),Data!$B$321,$D21-$C21+1,1))/$K21,\"\")","v":0.50243641271971828}]
[null,"",null,null,{"$f":"IF(AND($C22<>\"\",$D22<>\"\",$D22>=$C22),SUM(OFFSET(Data!$B$183,MATCH($C22,Data!$G$306:$G$396,0),Data!$B$320,$D22-$C22+1,1)),\"\")","v":""},{"$f":"IF(AND($C22<>\"\",$D22<>\"\",$D22>=$C22),SUM(OFFSET(Data!$B$1,MATCH($C22,Data!$G$306:$G$396,0),Data!$B$320,$D22-$C22+1,1))/$E22,\"\")","v":""},{"$f":"IF(AND($C22<>\"\",$D22<>\"\",$D22>=$C22),SUM(OFFSET(Data!$B$92,MATCH($C22,Data!$G$306:$G$396,0),Data!$B$320,$D22-$C22+1,1))/$E22,\"\")","v":""},{"$f":"IF(AND($C22<>\"\",$D22<>\"\",$D22>=$C22),SUM(OFFSET(Data!$B$183,MATCH($C22,Data!$G$306:$G$396,0),Data!$B$319,$D22-$C22+1,1)),\"\")","v":""},{"$f":"IF(AND($C22<>\"\",$D22<>\"\",$D22>=$C22),SUM(OFFSET(Data!$B$1,MATCH($C22,Data!$G$306:$G$396,0),Data!$B$319,$D22-$C22+1,1))/$H22,\"\")","v":""},{"$f":"IF(AND($C22<>\"\",$D22<>\"\",$D22>=$C22),SUM(OFFSET(Data!$B$92,MATCH($C22,Data!$G$306:$G$396,0),Data!$B$319,$D22-$C22+1,1))/$H22,\"\")","v":""},{"$f":"IF(AND($C22<>\"\",$D22<>\"\",$D22>=$C22),SUM(OFFSET(Data!$B$183,MATCH($C22,Data!$G$306:$G$396,0),Data!$B$321,$D22-$C22+1,1)),\"\")","v":""},{"$f":"IF(AND($C22<>\"\",$D22<>\"\",$D22>=$C22),SUM(OFFSET(Data!$B$1,MATCH($C22,Data!$G$306:$G$396,0),Data!$B$321,$D22-$C22+1,1))/$K22,\"\")","v":""},{"$f":"IF(AND($C22<>\"\",$D22<>\"\",$D22>=$C22),SUM(OFFSET(Data!$B$92,MATCH($C22,Data!$G$306:$G$396,0),Data!$B$321,$D22-$C22+1,1))/$K22,\"\")","v":""}]
[null,"",null,null,{"$f":"IF(AND($C23<>\"\",$D23<>\"\",$D23>=$C23),SUM(OFFSET(Data!$B$183,MATCH($C23,Data!$G$306:$G$396,0),Data!$B$320,$D23-$C23+1,1)),\"\")","v":""},{"$f":"IF(AND($C23<>\"\",$D23<>\"\",$D23>=$C23),SUM(OFFSET(Data!$B$1,MATCH($C23,Data!$G$306:$G$396,0),Data!$B$320,$D23-$C23+1,1))/$E23,\"\")","v":""},{"$f":"IF(AND($C23<>\"\",$D23<>\"\",$D23>=$C23),SUM(OFFSET(Data!$B$92,MATCH($C23,Data!$G$306:$G$396,0),Data!$B$320,$D23-$C23+1,1))/$E23,\"\")","v":""},{"$f":"IF(AND($C23<>\"\",$D23<>\"\",$D23>=$C23),SUM(OFFSET(Data!$B$183,MATCH($C23,Data!$G$306:$G$396,0),Data!$B$319,$D23-$C23+1,1)),\"\")","v":""},{"$f":"IF(AND($C23<>\"\",$D23<>\"\",$D23>=$C23),SUM(OFFSET(Data!$B$1,MATCH($C23,Data!$G$306:$G$396,0),Data!$B$319,$D23-$C23+1,1))/$H23,\"\")","v":""},{"$f":"IF(AND($C23<>\"\",$D23<>\"\",$D23>=$C23),SUM(OFFSET(Data!$B$92,MATCH($C23,Data!$G$306:$G$396,0),Data!$B$319,$D23-$C23+1,1))/$H23,\"\")","v":""},{"$f":"IF(AND($C23<>\"\",$D23<>\"\",$D23>=$C23),SUM(OFFSET(Data!$B$183,MATCH($C23,Data!$G$306:$G$396,0),Data!$B$321,$D23-$C23+1,1)),\"\")","v":""},{"$f":"IF(AND($C23<>\"\",$D23<>\"\",$D23>=$C23),SUM(OFFSET(Data!$B$1,MATCH($C23,Data!$G$306:$G$396,0),Data!$B$321,$D23-$C23+1,1))/$K23,\"\")","v":""},{"$f":"IF(AND($C23<>\"\",$D23<>\"\",$D23>=$C23),SUM(OFFSET(Data!$B$92,MATCH($C23,Data!$G$306:$G$396,0),Data!$B$321,$D23-$C23+1,1))/$K23,\"\")","v":""}]

{"sheet":"Dependency Ratios","index":5,"n_rows":6,"n_cols":10,"rows_kept":6,"cut":false,"hidden":false,"merged":[]}
[]
[null,"Dependency Ratios"]
[null,"The following charts display the dependency ratios for those aged 0-15, 65+ and 16-64."]
[null,"Simply select the years and gender of interest and then, for each chart, select a numerator and denominator of interest."]
[]
[null,"Select start year:",null,null,null,"Select end year:",null,null,null,"Select gender:"]

{"sheet":"Population Share","index":6,"n_rows":15,"n_cols":3,"rows_kept":15,"cut":false,"hidden":false,"merged":[]}
[]
[null,"Population Share"]
[null,"This section provides a time series chart showing Northern Ireland's population share of selected regions in the UK."]
[]
[]
[null,"Select start year:"]
[]
[null,"Select end year:"]
[]
[null,"Select region:"]
[null,"(select any: check on or off)"]
[null,null,"United Kindom"]
[null,null,"Great Britain"]
[null,null,"England"]
[null,null,"England & Wales"]

{"sheet":"Households","index":7,"n_rows":14,"n_cols":3,"rows_kept":14,"cut":false,"hidden":false,"merged":[]}
[]
[null,"Households"]
[null,"The following chart shows data related to the 2016-based household projections."]
[]
[null,"Select chart elements:"]
[]
[null,{"$f":"Data!$B$423&\":\"","v":"Household Size:"}]
[null,"(select any: check on or off)"]
[null,null,{"$f":"IF(Data!$B$422=1,Data!B401,IF(Data!$B$422=2,Data!B411,Data!$B$417))","v":"1 person"}]
[null,null,{"$f":"IF(Data!$B$422=1,Data!B402,IF(Data!$B$422=2,Data!B412,\"\"))","v":"2 persons"}]
[null,null,{"$f":"IF(Data!$B$422=1,Data!B403,IF(Data!$B$422=2,Data!B413,\"\"))","v":"3 persons"}]
[null,null,{"$f":"IF(Data!$B$422=1,Data!B404,IF(Data!$B$422=2,Data!B414,\"\"))","v":"4 persons"}]
[null,null,{"$f":"IF(Data!$B$422=1,Data!B405,IF(Data!$B$422=2,Data!B415,\"\"))","v":"5+ persons"}]
[null,null,{"$f":"IF(Data!$B$422=1,Data!B406,IF(Data!$B$422=2,Data!B416,\"\"))","v":"Total households"}]

{"sheet":"LGDs","index":8,"n_rows":4,"n_cols":2,"rows_kept":4,"cut":false,"hidden":false,"merged":[]}
[]
[null,"Local Government Districts"]
[null,"The following chart displays the growth of LGDs from 2001 to 2039.  The y axis is the proportion of people aged 65 and over, while the x axis represents the growth in the LGD from 2001.  The size of the bubble reflects the relative size of the LGD in terms of NI population share."]
[null,"Simply click the play button to see the change."]